Plan for OpenMRS Core 1.12.x

Build: #88 was successful

Job: Build and Test was successful

Stages & jobs

  1. Build and Test

  2. Deploy

  3. Release

    Requires a user to start manually

Build log

The build generated 5,809 lines of output.The output is too long and has been truncated to the last 1,000 lines. Download or view full build log

13-Sep-2017 20:58:41         at sun.reflect.NativeMethodAccessorImpl.invoke(NativeMethodAccessorImpl.java:57)
13-Sep-2017 20:58:41         at sun.reflect.DelegatingMethodAccessorImpl.invoke(DelegatingMethodAccessorImpl.java:43)
13-Sep-2017 20:58:41         at java.lang.reflect.Method.invoke(Method.java:606)
13-Sep-2017 20:58:41         at org.springframework.aop.support.AopUtils.invokeJoinpointUsingReflection(AopUtils.java:317)
13-Sep-2017 20:58:41         at org.springframework.aop.framework.ReflectiveMethodInvocation.invokeJoinpoint(ReflectiveMethodInvocation.java:183)
13-Sep-2017 20:58:41         at org.springframework.aop.framework.ReflectiveMethodInvocation.proceed(ReflectiveMethodInvocation.java:150)
13-Sep-2017 20:58:41         at org.openmrs.aop.LoggingAdvice.invoke(LoggingAdvice.java:121)
13-Sep-2017 20:58:41         at org.springframework.aop.framework.ReflectiveMethodInvocation.proceed(ReflectiveMethodInvocation.java:172)
13-Sep-2017 20:58:41         at org.springframework.aop.framework.adapter.MethodBeforeAdviceInterceptor.invoke(MethodBeforeAdviceInterceptor.java:51)
13-Sep-2017 20:58:41         at org.springframework.aop.framework.ReflectiveMethodInvocation.proceed(ReflectiveMethodInvocation.java:172)
13-Sep-2017 20:58:41         at org.springframework.aop.framework.adapter.MethodBeforeAdviceInterceptor.invoke(MethodBeforeAdviceInterceptor.java:51)
13-Sep-2017 20:58:41         at org.springframework.aop.framework.ReflectiveMethodInvocation.proceed(ReflectiveMethodInvocation.java:172)
13-Sep-2017 20:58:41         at org.springframework.aop.framework.JdkDynamicAopProxy.invoke(JdkDynamicAopProxy.java:204)
13-Sep-2017 20:58:41         at com.sun.proxy.$Proxy54.retirePatientIdentifierType(Unknown Source)
13-Sep-2017 20:58:41         at org.openmrs.web.controller.patient.PatientIdentifierTypeFormController.onSubmit(PatientIdentifierTypeFormController.java:95)
13-Sep-2017 20:58:41         at org.springframework.web.servlet.mvc.SimpleFormController.processFormSubmission(SimpleFormController.java:272)
13-Sep-2017 20:58:41         at org.springframework.web.servlet.mvc.AbstractFormController.handleRequestInternal(AbstractFormController.java:268)
13-Sep-2017 20:58:41         at org.springframework.web.servlet.mvc.AbstractController.handleRequest(AbstractController.java:153)
13-Sep-2017 20:58:41         at org.openmrs.web.controller.patient.PatientIdentifierTypeFormControllerTest.shouldNotRetirePatientIdentifierTypeWhenPatientIdentifierTypesAreLocked(PatientIdentifierTypeFormControllerTest.java:65)
13-Sep-2017 20:58:41         at sun.reflect.NativeMethodAccessorImpl.invoke0(Native Method)
13-Sep-2017 20:58:41         at sun.reflect.NativeMethodAccessorImpl.invoke(NativeMethodAccessorImpl.java:57)
13-Sep-2017 20:58:41         at sun.reflect.DelegatingMethodAccessorImpl.invoke(DelegatingMethodAccessorImpl.java:43)
13-Sep-2017 20:58:41         at java.lang.reflect.Method.invoke(Method.java:606)
13-Sep-2017 20:58:41         at org.junit.runners.model.FrameworkMethod$1.runReflectiveCall(FrameworkMethod.java:47)
13-Sep-2017 20:58:41         at org.junit.internal.runners.model.ReflectiveCallable.run(ReflectiveCallable.java:12)
13-Sep-2017 20:58:41         at org.junit.runners.model.FrameworkMethod.invokeExplosively(FrameworkMethod.java:44)
13-Sep-2017 20:58:41         at org.junit.internal.runners.statements.InvokeMethod.evaluate(InvokeMethod.java:17)
13-Sep-2017 20:58:41         at org.junit.internal.runners.statements.RunBefores.evaluate(RunBefores.java:26)
13-Sep-2017 20:58:41         at org.springframework.test.context.junit4.statements.RunBeforeTestMethodCallbacks.evaluate(RunBeforeTestMethodCallbacks.java:74)
13-Sep-2017 20:58:41         at org.junit.internal.runners.statements.RunAfters.evaluate(RunAfters.java:27)
13-Sep-2017 20:58:41         at org.springframework.test.context.junit4.statements.RunAfterTestMethodCallbacks.evaluate(RunAfterTestMethodCallbacks.java:83)
13-Sep-2017 20:58:41         at org.springframework.test.context.junit4.statements.SpringRepeat.evaluate(SpringRepeat.java:72)
13-Sep-2017 20:58:41         at org.springframework.test.context.junit4.SpringJUnit4ClassRunner.runChild(SpringJUnit4ClassRunner.java:231)
13-Sep-2017 20:58:41         at org.springframework.test.context.junit4.SpringJUnit4ClassRunner.runChild(SpringJUnit4ClassRunner.java:88)
13-Sep-2017 20:58:41         at org.junit.runners.ParentRunner$3.run(ParentRunner.java:238)
13-Sep-2017 20:58:41         at org.junit.runners.ParentRunner$1.schedule(ParentRunner.java:63)
13-Sep-2017 20:58:41         at org.junit.runners.ParentRunner.runChildren(ParentRunner.java:236)
13-Sep-2017 20:58:41         at org.junit.runners.ParentRunner.access$000(ParentRunner.java:53)
13-Sep-2017 20:58:41         at org.junit.runners.ParentRunner$2.evaluate(ParentRunner.java:229)
13-Sep-2017 20:58:41         at org.springframework.test.context.junit4.statements.RunBeforeTestClassCallbacks.evaluate(RunBeforeTestClassCallbacks.java:61)
13-Sep-2017 20:58:41         at org.junit.internal.runners.statements.RunAfters.evaluate(RunAfters.java:27)
13-Sep-2017 20:58:41         at org.springframework.test.context.junit4.statements.RunAfterTestClassCallbacks.evaluate(RunAfterTestClassCallbacks.java:71)
13-Sep-2017 20:58:41         at org.junit.runners.ParentRunner.run(ParentRunner.java:309)
13-Sep-2017 20:58:41         at org.springframework.test.context.junit4.SpringJUnit4ClassRunner.run(SpringJUnit4ClassRunner.java:174)
13-Sep-2017 20:58:41         at org.apache.maven.surefire.junit4.JUnit4TestSet.execute(JUnit4TestSet.java:59)
13-Sep-2017 20:58:41         at org.apache.maven.surefire.suite.AbstractDirectoryTestSuite.executeTestSet(AbstractDirectoryTestSuite.java:115)
13-Sep-2017 20:58:41         at org.apache.maven.surefire.suite.AbstractDirectoryTestSuite.execute(AbstractDirectoryTestSuite.java:102)
13-Sep-2017 20:58:41         at org.apache.maven.surefire.Surefire.run(Surefire.java:180)
13-Sep-2017 20:58:41         at sun.reflect.NativeMethodAccessorImpl.invoke0(Native Method)
13-Sep-2017 20:58:41         at sun.reflect.NativeMethodAccessorImpl.invoke(NativeMethodAccessorImpl.java:57)
13-Sep-2017 20:58:41         at sun.reflect.DelegatingMethodAccessorImpl.invoke(DelegatingMethodAccessorImpl.java:43)
13-Sep-2017 20:58:41         at java.lang.reflect.Method.invoke(Method.java:606)
13-Sep-2017 20:58:41         at org.apache.maven.surefire.booter.SurefireBooter.runSuitesInProcess(SurefireBooter.java:350)
13-Sep-2017 20:58:41         at org.apache.maven.surefire.booter.SurefireBooter.main(SurefireBooter.java:1021)
13-Sep-2017 20:58:41 ERROR - PatientServiceImpl.getDefaultIdentifierValidator(1471) |2017-09-13 20:58:41,080| Global Property patient.defaultPatientIdentifierValidator not set to an actual class.
13-Sep-2017 20:58:41 java.lang.ClassNotFoundException:
13-Sep-2017 20:58:41         at java.lang.Class.forName0(Native Method)
13-Sep-2017 20:58:41         at java.lang.Class.forName(Class.java:195)
13-Sep-2017 20:58:41         at org.openmrs.api.impl.PatientServiceImpl.getDefaultIdentifierValidator(PatientServiceImpl.java:1468)
13-Sep-2017 20:58:41         at sun.reflect.NativeMethodAccessorImpl.invoke0(Native Method)
13-Sep-2017 20:58:41         at sun.reflect.NativeMethodAccessorImpl.invoke(NativeMethodAccessorImpl.java:57)
13-Sep-2017 20:58:41         at sun.reflect.DelegatingMethodAccessorImpl.invoke(DelegatingMethodAccessorImpl.java:43)
13-Sep-2017 20:58:41         at java.lang.reflect.Method.invoke(Method.java:606)
13-Sep-2017 20:58:41         at org.springframework.aop.support.AopUtils.invokeJoinpointUsingReflection(AopUtils.java:317)
13-Sep-2017 20:58:41         at org.springframework.aop.framework.ReflectiveMethodInvocation.invokeJoinpoint(ReflectiveMethodInvocation.java:183)
13-Sep-2017 20:58:41         at org.springframework.aop.framework.ReflectiveMethodInvocation.proceed(ReflectiveMethodInvocation.java:150)
13-Sep-2017 20:58:41         at org.springframework.transaction.interceptor.TransactionInterceptor$1.proceedWithInvocation(TransactionInterceptor.java:96)
13-Sep-2017 20:58:41         at org.springframework.transaction.interceptor.TransactionAspectSupport.invokeWithinTransaction(TransactionAspectSupport.java:260)
13-Sep-2017 20:58:41         at org.springframework.transaction.interceptor.TransactionInterceptor.invoke(TransactionInterceptor.java:94)
13-Sep-2017 20:58:41         at org.springframework.aop.framework.ReflectiveMethodInvocation.proceed(ReflectiveMethodInvocation.java:172)
13-Sep-2017 20:58:41         at org.springframework.aop.framework.JdkDynamicAopProxy.invoke(JdkDynamicAopProxy.java:204)
13-Sep-2017 20:58:41         at com.sun.proxy.$Proxy53.getDefaultIdentifierValidator(Unknown Source)
13-Sep-2017 20:58:41         at sun.reflect.NativeMethodAccessorImpl.invoke0(Native Method)
13-Sep-2017 20:58:41         at sun.reflect.NativeMethodAccessorImpl.invoke(NativeMethodAccessorImpl.java:57)
13-Sep-2017 20:58:41         at sun.reflect.DelegatingMethodAccessorImpl.invoke(DelegatingMethodAccessorImpl.java:43)
13-Sep-2017 20:58:41         at java.lang.reflect.Method.invoke(Method.java:606)
13-Sep-2017 20:58:41         at org.springframework.aop.support.AopUtils.invokeJoinpointUsingReflection(AopUtils.java:317)
13-Sep-2017 20:58:41         at org.springframework.aop.framework.ReflectiveMethodInvocation.invokeJoinpoint(ReflectiveMethodInvocation.java:183)
13-Sep-2017 20:58:41         at org.springframework.aop.framework.ReflectiveMethodInvocation.proceed(ReflectiveMethodInvocation.java:150)
13-Sep-2017 20:58:41         at org.openmrs.aop.LoggingAdvice.invoke(LoggingAdvice.java:121)
13-Sep-2017 20:58:41         at org.springframework.aop.framework.ReflectiveMethodInvocation.proceed(ReflectiveMethodInvocation.java:172)
13-Sep-2017 20:58:41         at org.springframework.aop.framework.adapter.MethodBeforeAdviceInterceptor.invoke(MethodBeforeAdviceInterceptor.java:51)
13-Sep-2017 20:58:41         at org.springframework.aop.framework.ReflectiveMethodInvocation.proceed(ReflectiveMethodInvocation.java:172)
13-Sep-2017 20:58:41         at org.springframework.aop.framework.adapter.MethodBeforeAdviceInterceptor.invoke(MethodBeforeAdviceInterceptor.java:51)
13-Sep-2017 20:58:41         at org.springframework.aop.framework.ReflectiveMethodInvocation.proceed(ReflectiveMethodInvocation.java:172)
13-Sep-2017 20:58:41         at org.springframework.aop.framework.JdkDynamicAopProxy.invoke(JdkDynamicAopProxy.java:204)
13-Sep-2017 20:58:41         at com.sun.proxy.$Proxy54.getDefaultIdentifierValidator(Unknown Source)
13-Sep-2017 20:58:41         at org.openmrs.web.controller.patient.PatientIdentifierTypeFormController.referenceData(PatientIdentifierTypeFormController.java:170)
13-Sep-2017 20:58:41         at org.springframework.web.servlet.mvc.AbstractFormController.showForm(AbstractFormController.java:578)
13-Sep-2017 20:58:41         at org.springframework.web.servlet.mvc.SimpleFormController.showForm(SimpleFormController.java:201)
13-Sep-2017 20:58:41         at org.springframework.web.servlet.mvc.SimpleFormController.showForm(SimpleFormController.java:178)
13-Sep-2017 20:58:41         at org.openmrs.web.controller.patient.PatientIdentifierTypeFormController.onSubmit(PatientIdentifierTypeFormController.java:122)
13-Sep-2017 20:58:41         at org.springframework.web.servlet.mvc.SimpleFormController.processFormSubmission(SimpleFormController.java:272)
13-Sep-2017 20:58:41         at org.springframework.web.servlet.mvc.AbstractFormController.handleRequestInternal(AbstractFormController.java:268)
13-Sep-2017 20:58:41         at org.springframework.web.servlet.mvc.AbstractController.handleRequest(AbstractController.java:153)
13-Sep-2017 20:58:41         at org.openmrs.web.controller.patient.PatientIdentifierTypeFormControllerTest.shouldNotRetirePatientIdentifierTypeWhenPatientIdentifierTypesAreLocked(PatientIdentifierTypeFormControllerTest.java:65)
13-Sep-2017 20:58:41         at sun.reflect.NativeMethodAccessorImpl.invoke0(Native Method)
13-Sep-2017 20:58:41         at sun.reflect.NativeMethodAccessorImpl.invoke(NativeMethodAccessorImpl.java:57)
13-Sep-2017 20:58:41         at sun.reflect.DelegatingMethodAccessorImpl.invoke(DelegatingMethodAccessorImpl.java:43)
13-Sep-2017 20:58:41         at java.lang.reflect.Method.invoke(Method.java:606)
13-Sep-2017 20:58:41         at org.junit.runners.model.FrameworkMethod$1.runReflectiveCall(FrameworkMethod.java:47)
13-Sep-2017 20:58:41         at org.junit.internal.runners.model.ReflectiveCallable.run(ReflectiveCallable.java:12)
13-Sep-2017 20:58:41         at org.junit.runners.model.FrameworkMethod.invokeExplosively(FrameworkMethod.java:44)
13-Sep-2017 20:58:41         at org.junit.internal.runners.statements.InvokeMethod.evaluate(InvokeMethod.java:17)
13-Sep-2017 20:58:41         at org.junit.internal.runners.statements.RunBefores.evaluate(RunBefores.java:26)
13-Sep-2017 20:58:41         at org.springframework.test.context.junit4.statements.RunBeforeTestMethodCallbacks.evaluate(RunBeforeTestMethodCallbacks.java:74)
13-Sep-2017 20:58:41         at org.junit.internal.runners.statements.RunAfters.evaluate(RunAfters.java:27)
13-Sep-2017 20:58:41         at org.springframework.test.context.junit4.statements.RunAfterTestMethodCallbacks.evaluate(RunAfterTestMethodCallbacks.java:83)
13-Sep-2017 20:58:41         at org.springframework.test.context.junit4.statements.SpringRepeat.evaluate(SpringRepeat.java:72)
13-Sep-2017 20:58:41         at org.springframework.test.context.junit4.SpringJUnit4ClassRunner.runChild(SpringJUnit4ClassRunner.java:231)
13-Sep-2017 20:58:41         at org.springframework.test.context.junit4.SpringJUnit4ClassRunner.runChild(SpringJUnit4ClassRunner.java:88)
13-Sep-2017 20:58:41         at org.junit.runners.ParentRunner$3.run(ParentRunner.java:238)
13-Sep-2017 20:58:41         at org.junit.runners.ParentRunner$1.schedule(ParentRunner.java:63)
13-Sep-2017 20:58:41         at org.junit.runners.ParentRunner.runChildren(ParentRunner.java:236)
13-Sep-2017 20:58:41         at org.junit.runners.ParentRunner.access$000(ParentRunner.java:53)
13-Sep-2017 20:58:41         at org.junit.runners.ParentRunner$2.evaluate(ParentRunner.java:229)
13-Sep-2017 20:58:41         at org.springframework.test.context.junit4.statements.RunBeforeTestClassCallbacks.evaluate(RunBeforeTestClassCallbacks.java:61)
13-Sep-2017 20:58:41         at org.junit.internal.runners.statements.RunAfters.evaluate(RunAfters.java:27)
13-Sep-2017 20:58:41         at org.springframework.test.context.junit4.statements.RunAfterTestClassCallbacks.evaluate(RunAfterTestClassCallbacks.java:71)
13-Sep-2017 20:58:41         at org.junit.runners.ParentRunner.run(ParentRunner.java:309)
13-Sep-2017 20:58:41         at org.springframework.test.context.junit4.SpringJUnit4ClassRunner.run(SpringJUnit4ClassRunner.java:174)
13-Sep-2017 20:58:41         at org.apache.maven.surefire.junit4.JUnit4TestSet.execute(JUnit4TestSet.java:59)
13-Sep-2017 20:58:41         at org.apache.maven.surefire.suite.AbstractDirectoryTestSuite.executeTestSet(AbstractDirectoryTestSuite.java:115)
13-Sep-2017 20:58:41         at org.apache.maven.surefire.suite.AbstractDirectoryTestSuite.execute(AbstractDirectoryTestSuite.java:102)
13-Sep-2017 20:58:41         at org.apache.maven.surefire.Surefire.run(Surefire.java:180)
13-Sep-2017 20:58:41         at sun.reflect.NativeMethodAccessorImpl.invoke0(Native Method)
13-Sep-2017 20:58:41         at sun.reflect.NativeMethodAccessorImpl.invoke(NativeMethodAccessorImpl.java:57)
13-Sep-2017 20:58:41         at sun.reflect.DelegatingMethodAccessorImpl.invoke(DelegatingMethodAccessorImpl.java:43)
13-Sep-2017 20:58:41         at java.lang.reflect.Method.invoke(Method.java:606)
13-Sep-2017 20:58:41         at org.apache.maven.surefire.booter.SurefireBooter.runSuitesInProcess(SurefireBooter.java:350)
13-Sep-2017 20:58:41         at org.apache.maven.surefire.booter.SurefireBooter.main(SurefireBooter.java:1021)
13-Sep-2017 20:58:41 Tests run: 4, Failures: 0, Errors: 0, Skipped: 0, Time elapsed: 0.159 sec
13-Sep-2017 20:58:41 Running org.openmrs.web.dwr.ProviderListItemTest
13-Sep-2017 20:58:41 Tests run: 4, Failures: 0, Errors: 0, Skipped: 0, Time elapsed: 0.015 sec
13-Sep-2017 20:58:41 Running org.openmrs.scheduler.web.controller.SchedulerFormTest
13-Sep-2017 20:58:41 Tests run: 1, Failures: 0, Errors: 0, Skipped: 0, Time elapsed: 0.026 sec
13-Sep-2017 20:58:41 Running org.openmrs.web.controller.user.UserFormControllerTest
13-Sep-2017 20:58:41 Tests run: 2, Failures: 0, Errors: 0, Skipped: 0, Time elapsed: 0.166 sec
13-Sep-2017 20:58:41 Running org.openmrs.web.controller.person.PersonAttributeTypeFormControllerTest
13-Sep-2017 20:58:41 ERROR - PersonAttributeTypeFormController.onSubmit(120) |2017-09-13 20:58:41,329| PersonAttributeType.locked
13-Sep-2017 20:58:41 org.openmrs.api.PersonAttributeTypeLockedException: PersonAtttributeType.locked
13-Sep-2017 20:58:41         at org.openmrs.api.impl.PersonServiceImpl.checkIfPersonAttributeTypesAreLocked(PersonServiceImpl.java:1243)
13-Sep-2017 20:58:41         at org.openmrs.api.impl.PersonServiceImpl.unretirePersonAttributeType(PersonServiceImpl.java:302)
13-Sep-2017 20:58:41         at sun.reflect.NativeMethodAccessorImpl.invoke0(Native Method)
13-Sep-2017 20:58:41         at sun.reflect.NativeMethodAccessorImpl.invoke(NativeMethodAccessorImpl.java:57)
13-Sep-2017 20:58:41         at sun.reflect.DelegatingMethodAccessorImpl.invoke(DelegatingMethodAccessorImpl.java:43)
13-Sep-2017 20:58:41         at java.lang.reflect.Method.invoke(Method.java:606)
13-Sep-2017 20:58:41         at org.springframework.aop.support.AopUtils.invokeJoinpointUsingReflection(AopUtils.java:317)
13-Sep-2017 20:58:41         at org.springframework.aop.framework.ReflectiveMethodInvocation.invokeJoinpoint(ReflectiveMethodInvocation.java:183)
13-Sep-2017 20:58:41         at org.springframework.aop.framework.ReflectiveMethodInvocation.proceed(ReflectiveMethodInvocation.java:150)
13-Sep-2017 20:58:41         at org.springframework.transaction.interceptor.TransactionInterceptor$1.proceedWithInvocation(TransactionInterceptor.java:96)
13-Sep-2017 20:58:41         at org.springframework.transaction.interceptor.TransactionAspectSupport.invokeWithinTransaction(TransactionAspectSupport.java:260)
13-Sep-2017 20:58:41         at org.springframework.transaction.interceptor.TransactionInterceptor.invoke(TransactionInterceptor.java:94)
13-Sep-2017 20:58:41         at org.springframework.aop.framework.ReflectiveMethodInvocation.proceed(ReflectiveMethodInvocation.java:172)
13-Sep-2017 20:58:41         at org.springframework.aop.framework.JdkDynamicAopProxy.invoke(JdkDynamicAopProxy.java:204)
13-Sep-2017 20:58:41         at com.sun.proxy.$Proxy57.unretirePersonAttributeType(Unknown Source)
13-Sep-2017 20:58:41         at sun.reflect.NativeMethodAccessorImpl.invoke0(Native Method)
13-Sep-2017 20:58:41         at sun.reflect.NativeMethodAccessorImpl.invoke(NativeMethodAccessorImpl.java:57)
13-Sep-2017 20:58:41         at sun.reflect.DelegatingMethodAccessorImpl.invoke(DelegatingMethodAccessorImpl.java:43)
13-Sep-2017 20:58:41         at java.lang.reflect.Method.invoke(Method.java:606)
13-Sep-2017 20:58:41         at org.springframework.aop.support.AopUtils.invokeJoinpointUsingReflection(AopUtils.java:317)
13-Sep-2017 20:58:41         at org.springframework.aop.framework.ReflectiveMethodInvocation.invokeJoinpoint(ReflectiveMethodInvocation.java:183)
13-Sep-2017 20:58:41         at org.springframework.aop.framework.ReflectiveMethodInvocation.proceed(ReflectiveMethodInvocation.java:150)
13-Sep-2017 20:58:41         at org.openmrs.aop.LoggingAdvice.invoke(LoggingAdvice.java:121)
13-Sep-2017 20:58:41         at org.springframework.aop.framework.ReflectiveMethodInvocation.proceed(ReflectiveMethodInvocation.java:172)
13-Sep-2017 20:58:41         at org.springframework.aop.framework.adapter.MethodBeforeAdviceInterceptor.invoke(MethodBeforeAdviceInterceptor.java:51)
13-Sep-2017 20:58:41         at org.springframework.aop.framework.ReflectiveMethodInvocation.proceed(ReflectiveMethodInvocation.java:172)
13-Sep-2017 20:58:41         at org.springframework.aop.framework.adapter.MethodBeforeAdviceInterceptor.invoke(MethodBeforeAdviceInterceptor.java:51)
13-Sep-2017 20:58:41         at org.springframework.aop.framework.ReflectiveMethodInvocation.proceed(ReflectiveMethodInvocation.java:172)
13-Sep-2017 20:58:41         at org.springframework.aop.framework.JdkDynamicAopProxy.invoke(JdkDynamicAopProxy.java:204)
13-Sep-2017 20:58:41         at com.sun.proxy.$Proxy58.unretirePersonAttributeType(Unknown Source)
13-Sep-2017 20:58:41         at org.openmrs.web.controller.person.PersonAttributeTypeFormController.onSubmit(PersonAttributeTypeFormController.java:114)
13-Sep-2017 20:58:41         at org.springframework.web.servlet.mvc.SimpleFormController.processFormSubmission(SimpleFormController.java:272)
13-Sep-2017 20:58:41         at org.springframework.web.servlet.mvc.AbstractFormController.handleRequestInternal(AbstractFormController.java:268)
13-Sep-2017 20:58:41         at org.springframework.web.servlet.mvc.AbstractController.handleRequest(AbstractController.java:153)
13-Sep-2017 20:58:41         at org.openmrs.web.controller.person.PersonAttributeTypeFormControllerTest.shouldNotUnretirePersonAttributeTypeWhenPersonAttributeTypesAreLocked(PersonAttributeTypeFormControllerTest.java:84)
13-Sep-2017 20:58:41         at sun.reflect.NativeMethodAccessorImpl.invoke0(Native Method)
13-Sep-2017 20:58:41         at sun.reflect.NativeMethodAccessorImpl.invoke(NativeMethodAccessorImpl.java:57)
13-Sep-2017 20:58:41         at sun.reflect.DelegatingMethodAccessorImpl.invoke(DelegatingMethodAccessorImpl.java:43)
13-Sep-2017 20:58:41         at java.lang.reflect.Method.invoke(Method.java:606)
13-Sep-2017 20:58:41         at org.junit.runners.model.FrameworkMethod$1.runReflectiveCall(FrameworkMethod.java:47)
13-Sep-2017 20:58:41         at org.junit.internal.runners.model.ReflectiveCallable.run(ReflectiveCallable.java:12)
13-Sep-2017 20:58:41         at org.junit.runners.model.FrameworkMethod.invokeExplosively(FrameworkMethod.java:44)
13-Sep-2017 20:58:41         at org.junit.internal.runners.statements.InvokeMethod.evaluate(InvokeMethod.java:17)
13-Sep-2017 20:58:41         at org.junit.internal.runners.statements.RunBefores.evaluate(RunBefores.java:26)
13-Sep-2017 20:58:41         at org.springframework.test.context.junit4.statements.RunBeforeTestMethodCallbacks.evaluate(RunBeforeTestMethodCallbacks.java:74)
13-Sep-2017 20:58:41         at org.junit.internal.runners.statements.RunAfters.evaluate(RunAfters.java:27)
13-Sep-2017 20:58:41         at org.springframework.test.context.junit4.statements.RunAfterTestMethodCallbacks.evaluate(RunAfterTestMethodCallbacks.java:83)
13-Sep-2017 20:58:41         at org.springframework.test.context.junit4.statements.SpringRepeat.evaluate(SpringRepeat.java:72)
13-Sep-2017 20:58:41         at org.springframework.test.context.junit4.SpringJUnit4ClassRunner.runChild(SpringJUnit4ClassRunner.java:231)
13-Sep-2017 20:58:41         at org.springframework.test.context.junit4.SpringJUnit4ClassRunner.runChild(SpringJUnit4ClassRunner.java:88)
13-Sep-2017 20:58:41         at org.junit.runners.ParentRunner$3.run(ParentRunner.java:238)
13-Sep-2017 20:58:41         at org.junit.runners.ParentRunner$1.schedule(ParentRunner.java:63)
13-Sep-2017 20:58:41         at org.junit.runners.ParentRunner.runChildren(ParentRunner.java:236)
13-Sep-2017 20:58:41         at org.junit.runners.ParentRunner.access$000(ParentRunner.java:53)
13-Sep-2017 20:58:41         at org.junit.runners.ParentRunner$2.evaluate(ParentRunner.java:229)
13-Sep-2017 20:58:41         at org.springframework.test.context.junit4.statements.RunBeforeTestClassCallbacks.evaluate(RunBeforeTestClassCallbacks.java:61)
13-Sep-2017 20:58:41         at org.junit.internal.runners.statements.RunAfters.evaluate(RunAfters.java:27)
13-Sep-2017 20:58:41         at org.springframework.test.context.junit4.statements.RunAfterTestClassCallbacks.evaluate(RunAfterTestClassCallbacks.java:71)
13-Sep-2017 20:58:41         at org.junit.runners.ParentRunner.run(ParentRunner.java:309)
13-Sep-2017 20:58:41         at org.springframework.test.context.junit4.SpringJUnit4ClassRunner.run(SpringJUnit4ClassRunner.java:174)
13-Sep-2017 20:58:41         at org.apache.maven.surefire.junit4.JUnit4TestSet.execute(JUnit4TestSet.java:59)
13-Sep-2017 20:58:41         at org.apache.maven.surefire.suite.AbstractDirectoryTestSuite.executeTestSet(AbstractDirectoryTestSuite.java:115)
13-Sep-2017 20:58:41         at org.apache.maven.surefire.suite.AbstractDirectoryTestSuite.execute(AbstractDirectoryTestSuite.java:102)
13-Sep-2017 20:58:41         at org.apache.maven.surefire.Surefire.run(Surefire.java:180)
13-Sep-2017 20:58:41         at sun.reflect.NativeMethodAccessorImpl.invoke0(Native Method)
13-Sep-2017 20:58:41         at sun.reflect.NativeMethodAccessorImpl.invoke(NativeMethodAccessorImpl.java:57)
13-Sep-2017 20:58:41         at sun.reflect.DelegatingMethodAccessorImpl.invoke(DelegatingMethodAccessorImpl.java:43)
13-Sep-2017 20:58:41         at java.lang.reflect.Method.invoke(Method.java:606)
13-Sep-2017 20:58:41         at org.apache.maven.surefire.booter.SurefireBooter.runSuitesInProcess(SurefireBooter.java:350)
13-Sep-2017 20:58:41         at org.apache.maven.surefire.booter.SurefireBooter.main(SurefireBooter.java:1021)
13-Sep-2017 20:58:41 ERROR - PersonAttributeTypeFormController.onSubmit(120) |2017-09-13 20:58:41,355| PersonAttributeType.locked
13-Sep-2017 20:58:41 org.openmrs.api.PersonAttributeTypeLockedException: PersonAtttributeType.locked
13-Sep-2017 20:58:41         at org.openmrs.api.impl.PersonServiceImpl.checkIfPersonAttributeTypesAreLocked(PersonServiceImpl.java:1243)
13-Sep-2017 20:58:41         at org.openmrs.api.impl.PersonServiceImpl.purgePersonAttributeType(PersonServiceImpl.java:200)
13-Sep-2017 20:58:41         at sun.reflect.NativeMethodAccessorImpl.invoke0(Native Method)
13-Sep-2017 20:58:41         at sun.reflect.NativeMethodAccessorImpl.invoke(NativeMethodAccessorImpl.java:57)
13-Sep-2017 20:58:41         at sun.reflect.DelegatingMethodAccessorImpl.invoke(DelegatingMethodAccessorImpl.java:43)
13-Sep-2017 20:58:41         at java.lang.reflect.Method.invoke(Method.java:606)
13-Sep-2017 20:58:41         at org.springframework.aop.support.AopUtils.invokeJoinpointUsingReflection(AopUtils.java:317)
13-Sep-2017 20:58:41         at org.springframework.aop.framework.ReflectiveMethodInvocation.invokeJoinpoint(ReflectiveMethodInvocation.java:183)
13-Sep-2017 20:58:41         at org.springframework.aop.framework.ReflectiveMethodInvocation.proceed(ReflectiveMethodInvocation.java:150)
13-Sep-2017 20:58:41         at org.springframework.transaction.interceptor.TransactionInterceptor$1.proceedWithInvocation(TransactionInterceptor.java:96)
13-Sep-2017 20:58:41         at org.springframework.transaction.interceptor.TransactionAspectSupport.invokeWithinTransaction(TransactionAspectSupport.java:260)
13-Sep-2017 20:58:41         at org.springframework.transaction.interceptor.TransactionInterceptor.invoke(TransactionInterceptor.java:94)
13-Sep-2017 20:58:41         at org.springframework.aop.framework.ReflectiveMethodInvocation.proceed(ReflectiveMethodInvocation.java:172)
13-Sep-2017 20:58:41         at org.springframework.aop.framework.JdkDynamicAopProxy.invoke(JdkDynamicAopProxy.java:204)
13-Sep-2017 20:58:41         at com.sun.proxy.$Proxy57.purgePersonAttributeType(Unknown Source)
13-Sep-2017 20:58:41         at sun.reflect.NativeMethodAccessorImpl.invoke0(Native Method)
13-Sep-2017 20:58:41         at sun.reflect.NativeMethodAccessorImpl.invoke(NativeMethodAccessorImpl.java:57)
13-Sep-2017 20:58:41         at sun.reflect.DelegatingMethodAccessorImpl.invoke(DelegatingMethodAccessorImpl.java:43)
13-Sep-2017 20:58:41         at java.lang.reflect.Method.invoke(Method.java:606)
13-Sep-2017 20:58:41         at org.springframework.aop.support.AopUtils.invokeJoinpointUsingReflection(AopUtils.java:317)
13-Sep-2017 20:58:41         at org.springframework.aop.framework.ReflectiveMethodInvocation.invokeJoinpoint(ReflectiveMethodInvocation.java:183)
13-Sep-2017 20:58:41         at org.springframework.aop.framework.ReflectiveMethodInvocation.proceed(ReflectiveMethodInvocation.java:150)
13-Sep-2017 20:58:41         at org.openmrs.aop.LoggingAdvice.invoke(LoggingAdvice.java:121)
13-Sep-2017 20:58:41         at org.springframework.aop.framework.ReflectiveMethodInvocation.proceed(ReflectiveMethodInvocation.java:172)
13-Sep-2017 20:58:41         at org.springframework.aop.framework.adapter.MethodBeforeAdviceInterceptor.invoke(MethodBeforeAdviceInterceptor.java:51)
13-Sep-2017 20:58:41         at org.springframework.aop.framework.ReflectiveMethodInvocation.proceed(ReflectiveMethodInvocation.java:172)
13-Sep-2017 20:58:41         at org.springframework.aop.framework.adapter.MethodBeforeAdviceInterceptor.invoke(MethodBeforeAdviceInterceptor.java:51)
13-Sep-2017 20:58:41         at org.springframework.aop.framework.ReflectiveMethodInvocation.proceed(ReflectiveMethodInvocation.java:172)
13-Sep-2017 20:58:41         at org.springframework.aop.framework.JdkDynamicAopProxy.invoke(JdkDynamicAopProxy.java:204)
13-Sep-2017 20:58:41         at com.sun.proxy.$Proxy58.purgePersonAttributeType(Unknown Source)
13-Sep-2017 20:58:41         at org.openmrs.web.controller.person.PersonAttributeTypeFormController.onSubmit(PersonAttributeTypeFormController.java:105)
13-Sep-2017 20:58:41         at org.springframework.web.servlet.mvc.SimpleFormController.processFormSubmission(SimpleFormController.java:272)
13-Sep-2017 20:58:41         at org.springframework.web.servlet.mvc.AbstractFormController.handleRequestInternal(AbstractFormController.java:268)
13-Sep-2017 20:58:41         at org.springframework.web.servlet.mvc.AbstractController.handleRequest(AbstractController.java:153)
13-Sep-2017 20:58:41         at org.openmrs.web.controller.person.PersonAttributeTypeFormControllerTest.shouldNotDeletePersonAttributeTypeWhenPersonAttributeTypesAreLocked(PersonAttributeTypeFormControllerTest.java:63)
13-Sep-2017 20:58:41         at sun.reflect.NativeMethodAccessorImpl.invoke0(Native Method)
13-Sep-2017 20:58:41         at sun.reflect.NativeMethodAccessorImpl.invoke(NativeMethodAccessorImpl.java:57)
13-Sep-2017 20:58:41         at sun.reflect.DelegatingMethodAccessorImpl.invoke(DelegatingMethodAccessorImpl.java:43)
13-Sep-2017 20:58:41         at java.lang.reflect.Method.invoke(Method.java:606)
13-Sep-2017 20:58:41         at org.junit.runners.model.FrameworkMethod$1.runReflectiveCall(FrameworkMethod.java:47)
13-Sep-2017 20:58:41         at org.junit.internal.runners.model.ReflectiveCallable.run(ReflectiveCallable.java:12)
13-Sep-2017 20:58:41         at org.junit.runners.model.FrameworkMethod.invokeExplosively(FrameworkMethod.java:44)
13-Sep-2017 20:58:41         at org.junit.internal.runners.statements.InvokeMethod.evaluate(InvokeMethod.java:17)
13-Sep-2017 20:58:41         at org.junit.internal.runners.statements.RunBefores.evaluate(RunBefores.java:26)
13-Sep-2017 20:58:41         at org.springframework.test.context.junit4.statements.RunBeforeTestMethodCallbacks.evaluate(RunBeforeTestMethodCallbacks.java:74)
13-Sep-2017 20:58:41         at org.junit.internal.runners.statements.RunAfters.evaluate(RunAfters.java:27)
13-Sep-2017 20:58:41         at org.springframework.test.context.junit4.statements.RunAfterTestMethodCallbacks.evaluate(RunAfterTestMethodCallbacks.java:83)
13-Sep-2017 20:58:41         at org.springframework.test.context.junit4.statements.SpringRepeat.evaluate(SpringRepeat.java:72)
13-Sep-2017 20:58:41         at org.springframework.test.context.junit4.SpringJUnit4ClassRunner.runChild(SpringJUnit4ClassRunner.java:231)
13-Sep-2017 20:58:41         at org.springframework.test.context.junit4.SpringJUnit4ClassRunner.runChild(SpringJUnit4ClassRunner.java:88)
13-Sep-2017 20:58:41         at org.junit.runners.ParentRunner$3.run(ParentRunner.java:238)
13-Sep-2017 20:58:41         at org.junit.runners.ParentRunner$1.schedule(ParentRunner.java:63)
13-Sep-2017 20:58:41         at org.junit.runners.ParentRunner.runChildren(ParentRunner.java:236)
13-Sep-2017 20:58:41         at org.junit.runners.ParentRunner.access$000(ParentRunner.java:53)
13-Sep-2017 20:58:41         at org.junit.runners.ParentRunner$2.evaluate(ParentRunner.java:229)
13-Sep-2017 20:58:41         at org.springframework.test.context.junit4.statements.RunBeforeTestClassCallbacks.evaluate(RunBeforeTestClassCallbacks.java:61)
13-Sep-2017 20:58:41         at org.junit.internal.runners.statements.RunAfters.evaluate(RunAfters.java:27)
13-Sep-2017 20:58:41         at org.springframework.test.context.junit4.statements.RunAfterTestClassCallbacks.evaluate(RunAfterTestClassCallbacks.java:71)
13-Sep-2017 20:58:41         at org.junit.runners.ParentRunner.run(ParentRunner.java:309)
13-Sep-2017 20:58:41         at org.springframework.test.context.junit4.SpringJUnit4ClassRunner.run(SpringJUnit4ClassRunner.java:174)
13-Sep-2017 20:58:41         at org.apache.maven.surefire.junit4.JUnit4TestSet.execute(JUnit4TestSet.java:59)
13-Sep-2017 20:58:41         at org.apache.maven.surefire.suite.AbstractDirectoryTestSuite.executeTestSet(AbstractDirectoryTestSuite.java:115)
13-Sep-2017 20:58:41         at org.apache.maven.surefire.suite.AbstractDirectoryTestSuite.execute(AbstractDirectoryTestSuite.java:102)
13-Sep-2017 20:58:41         at org.apache.maven.surefire.Surefire.run(Surefire.java:180)
13-Sep-2017 20:58:41         at sun.reflect.NativeMethodAccessorImpl.invoke0(Native Method)
13-Sep-2017 20:58:41         at sun.reflect.NativeMethodAccessorImpl.invoke(NativeMethodAccessorImpl.java:57)
13-Sep-2017 20:58:41         at sun.reflect.DelegatingMethodAccessorImpl.invoke(DelegatingMethodAccessorImpl.java:43)
13-Sep-2017 20:58:41         at java.lang.reflect.Method.invoke(Method.java:606)
13-Sep-2017 20:58:41         at org.apache.maven.surefire.booter.SurefireBooter.runSuitesInProcess(SurefireBooter.java:350)
13-Sep-2017 20:58:41         at org.apache.maven.surefire.booter.SurefireBooter.main(SurefireBooter.java:1021)
13-Sep-2017 20:58:41 ERROR - PersonAttributeTypeFormController.onSubmit(120) |2017-09-13 20:58:41,389| PersonAttributeType.locked
13-Sep-2017 20:58:41 org.openmrs.api.PersonAttributeTypeLockedException: PersonAtttributeType.locked
13-Sep-2017 20:58:41         at org.openmrs.api.impl.PersonServiceImpl.checkIfPersonAttributeTypesAreLocked(PersonServiceImpl.java:1243)
13-Sep-2017 20:58:41         at org.openmrs.api.impl.PersonServiceImpl.savePersonAttributeType(PersonServiceImpl.java:208)
13-Sep-2017 20:58:41         at sun.reflect.NativeMethodAccessorImpl.invoke0(Native Method)
13-Sep-2017 20:58:41         at sun.reflect.NativeMethodAccessorImpl.invoke(NativeMethodAccessorImpl.java:57)
13-Sep-2017 20:58:41         at sun.reflect.DelegatingMethodAccessorImpl.invoke(DelegatingMethodAccessorImpl.java:43)
13-Sep-2017 20:58:41         at java.lang.reflect.Method.invoke(Method.java:606)
13-Sep-2017 20:58:41         at org.springframework.aop.support.AopUtils.invokeJoinpointUsingReflection(AopUtils.java:317)
13-Sep-2017 20:58:41         at org.springframework.aop.framework.ReflectiveMethodInvocation.invokeJoinpoint(ReflectiveMethodInvocation.java:183)
13-Sep-2017 20:58:41         at org.springframework.aop.framework.ReflectiveMethodInvocation.proceed(ReflectiveMethodInvocation.java:150)
13-Sep-2017 20:58:41         at org.springframework.transaction.interceptor.TransactionInterceptor$1.proceedWithInvocation(TransactionInterceptor.java:96)
13-Sep-2017 20:58:41         at org.springframework.transaction.interceptor.TransactionAspectSupport.invokeWithinTransaction(TransactionAspectSupport.java:260)
13-Sep-2017 20:58:41         at org.springframework.transaction.interceptor.TransactionInterceptor.invoke(TransactionInterceptor.java:94)
13-Sep-2017 20:58:41         at org.springframework.aop.framework.ReflectiveMethodInvocation.proceed(ReflectiveMethodInvocation.java:172)
13-Sep-2017 20:58:41         at org.springframework.aop.framework.JdkDynamicAopProxy.invoke(JdkDynamicAopProxy.java:204)
13-Sep-2017 20:58:41         at com.sun.proxy.$Proxy57.savePersonAttributeType(Unknown Source)
13-Sep-2017 20:58:41         at sun.reflect.NativeMethodAccessorImpl.invoke0(Native Method)
13-Sep-2017 20:58:41         at sun.reflect.NativeMethodAccessorImpl.invoke(NativeMethodAccessorImpl.java:57)
13-Sep-2017 20:58:41         at sun.reflect.DelegatingMethodAccessorImpl.invoke(DelegatingMethodAccessorImpl.java:43)
13-Sep-2017 20:58:41         at java.lang.reflect.Method.invoke(Method.java:606)
13-Sep-2017 20:58:41         at org.springframework.aop.support.AopUtils.invokeJoinpointUsingReflection(AopUtils.java:317)
13-Sep-2017 20:58:41         at org.springframework.aop.framework.ReflectiveMethodInvocation.invokeJoinpoint(ReflectiveMethodInvocation.java:183)
13-Sep-2017 20:58:41         at org.springframework.aop.framework.ReflectiveMethodInvocation.proceed(ReflectiveMethodInvocation.java:150)
13-Sep-2017 20:58:41         at org.openmrs.aop.LoggingAdvice.invoke(LoggingAdvice.java:121)
13-Sep-2017 20:58:41         at org.springframework.aop.framework.ReflectiveMethodInvocation.proceed(ReflectiveMethodInvocation.java:172)
13-Sep-2017 20:58:41         at org.springframework.aop.framework.adapter.MethodBeforeAdviceInterceptor.invoke(MethodBeforeAdviceInterceptor.java:51)
13-Sep-2017 20:58:41         at org.springframework.aop.framework.ReflectiveMethodInvocation.proceed(ReflectiveMethodInvocation.java:172)
13-Sep-2017 20:58:41         at org.springframework.aop.framework.adapter.MethodBeforeAdviceInterceptor.invoke(MethodBeforeAdviceInterceptor.java:51)
13-Sep-2017 20:58:41         at org.springframework.aop.framework.ReflectiveMethodInvocation.proceed(ReflectiveMethodInvocation.java:172)
13-Sep-2017 20:58:41         at org.springframework.aop.framework.JdkDynamicAopProxy.invoke(JdkDynamicAopProxy.java:204)
13-Sep-2017 20:58:41         at com.sun.proxy.$Proxy58.savePersonAttributeType(Unknown Source)
13-Sep-2017 20:58:41         at org.openmrs.web.controller.person.PersonAttributeTypeFormController.onSubmit(PersonAttributeTypeFormController.java:87)
13-Sep-2017 20:58:41         at org.springframework.web.servlet.mvc.SimpleFormController.processFormSubmission(SimpleFormController.java:272)
13-Sep-2017 20:58:41         at org.springframework.web.servlet.mvc.AbstractFormController.handleRequestInternal(AbstractFormController.java:268)
13-Sep-2017 20:58:41         at org.springframework.web.servlet.mvc.AbstractController.handleRequest(AbstractController.java:153)
13-Sep-2017 20:58:41         at org.openmrs.web.controller.person.PersonAttributeTypeFormControllerTest.shouldNotSavePersonAttributeTypeWhenPersonAttributeTypesAreLocked(PersonAttributeTypeFormControllerTest.java:53)
13-Sep-2017 20:58:41         at sun.reflect.NativeMethodAccessorImpl.invoke0(Native Method)
13-Sep-2017 20:58:41         at sun.reflect.NativeMethodAccessorImpl.invoke(NativeMethodAccessorImpl.java:57)
13-Sep-2017 20:58:41         at sun.reflect.DelegatingMethodAccessorImpl.invoke(DelegatingMethodAccessorImpl.java:43)
13-Sep-2017 20:58:41         at java.lang.reflect.Method.invoke(Method.java:606)
13-Sep-2017 20:58:41         at org.junit.runners.model.FrameworkMethod$1.runReflectiveCall(FrameworkMethod.java:47)
13-Sep-2017 20:58:41         at org.junit.internal.runners.model.ReflectiveCallable.run(ReflectiveCallable.java:12)
13-Sep-2017 20:58:41         at org.junit.runners.model.FrameworkMethod.invokeExplosively(FrameworkMethod.java:44)
13-Sep-2017 20:58:41         at org.junit.internal.runners.statements.InvokeMethod.evaluate(InvokeMethod.java:17)
13-Sep-2017 20:58:41         at org.junit.internal.runners.statements.RunBefores.evaluate(RunBefores.java:26)
13-Sep-2017 20:58:41         at org.springframework.test.context.junit4.statements.RunBeforeTestMethodCallbacks.evaluate(RunBeforeTestMethodCallbacks.java:74)
13-Sep-2017 20:58:41         at org.junit.internal.runners.statements.RunAfters.evaluate(RunAfters.java:27)
13-Sep-2017 20:58:41         at org.springframework.test.context.junit4.statements.RunAfterTestMethodCallbacks.evaluate(RunAfterTestMethodCallbacks.java:83)
13-Sep-2017 20:58:41         at org.springframework.test.context.junit4.statements.SpringRepeat.evaluate(SpringRepeat.java:72)
13-Sep-2017 20:58:41         at org.springframework.test.context.junit4.SpringJUnit4ClassRunner.runChild(SpringJUnit4ClassRunner.java:231)
13-Sep-2017 20:58:41         at org.springframework.test.context.junit4.SpringJUnit4ClassRunner.runChild(SpringJUnit4ClassRunner.java:88)
13-Sep-2017 20:58:41         at org.junit.runners.ParentRunner$3.run(ParentRunner.java:238)
13-Sep-2017 20:58:41         at org.junit.runners.ParentRunner$1.schedule(ParentRunner.java:63)
13-Sep-2017 20:58:41         at org.junit.runners.ParentRunner.runChildren(ParentRunner.java:236)
13-Sep-2017 20:58:41         at org.junit.runners.ParentRunner.access$000(ParentRunner.java:53)
13-Sep-2017 20:58:41         at org.junit.runners.ParentRunner$2.evaluate(ParentRunner.java:229)
13-Sep-2017 20:58:41         at org.springframework.test.context.junit4.statements.RunBeforeTestClassCallbacks.evaluate(RunBeforeTestClassCallbacks.java:61)
13-Sep-2017 20:58:41         at org.junit.internal.runners.statements.RunAfters.evaluate(RunAfters.java:27)
13-Sep-2017 20:58:41         at org.springframework.test.context.junit4.statements.RunAfterTestClassCallbacks.evaluate(RunAfterTestClassCallbacks.java:71)
13-Sep-2017 20:58:41         at org.junit.runners.ParentRunner.run(ParentRunner.java:309)
13-Sep-2017 20:58:41         at org.springframework.test.context.junit4.SpringJUnit4ClassRunner.run(SpringJUnit4ClassRunner.java:174)
13-Sep-2017 20:58:41         at org.apache.maven.surefire.junit4.JUnit4TestSet.execute(JUnit4TestSet.java:59)
13-Sep-2017 20:58:41         at org.apache.maven.surefire.suite.AbstractDirectoryTestSuite.executeTestSet(AbstractDirectoryTestSuite.java:115)
13-Sep-2017 20:58:41         at org.apache.maven.surefire.suite.AbstractDirectoryTestSuite.execute(AbstractDirectoryTestSuite.java:102)
13-Sep-2017 20:58:41         at org.apache.maven.surefire.Surefire.run(Surefire.java:180)
13-Sep-2017 20:58:41         at sun.reflect.NativeMethodAccessorImpl.invoke0(Native Method)
13-Sep-2017 20:58:41         at sun.reflect.NativeMethodAccessorImpl.invoke(NativeMethodAccessorImpl.java:57)
13-Sep-2017 20:58:41         at sun.reflect.DelegatingMethodAccessorImpl.invoke(DelegatingMethodAccessorImpl.java:43)
13-Sep-2017 20:58:41         at java.lang.reflect.Method.invoke(Method.java:606)
13-Sep-2017 20:58:41         at org.apache.maven.surefire.booter.SurefireBooter.runSuitesInProcess(SurefireBooter.java:350)
13-Sep-2017 20:58:41         at org.apache.maven.surefire.booter.SurefireBooter.main(SurefireBooter.java:1021)
13-Sep-2017 20:58:41 ERROR - PersonAttributeTypeFormController.onSubmit(120) |2017-09-13 20:58:41,415| PersonAttributeType.locked
13-Sep-2017 20:58:41 org.openmrs.api.PersonAttributeTypeLockedException: PersonAtttributeType.locked
13-Sep-2017 20:58:41         at org.openmrs.api.impl.PersonServiceImpl.checkIfPersonAttributeTypesAreLocked(PersonServiceImpl.java:1243)
13-Sep-2017 20:58:41         at org.openmrs.api.impl.PersonServiceImpl.retirePersonAttributeType(PersonServiceImpl.java:250)
13-Sep-2017 20:58:41         at sun.reflect.NativeMethodAccessorImpl.invoke0(Native Method)
13-Sep-2017 20:58:41         at sun.reflect.NativeMethodAccessorImpl.invoke(NativeMethodAccessorImpl.java:57)
13-Sep-2017 20:58:41         at sun.reflect.DelegatingMethodAccessorImpl.invoke(DelegatingMethodAccessorImpl.java:43)
13-Sep-2017 20:58:41         at java.lang.reflect.Method.invoke(Method.java:606)
13-Sep-2017 20:58:41         at org.springframework.aop.support.AopUtils.invokeJoinpointUsingReflection(AopUtils.java:317)
13-Sep-2017 20:58:41         at org.springframework.aop.framework.ReflectiveMethodInvocation.invokeJoinpoint(ReflectiveMethodInvocation.java:183)
13-Sep-2017 20:58:41         at org.springframework.aop.framework.ReflectiveMethodInvocation.proceed(ReflectiveMethodInvocation.java:150)
13-Sep-2017 20:58:41         at org.springframework.transaction.interceptor.TransactionInterceptor$1.proceedWithInvocation(TransactionInterceptor.java:96)
13-Sep-2017 20:58:41         at org.springframework.transaction.interceptor.TransactionAspectSupport.invokeWithinTransaction(TransactionAspectSupport.java:260)
13-Sep-2017 20:58:41         at org.springframework.transaction.interceptor.TransactionInterceptor.invoke(TransactionInterceptor.java:94)
13-Sep-2017 20:58:41         at org.springframework.aop.framework.ReflectiveMethodInvocation.proceed(ReflectiveMethodInvocation.java:172)
13-Sep-2017 20:58:41         at org.springframework.aop.framework.JdkDynamicAopProxy.invoke(JdkDynamicAopProxy.java:204)
13-Sep-2017 20:58:41         at com.sun.proxy.$Proxy57.retirePersonAttributeType(Unknown Source)
13-Sep-2017 20:58:41         at sun.reflect.NativeMethodAccessorImpl.invoke0(Native Method)
13-Sep-2017 20:58:41         at sun.reflect.NativeMethodAccessorImpl.invoke(NativeMethodAccessorImpl.java:57)
13-Sep-2017 20:58:41         at sun.reflect.DelegatingMethodAccessorImpl.invoke(DelegatingMethodAccessorImpl.java:43)
13-Sep-2017 20:58:41         at java.lang.reflect.Method.invoke(Method.java:606)
13-Sep-2017 20:58:41         at org.springframework.aop.support.AopUtils.invokeJoinpointUsingReflection(AopUtils.java:317)
13-Sep-2017 20:58:41         at org.springframework.aop.framework.ReflectiveMethodInvocation.invokeJoinpoint(ReflectiveMethodInvocation.java:183)
13-Sep-2017 20:58:41         at org.springframework.aop.framework.ReflectiveMethodInvocation.proceed(ReflectiveMethodInvocation.java:150)
13-Sep-2017 20:58:41         at org.openmrs.aop.LoggingAdvice.invoke(LoggingAdvice.java:121)
13-Sep-2017 20:58:41         at org.springframework.aop.framework.ReflectiveMethodInvocation.proceed(ReflectiveMethodInvocation.java:172)
13-Sep-2017 20:58:41         at org.springframework.aop.framework.adapter.MethodBeforeAdviceInterceptor.invoke(MethodBeforeAdviceInterceptor.java:51)
13-Sep-2017 20:58:41         at org.springframework.aop.framework.ReflectiveMethodInvocation.proceed(ReflectiveMethodInvocation.java:172)
13-Sep-2017 20:58:41         at org.springframework.aop.framework.adapter.MethodBeforeAdviceInterceptor.invoke(MethodBeforeAdviceInterceptor.java:51)
13-Sep-2017 20:58:41         at org.springframework.aop.framework.ReflectiveMethodInvocation.proceed(ReflectiveMethodInvocation.java:172)
13-Sep-2017 20:58:41         at org.springframework.aop.framework.JdkDynamicAopProxy.invoke(JdkDynamicAopProxy.java:204)
13-Sep-2017 20:58:41         at com.sun.proxy.$Proxy58.retirePersonAttributeType(Unknown Source)
13-Sep-2017 20:58:41         at org.openmrs.web.controller.person.PersonAttributeTypeFormController.onSubmit(PersonAttributeTypeFormController.java:98)
13-Sep-2017 20:58:41         at org.springframework.web.servlet.mvc.SimpleFormController.processFormSubmission(SimpleFormController.java:272)
13-Sep-2017 20:58:41         at org.springframework.web.servlet.mvc.AbstractFormController.handleRequestInternal(AbstractFormController.java:268)
13-Sep-2017 20:58:41         at org.springframework.web.servlet.mvc.AbstractController.handleRequest(AbstractController.java:153)
13-Sep-2017 20:58:41         at org.openmrs.web.controller.person.PersonAttributeTypeFormControllerTest.shouldNotRetirePersonAttributeTypeWhenPersonAttributeTypesAreLocked(PersonAttributeTypeFormControllerTest.java:74)
13-Sep-2017 20:58:41         at sun.reflect.NativeMethodAccessorImpl.invoke0(Native Method)
13-Sep-2017 20:58:41         at sun.reflect.NativeMethodAccessorImpl.invoke(NativeMethodAccessorImpl.java:57)
13-Sep-2017 20:58:41         at sun.reflect.DelegatingMethodAccessorImpl.invoke(DelegatingMethodAccessorImpl.java:43)
13-Sep-2017 20:58:41         at java.lang.reflect.Method.invoke(Method.java:606)
13-Sep-2017 20:58:41         at org.junit.runners.model.FrameworkMethod$1.runReflectiveCall(FrameworkMethod.java:47)
13-Sep-2017 20:58:41         at org.junit.internal.runners.model.ReflectiveCallable.run(ReflectiveCallable.java:12)
13-Sep-2017 20:58:41         at org.junit.runners.model.FrameworkMethod.invokeExplosively(FrameworkMethod.java:44)
13-Sep-2017 20:58:41         at org.junit.internal.runners.statements.InvokeMethod.evaluate(InvokeMethod.java:17)
13-Sep-2017 20:58:41         at org.junit.internal.runners.statements.RunBefores.evaluate(RunBefores.java:26)
13-Sep-2017 20:58:41         at org.springframework.test.context.junit4.statements.RunBeforeTestMethodCallbacks.evaluate(RunBeforeTestMethodCallbacks.java:74)
13-Sep-2017 20:58:41         at org.junit.internal.runners.statements.RunAfters.evaluate(RunAfters.java:27)
13-Sep-2017 20:58:41         at org.springframework.test.context.junit4.statements.RunAfterTestMethodCallbacks.evaluate(RunAfterTestMethodCallbacks.java:83)
13-Sep-2017 20:58:41         at org.springframework.test.context.junit4.statements.SpringRepeat.evaluate(SpringRepeat.java:72)
13-Sep-2017 20:58:41         at org.springframework.test.context.junit4.SpringJUnit4ClassRunner.runChild(SpringJUnit4ClassRunner.java:231)
13-Sep-2017 20:58:41         at org.springframework.test.context.junit4.SpringJUnit4ClassRunner.runChild(SpringJUnit4ClassRunner.java:88)
13-Sep-2017 20:58:41         at org.junit.runners.ParentRunner$3.run(ParentRunner.java:238)
13-Sep-2017 20:58:41         at org.junit.runners.ParentRunner$1.schedule(ParentRunner.java:63)
13-Sep-2017 20:58:41         at org.junit.runners.ParentRunner.runChildren(ParentRunner.java:236)
13-Sep-2017 20:58:41         at org.junit.runners.ParentRunner.access$000(ParentRunner.java:53)
13-Sep-2017 20:58:41         at org.junit.runners.ParentRunner$2.evaluate(ParentRunner.java:229)
13-Sep-2017 20:58:41         at org.springframework.test.context.junit4.statements.RunBeforeTestClassCallbacks.evaluate(RunBeforeTestClassCallbacks.java:61)
13-Sep-2017 20:58:41         at org.junit.internal.runners.statements.RunAfters.evaluate(RunAfters.java:27)
13-Sep-2017 20:58:41         at org.springframework.test.context.junit4.statements.RunAfterTestClassCallbacks.evaluate(RunAfterTestClassCallbacks.java:71)
13-Sep-2017 20:58:41         at org.junit.runners.ParentRunner.run(ParentRunner.java:309)
13-Sep-2017 20:58:41         at org.springframework.test.context.junit4.SpringJUnit4ClassRunner.run(SpringJUnit4ClassRunner.java:174)
13-Sep-2017 20:58:41         at org.apache.maven.surefire.junit4.JUnit4TestSet.execute(JUnit4TestSet.java:59)
13-Sep-2017 20:58:41         at org.apache.maven.surefire.suite.AbstractDirectoryTestSuite.executeTestSet(AbstractDirectoryTestSuite.java:115)
13-Sep-2017 20:58:41         at org.apache.maven.surefire.suite.AbstractDirectoryTestSuite.execute(AbstractDirectoryTestSuite.java:102)
13-Sep-2017 20:58:41         at org.apache.maven.surefire.Surefire.run(Surefire.java:180)
13-Sep-2017 20:58:41         at sun.reflect.NativeMethodAccessorImpl.invoke0(Native Method)
13-Sep-2017 20:58:41         at sun.reflect.NativeMethodAccessorImpl.invoke(NativeMethodAccessorImpl.java:57)
13-Sep-2017 20:58:41         at sun.reflect.DelegatingMethodAccessorImpl.invoke(DelegatingMethodAccessorImpl.java:43)
13-Sep-2017 20:58:41         at java.lang.reflect.Method.invoke(Method.java:606)
13-Sep-2017 20:58:41         at org.apache.maven.surefire.booter.SurefireBooter.runSuitesInProcess(SurefireBooter.java:350)
13-Sep-2017 20:58:41         at org.apache.maven.surefire.booter.SurefireBooter.main(SurefireBooter.java:1021)
13-Sep-2017 20:58:41 Tests run: 4, Failures: 0, Errors: 0, Skipped: 0, Time elapsed: 0.125 sec
13-Sep-2017 20:58:41 Running org.openmrs.web.controller.user.ChangePasswordFormControllerTest
13-Sep-2017 20:58:41 Tests run: 13, Failures: 0, Errors: 0, Skipped: 0, Time elapsed: 0.291 sec
13-Sep-2017 20:58:41 Running org.openmrs.web.controller.form.FormFormControllerTest
13-Sep-2017 20:58:41 ERROR - FormFormController.onSubmit(93) |2017-09-13 20:58:41,763| Error while saving form null
13-Sep-2017 20:58:41 org.openmrs.api.FormsLockedException: Form.forms.locked
13-Sep-2017 20:58:41         at org.openmrs.api.impl.FormServiceImpl.checkIfFormsAreLocked(FormServiceImpl.java:1021)
13-Sep-2017 20:58:41         at org.openmrs.api.impl.FormServiceImpl.saveForm(FormServiceImpl.java:753)
13-Sep-2017 20:58:41         at sun.reflect.NativeMethodAccessorImpl.invoke0(Native Method)
13-Sep-2017 20:58:41         at sun.reflect.NativeMethodAccessorImpl.invoke(NativeMethodAccessorImpl.java:57)
13-Sep-2017 20:58:41         at sun.reflect.DelegatingMethodAccessorImpl.invoke(DelegatingMethodAccessorImpl.java:43)
13-Sep-2017 20:58:41         at java.lang.reflect.Method.invoke(Method.java:606)
13-Sep-2017 20:58:41         at org.springframework.aop.support.AopUtils.invokeJoinpointUsingReflection(AopUtils.java:317)
13-Sep-2017 20:58:41         at org.springframework.aop.framework.ReflectiveMethodInvocation.invokeJoinpoint(ReflectiveMethodInvocation.java:183)
13-Sep-2017 20:58:41         at org.springframework.aop.framework.ReflectiveMethodInvocation.proceed(ReflectiveMethodInvocation.java:150)
13-Sep-2017 20:58:41         at org.springframework.transaction.interceptor.TransactionInterceptor$1.proceedWithInvocation(TransactionInterceptor.java:96)
13-Sep-2017 20:58:41         at org.springframework.transaction.interceptor.TransactionAspectSupport.invokeWithinTransaction(TransactionAspectSupport.java:260)
13-Sep-2017 20:58:41         at org.springframework.transaction.interceptor.TransactionInterceptor.invoke(TransactionInterceptor.java:94)
13-Sep-2017 20:58:41         at org.springframework.aop.framework.ReflectiveMethodInvocation.proceed(ReflectiveMethodInvocation.java:172)
13-Sep-2017 20:58:41         at org.springframework.aop.framework.JdkDynamicAopProxy.invoke(JdkDynamicAopProxy.java:204)
13-Sep-2017 20:58:41         at com.sun.proxy.$Proxy70.saveForm(Unknown Source)
13-Sep-2017 20:58:41         at sun.reflect.NativeMethodAccessorImpl.invoke0(Native Method)
13-Sep-2017 20:58:41         at sun.reflect.NativeMethodAccessorImpl.invoke(NativeMethodAccessorImpl.java:57)
13-Sep-2017 20:58:41         at sun.reflect.DelegatingMethodAccessorImpl.invoke(DelegatingMethodAccessorImpl.java:43)
13-Sep-2017 20:58:41         at java.lang.reflect.Method.invoke(Method.java:606)
13-Sep-2017 20:58:41         at org.springframework.aop.support.AopUtils.invokeJoinpointUsingReflection(AopUtils.java:317)
13-Sep-2017 20:58:41         at org.springframework.aop.framework.ReflectiveMethodInvocation.invokeJoinpoint(ReflectiveMethodInvocation.java:183)
13-Sep-2017 20:58:41         at org.springframework.aop.framework.ReflectiveMethodInvocation.proceed(ReflectiveMethodInvocation.java:150)
13-Sep-2017 20:58:41         at org.openmrs.aop.LoggingAdvice.invoke(LoggingAdvice.java:121)
13-Sep-2017 20:58:41         at org.springframework.aop.framework.ReflectiveMethodInvocation.proceed(ReflectiveMethodInvocation.java:172)
13-Sep-2017 20:58:41         at org.springframework.aop.framework.adapter.MethodBeforeAdviceInterceptor.invoke(MethodBeforeAdviceInterceptor.java:51)
13-Sep-2017 20:58:41         at org.springframework.aop.framework.ReflectiveMethodInvocation.proceed(ReflectiveMethodInvocation.java:172)
13-Sep-2017 20:58:41         at org.springframework.aop.framework.adapter.MethodBeforeAdviceInterceptor.invoke(MethodBeforeAdviceInterceptor.java:51)
13-Sep-2017 20:58:41         at org.springframework.aop.framework.ReflectiveMethodInvocation.proceed(ReflectiveMethodInvocation.java:172)
13-Sep-2017 20:58:41         at org.springframework.aop.framework.JdkDynamicAopProxy.invoke(JdkDynamicAopProxy.java:204)
13-Sep-2017 20:58:41         at com.sun.proxy.$Proxy71.saveForm(Unknown Source)
13-Sep-2017 20:58:41         at org.openmrs.web.controller.form.FormFormController.onSubmit(FormFormController.java:89)
13-Sep-2017 20:58:41         at org.springframework.web.servlet.mvc.SimpleFormController.processFormSubmission(SimpleFormController.java:272)
13-Sep-2017 20:58:41         at org.springframework.web.servlet.mvc.AbstractFormController.handleRequestInternal(AbstractFormController.java:268)
13-Sep-2017 20:58:41         at org.springframework.web.servlet.mvc.AbstractController.handleRequest(AbstractController.java:153)
13-Sep-2017 20:58:41         at org.openmrs.web.controller.form.FormFormControllerTest.shouldNotSaveAFormWhenFormsAreLocked(FormFormControllerTest.java:67)
13-Sep-2017 20:58:41         at sun.reflect.NativeMethodAccessorImpl.invoke0(Native Method)
13-Sep-2017 20:58:41         at sun.reflect.NativeMethodAccessorImpl.invoke(NativeMethodAccessorImpl.java:57)
13-Sep-2017 20:58:41         at sun.reflect.DelegatingMethodAccessorImpl.invoke(DelegatingMethodAccessorImpl.java:43)
13-Sep-2017 20:58:41         at java.lang.reflect.Method.invoke(Method.java:606)
13-Sep-2017 20:58:41         at org.junit.runners.model.FrameworkMethod$1.runReflectiveCall(FrameworkMethod.java:47)
13-Sep-2017 20:58:41         at org.junit.internal.runners.model.ReflectiveCallable.run(ReflectiveCallable.java:12)
13-Sep-2017 20:58:41         at org.junit.runners.model.FrameworkMethod.invokeExplosively(FrameworkMethod.java:44)
13-Sep-2017 20:58:41         at org.junit.internal.runners.statements.InvokeMethod.evaluate(InvokeMethod.java:17)
13-Sep-2017 20:58:41         at org.junit.internal.runners.statements.RunBefores.evaluate(RunBefores.java:26)
13-Sep-2017 20:58:41         at org.springframework.test.context.junit4.statements.RunBeforeTestMethodCallbacks.evaluate(RunBeforeTestMethodCallbacks.java:74)
13-Sep-2017 20:58:41         at org.junit.internal.runners.statements.RunAfters.evaluate(RunAfters.java:27)
13-Sep-2017 20:58:41         at org.springframework.test.context.junit4.statements.RunAfterTestMethodCallbacks.evaluate(RunAfterTestMethodCallbacks.java:83)
13-Sep-2017 20:58:41         at org.springframework.test.context.junit4.statements.SpringRepeat.evaluate(SpringRepeat.java:72)
13-Sep-2017 20:58:41         at org.springframework.test.context.junit4.SpringJUnit4ClassRunner.runChild(SpringJUnit4ClassRunner.java:231)
13-Sep-2017 20:58:41         at org.springframework.test.context.junit4.SpringJUnit4ClassRunner.runChild(SpringJUnit4ClassRunner.java:88)
13-Sep-2017 20:58:41         at org.junit.runners.ParentRunner$3.run(ParentRunner.java:238)
13-Sep-2017 20:58:41         at org.junit.runners.ParentRunner$1.schedule(ParentRunner.java:63)
13-Sep-2017 20:58:41         at org.junit.runners.ParentRunner.runChildren(ParentRunner.java:236)
13-Sep-2017 20:58:41         at org.junit.runners.ParentRunner.access$000(ParentRunner.java:53)
13-Sep-2017 20:58:41         at org.junit.runners.ParentRunner$2.evaluate(ParentRunner.java:229)
13-Sep-2017 20:58:41         at org.springframework.test.context.junit4.statements.RunBeforeTestClassCallbacks.evaluate(RunBeforeTestClassCallbacks.java:61)
13-Sep-2017 20:58:41         at org.junit.internal.runners.statements.RunAfters.evaluate(RunAfters.java:27)
13-Sep-2017 20:58:41         at org.springframework.test.context.junit4.statements.RunAfterTestClassCallbacks.evaluate(RunAfterTestClassCallbacks.java:71)
13-Sep-2017 20:58:41         at org.junit.runners.ParentRunner.run(ParentRunner.java:309)
13-Sep-2017 20:58:41         at org.springframework.test.context.junit4.SpringJUnit4ClassRunner.run(SpringJUnit4ClassRunner.java:174)
13-Sep-2017 20:58:41         at org.apache.maven.surefire.junit4.JUnit4TestSet.execute(JUnit4TestSet.java:59)
13-Sep-2017 20:58:41         at org.apache.maven.surefire.suite.AbstractDirectoryTestSuite.executeTestSet(AbstractDirectoryTestSuite.java:115)
13-Sep-2017 20:58:41         at org.apache.maven.surefire.suite.AbstractDirectoryTestSuite.execute(AbstractDirectoryTestSuite.java:102)
13-Sep-2017 20:58:41         at org.apache.maven.surefire.Surefire.run(Surefire.java:180)
13-Sep-2017 20:58:41         at sun.reflect.NativeMethodAccessorImpl.invoke0(Native Method)
13-Sep-2017 20:58:41         at sun.reflect.NativeMethodAccessorImpl.invoke(NativeMethodAccessorImpl.java:57)
13-Sep-2017 20:58:41         at sun.reflect.DelegatingMethodAccessorImpl.invoke(DelegatingMethodAccessorImpl.java:43)
13-Sep-2017 20:58:41         at java.lang.reflect.Method.invoke(Method.java:606)
13-Sep-2017 20:58:41         at org.apache.maven.surefire.booter.SurefireBooter.runSuitesInProcess(SurefireBooter.java:350)
13-Sep-2017 20:58:41         at org.apache.maven.surefire.booter.SurefireBooter.main(SurefireBooter.java:1021)
13-Sep-2017 20:58:41 Tests run: 1, Failures: 0, Errors: 0, Skipped: 0, Time elapsed: 0.058 sec
13-Sep-2017 20:58:41 Running org.openmrs.web.servlet.DownloadDictionaryServletTest
13-Sep-2017 20:58:42 Tests run: 5, Failures: 0, Errors: 0, Skipped: 0, Time elapsed: 0.446 sec
13-Sep-2017 20:58:42 Running org.openmrs.web.controller.patient.ShortPatientFormValidatorTest
13-Sep-2017 20:58:42 Tests run: 14, Failures: 0, Errors: 0, Skipped: 0, Time elapsed: 0.609 sec
13-Sep-2017 20:58:42 Running org.openmrs.web.dwr.DWRConceptServiceTest
13-Sep-2017 20:58:45 ERROR - DWRConceptService.findBatchOfConcepts(222) |2017-09-13 20:58:45,106| Error while finding concepts + null
13-Sep-2017 20:58:45 java.lang.NullPointerException
13-Sep-2017 20:58:45         at org.openmrs.api.db.hibernate.HibernateConceptDAO.transformToIds(HibernateConceptDAO.java:1419)
13-Sep-2017 20:58:45         at org.openmrs.api.db.hibernate.HibernateConceptDAO.newConceptNameLuceneQuery(HibernateConceptDAO.java:1385)
13-Sep-2017 20:58:45         at org.openmrs.api.db.hibernate.HibernateConceptDAO.getConcepts(HibernateConceptDAO.java:1341)
13-Sep-2017 20:58:45         at org.openmrs.api.impl.ConceptServiceImpl.getConcepts(ConceptServiceImpl.java:1654)
13-Sep-2017 20:58:45         at sun.reflect.NativeMethodAccessorImpl.invoke0(Native Method)
13-Sep-2017 20:58:45         at sun.reflect.NativeMethodAccessorImpl.invoke(NativeMethodAccessorImpl.java:57)
13-Sep-2017 20:58:45         at sun.reflect.DelegatingMethodAccessorImpl.invoke(DelegatingMethodAccessorImpl.java:43)
13-Sep-2017 20:58:45         at java.lang.reflect.Method.invoke(Method.java:606)
13-Sep-2017 20:58:45         at org.springframework.aop.support.AopUtils.invokeJoinpointUsingReflection(AopUtils.java:317)
13-Sep-2017 20:58:45         at org.springframework.aop.framework.ReflectiveMethodInvocation.invokeJoinpoint(ReflectiveMethodInvocation.java:183)
13-Sep-2017 20:58:45         at org.springframework.aop.framework.ReflectiveMethodInvocation.proceed(ReflectiveMethodInvocation.java:150)
13-Sep-2017 20:58:45         at org.springframework.transaction.interceptor.TransactionInterceptor$1.proceedWithInvocation(TransactionInterceptor.java:96)
13-Sep-2017 20:58:45         at org.springframework.transaction.interceptor.TransactionAspectSupport.invokeWithinTransaction(TransactionAspectSupport.java:260)
13-Sep-2017 20:58:45         at org.springframework.transaction.interceptor.TransactionInterceptor.invoke(TransactionInterceptor.java:94)
13-Sep-2017 20:58:45         at org.springframework.aop.framework.ReflectiveMethodInvocation.proceed(ReflectiveMethodInvocation.java:172)
13-Sep-2017 20:58:45         at org.springframework.aop.framework.JdkDynamicAopProxy.invoke(JdkDynamicAopProxy.java:204)
13-Sep-2017 20:58:45         at com.sun.proxy.$Proxy59.getConcepts(Unknown Source)
13-Sep-2017 20:58:45         at sun.reflect.NativeMethodAccessorImpl.invoke0(Native Method)
13-Sep-2017 20:58:45         at sun.reflect.NativeMethodAccessorImpl.invoke(NativeMethodAccessorImpl.java:57)
13-Sep-2017 20:58:45         at sun.reflect.DelegatingMethodAccessorImpl.invoke(DelegatingMethodAccessorImpl.java:43)
13-Sep-2017 20:58:45         at java.lang.reflect.Method.invoke(Method.java:606)
13-Sep-2017 20:58:45         at org.springframework.aop.support.AopUtils.invokeJoinpointUsingReflection(AopUtils.java:317)
13-Sep-2017 20:58:45         at org.springframework.aop.framework.ReflectiveMethodInvocation.invokeJoinpoint(ReflectiveMethodInvocation.java:183)
13-Sep-2017 20:58:45         at org.springframework.aop.framework.ReflectiveMethodInvocation.proceed(ReflectiveMethodInvocation.java:150)
13-Sep-2017 20:58:45         at org.openmrs.aop.LoggingAdvice.invoke(LoggingAdvice.java:121)
13-Sep-2017 20:58:45         at org.springframework.aop.framework.ReflectiveMethodInvocation.proceed(ReflectiveMethodInvocation.java:172)
13-Sep-2017 20:58:45         at org.springframework.aop.framework.adapter.MethodBeforeAdviceInterceptor.invoke(MethodBeforeAdviceInterceptor.java:51)
13-Sep-2017 20:58:45         at org.springframework.aop.framework.ReflectiveMethodInvocation.proceed(ReflectiveMethodInvocation.java:172)
13-Sep-2017 20:58:45         at org.springframework.aop.framework.adapter.MethodBeforeAdviceInterceptor.invoke(MethodBeforeAdviceInterceptor.java:51)
13-Sep-2017 20:58:45         at org.springframework.aop.framework.ReflectiveMethodInvocation.proceed(ReflectiveMethodInvocation.java:172)
13-Sep-2017 20:58:45         at org.springframework.aop.framework.JdkDynamicAopProxy.invoke(JdkDynamicAopProxy.java:204)
13-Sep-2017 20:58:45         at com.sun.proxy.$Proxy60.getConcepts(Unknown Source)
13-Sep-2017 20:58:45         at org.openmrs.web.dwr.DWRConceptService.findBatchOfConcepts(DWRConceptService.java:199)
13-Sep-2017 20:58:45         at org.openmrs.web.dwr.DWRConceptServiceTest.findBatchOfConcepts_shouldNotReturnConceptByGivenIdIfDatatypeIsNotIncluded(DWRConceptServiceTest.java:151)
13-Sep-2017 20:58:45         at sun.reflect.NativeMethodAccessorImpl.invoke0(Native Method)
13-Sep-2017 20:58:45         at sun.reflect.NativeMethodAccessorImpl.invoke(NativeMethodAccessorImpl.java:57)
13-Sep-2017 20:58:45         at sun.reflect.DelegatingMethodAccessorImpl.invoke(DelegatingMethodAccessorImpl.java:43)
13-Sep-2017 20:58:45         at java.lang.reflect.Method.invoke(Method.java:606)
13-Sep-2017 20:58:45         at org.junit.runners.model.FrameworkMethod$1.runReflectiveCall(FrameworkMethod.java:47)
13-Sep-2017 20:58:45         at org.junit.internal.runners.model.ReflectiveCallable.run(ReflectiveCallable.java:12)
13-Sep-2017 20:58:45         at org.junit.runners.model.FrameworkMethod.invokeExplosively(FrameworkMethod.java:44)
13-Sep-2017 20:58:45         at org.junit.internal.runners.statements.InvokeMethod.evaluate(InvokeMethod.java:17)
13-Sep-2017 20:58:45         at org.junit.internal.runners.statements.RunBefores.evaluate(RunBefores.java:26)
13-Sep-2017 20:58:45         at org.springframework.test.context.junit4.statements.RunBeforeTestMethodCallbacks.evaluate(RunBeforeTestMethodCallbacks.java:74)
13-Sep-2017 20:58:45         at org.junit.internal.runners.statements.RunAfters.evaluate(RunAfters.java:27)
13-Sep-2017 20:58:45         at org.springframework.test.context.junit4.statements.RunAfterTestMethodCallbacks.evaluate(RunAfterTestMethodCallbacks.java:83)
13-Sep-2017 20:58:45         at org.springframework.test.context.junit4.statements.SpringRepeat.evaluate(SpringRepeat.java:72)
13-Sep-2017 20:58:45         at org.springframework.test.context.junit4.SpringJUnit4ClassRunner.runChild(SpringJUnit4ClassRunner.java:231)
13-Sep-2017 20:58:45         at org.springframework.test.context.junit4.SpringJUnit4ClassRunner.runChild(SpringJUnit4ClassRunner.java:88)
13-Sep-2017 20:58:45         at org.junit.runners.ParentRunner$3.run(ParentRunner.java:238)
13-Sep-2017 20:58:45         at org.junit.runners.ParentRunner$1.schedule(ParentRunner.java:63)
13-Sep-2017 20:58:45         at org.junit.runners.ParentRunner.runChildren(ParentRunner.java:236)
13-Sep-2017 20:58:45         at org.junit.runners.ParentRunner.access$000(ParentRunner.java:53)
13-Sep-2017 20:58:45         at org.junit.runners.ParentRunner$2.evaluate(ParentRunner.java:229)
13-Sep-2017 20:58:45         at org.springframework.test.context.junit4.statements.RunBeforeTestClassCallbacks.evaluate(RunBeforeTestClassCallbacks.java:61)
13-Sep-2017 20:58:45         at org.junit.internal.runners.statements.RunAfters.evaluate(RunAfters.java:27)
13-Sep-2017 20:58:45         at org.springframework.test.context.junit4.statements.RunAfterTestClassCallbacks.evaluate(RunAfterTestClassCallbacks.java:71)
13-Sep-2017 20:58:45         at org.junit.runners.ParentRunner.run(ParentRunner.java:309)
13-Sep-2017 20:58:45         at org.springframework.test.context.junit4.SpringJUnit4ClassRunner.run(SpringJUnit4ClassRunner.java:174)
13-Sep-2017 20:58:45         at org.apache.maven.surefire.junit4.JUnit4TestSet.execute(JUnit4TestSet.java:59)
13-Sep-2017 20:58:45         at org.apache.maven.surefire.suite.AbstractDirectoryTestSuite.executeTestSet(AbstractDirectoryTestSuite.java:115)
13-Sep-2017 20:58:45         at org.apache.maven.surefire.suite.AbstractDirectoryTestSuite.execute(AbstractDirectoryTestSuite.java:102)
13-Sep-2017 20:58:45         at org.apache.maven.surefire.Surefire.run(Surefire.java:180)
13-Sep-2017 20:58:45         at sun.reflect.NativeMethodAccessorImpl.invoke0(Native Method)
13-Sep-2017 20:58:45         at sun.reflect.NativeMethodAccessorImpl.invoke(NativeMethodAccessorImpl.java:57)
13-Sep-2017 20:58:45         at sun.reflect.DelegatingMethodAccessorImpl.invoke(DelegatingMethodAccessorImpl.java:43)
13-Sep-2017 20:58:45         at java.lang.reflect.Method.invoke(Method.java:606)
13-Sep-2017 20:58:45         at org.apache.maven.surefire.booter.SurefireBooter.runSuitesInProcess(SurefireBooter.java:350)
13-Sep-2017 20:58:45         at org.apache.maven.surefire.booter.SurefireBooter.main(SurefireBooter.java:1021)
13-Sep-2017 20:58:45 ERROR - DWRConceptService.findBatchOfConcepts(222) |2017-09-13 20:58:45,413| Error while finding concepts + null
13-Sep-2017 20:58:45 java.lang.NullPointerException
13-Sep-2017 20:58:45         at org.openmrs.api.db.hibernate.HibernateConceptDAO.transformToIds(HibernateConceptDAO.java:1419)
13-Sep-2017 20:58:45         at org.openmrs.api.db.hibernate.HibernateConceptDAO.newConceptNameLuceneQuery(HibernateConceptDAO.java:1385)
13-Sep-2017 20:58:45         at org.openmrs.api.db.hibernate.HibernateConceptDAO.getConcepts(HibernateConceptDAO.java:1341)
13-Sep-2017 20:58:45         at org.openmrs.api.impl.ConceptServiceImpl.getConcepts(ConceptServiceImpl.java:1654)
13-Sep-2017 20:58:45         at sun.reflect.NativeMethodAccessorImpl.invoke0(Native Method)
13-Sep-2017 20:58:45         at sun.reflect.NativeMethodAccessorImpl.invoke(NativeMethodAccessorImpl.java:57)
13-Sep-2017 20:58:45         at sun.reflect.DelegatingMethodAccessorImpl.invoke(DelegatingMethodAccessorImpl.java:43)
13-Sep-2017 20:58:45         at java.lang.reflect.Method.invoke(Method.java:606)
13-Sep-2017 20:58:45         at org.springframework.aop.support.AopUtils.invokeJoinpointUsingReflection(AopUtils.java:317)
13-Sep-2017 20:58:45         at org.springframework.aop.framework.ReflectiveMethodInvocation.invokeJoinpoint(ReflectiveMethodInvocation.java:183)
13-Sep-2017 20:58:45         at org.springframework.aop.framework.ReflectiveMethodInvocation.proceed(ReflectiveMethodInvocation.java:150)
13-Sep-2017 20:58:45         at org.springframework.transaction.interceptor.TransactionInterceptor$1.proceedWithInvocation(TransactionInterceptor.java:96)
13-Sep-2017 20:58:45         at org.springframework.transaction.interceptor.TransactionAspectSupport.invokeWithinTransaction(TransactionAspectSupport.java:260)
13-Sep-2017 20:58:45         at org.springframework.transaction.interceptor.TransactionInterceptor.invoke(TransactionInterceptor.java:94)
13-Sep-2017 20:58:45         at org.springframework.aop.framework.ReflectiveMethodInvocation.proceed(ReflectiveMethodInvocation.java:172)
13-Sep-2017 20:58:45         at org.springframework.aop.framework.JdkDynamicAopProxy.invoke(JdkDynamicAopProxy.java:204)
13-Sep-2017 20:58:45         at com.sun.proxy.$Proxy59.getConcepts(Unknown Source)
13-Sep-2017 20:58:45         at sun.reflect.NativeMethodAccessorImpl.invoke0(Native Method)
13-Sep-2017 20:58:45         at sun.reflect.NativeMethodAccessorImpl.invoke(NativeMethodAccessorImpl.java:57)
13-Sep-2017 20:58:45         at sun.reflect.DelegatingMethodAccessorImpl.invoke(DelegatingMethodAccessorImpl.java:43)
13-Sep-2017 20:58:45         at java.lang.reflect.Method.invoke(Method.java:606)
13-Sep-2017 20:58:45         at org.springframework.aop.support.AopUtils.invokeJoinpointUsingReflection(AopUtils.java:317)
13-Sep-2017 20:58:45         at org.springframework.aop.framework.ReflectiveMethodInvocation.invokeJoinpoint(ReflectiveMethodInvocation.java:183)
13-Sep-2017 20:58:45         at org.springframework.aop.framework.ReflectiveMethodInvocation.proceed(ReflectiveMethodInvocation.java:150)
13-Sep-2017 20:58:45         at org.openmrs.aop.LoggingAdvice.invoke(LoggingAdvice.java:121)
13-Sep-2017 20:58:45         at org.springframework.aop.framework.ReflectiveMethodInvocation.proceed(ReflectiveMethodInvocation.java:172)
13-Sep-2017 20:58:45         at org.springframework.aop.framework.adapter.MethodBeforeAdviceInterceptor.invoke(MethodBeforeAdviceInterceptor.java:51)
13-Sep-2017 20:58:45         at org.springframework.aop.framework.ReflectiveMethodInvocation.proceed(ReflectiveMethodInvocation.java:172)
13-Sep-2017 20:58:45         at org.springframework.aop.framework.adapter.MethodBeforeAdviceInterceptor.invoke(MethodBeforeAdviceInterceptor.java:51)
13-Sep-2017 20:58:45         at org.springframework.aop.framework.ReflectiveMethodInvocation.proceed(ReflectiveMethodInvocation.java:172)
13-Sep-2017 20:58:45         at org.springframework.aop.framework.JdkDynamicAopProxy.invoke(JdkDynamicAopProxy.java:204)
13-Sep-2017 20:58:45         at com.sun.proxy.$Proxy60.getConcepts(Unknown Source)
13-Sep-2017 20:58:45         at org.openmrs.web.dwr.DWRConceptService.findBatchOfConcepts(DWRConceptService.java:199)
13-Sep-2017 20:58:45         at org.openmrs.web.dwr.DWRConceptServiceTest.findBatchOfConcepts_shouldNotReturnConceptByGivenIdIfClassnameIsNotIncluded(DWRConceptServiceTest.java:96)
13-Sep-2017 20:58:45         at sun.reflect.NativeMethodAccessorImpl.invoke0(Native Method)
13-Sep-2017 20:58:45         at sun.reflect.NativeMethodAccessorImpl.invoke(NativeMethodAccessorImpl.java:57)
13-Sep-2017 20:58:45         at sun.reflect.DelegatingMethodAccessorImpl.invoke(DelegatingMethodAccessorImpl.java:43)
13-Sep-2017 20:58:45         at java.lang.reflect.Method.invoke(Method.java:606)
13-Sep-2017 20:58:45         at org.junit.runners.model.FrameworkMethod$1.runReflectiveCall(FrameworkMethod.java:47)
13-Sep-2017 20:58:45         at org.junit.internal.runners.model.ReflectiveCallable.run(ReflectiveCallable.java:12)
13-Sep-2017 20:58:45         at org.junit.runners.model.FrameworkMethod.invokeExplosively(FrameworkMethod.java:44)
13-Sep-2017 20:58:45         at org.junit.internal.runners.statements.InvokeMethod.evaluate(InvokeMethod.java:17)
13-Sep-2017 20:58:45         at org.junit.internal.runners.statements.RunBefores.evaluate(RunBefores.java:26)
13-Sep-2017 20:58:45         at org.springframework.test.context.junit4.statements.RunBeforeTestMethodCallbacks.evaluate(RunBeforeTestMethodCallbacks.java:74)
13-Sep-2017 20:58:45         at org.junit.internal.runners.statements.RunAfters.evaluate(RunAfters.java:27)
13-Sep-2017 20:58:45         at org.springframework.test.context.junit4.statements.RunAfterTestMethodCallbacks.evaluate(RunAfterTestMethodCallbacks.java:83)
13-Sep-2017 20:58:45         at org.springframework.test.context.junit4.statements.SpringRepeat.evaluate(SpringRepeat.java:72)
13-Sep-2017 20:58:45         at org.springframework.test.context.junit4.SpringJUnit4ClassRunner.runChild(SpringJUnit4ClassRunner.java:231)
13-Sep-2017 20:58:45         at org.springframework.test.context.junit4.SpringJUnit4ClassRunner.runChild(SpringJUnit4ClassRunner.java:88)
13-Sep-2017 20:58:45         at org.junit.runners.ParentRunner$3.run(ParentRunner.java:238)
13-Sep-2017 20:58:45         at org.junit.runners.ParentRunner$1.schedule(ParentRunner.java:63)
13-Sep-2017 20:58:45         at org.junit.runners.ParentRunner.runChildren(ParentRunner.java:236)
13-Sep-2017 20:58:45         at org.junit.runners.ParentRunner.access$000(ParentRunner.java:53)
13-Sep-2017 20:58:45         at org.junit.runners.ParentRunner$2.evaluate(ParentRunner.java:229)
13-Sep-2017 20:58:45         at org.springframework.test.context.junit4.statements.RunBeforeTestClassCallbacks.evaluate(RunBeforeTestClassCallbacks.java:61)
13-Sep-2017 20:58:45         at org.junit.internal.runners.statements.RunAfters.evaluate(RunAfters.java:27)
13-Sep-2017 20:58:45         at org.springframework.test.context.junit4.statements.RunAfterTestClassCallbacks.evaluate(RunAfterTestClassCallbacks.java:71)
13-Sep-2017 20:58:45         at org.junit.runners.ParentRunner.run(ParentRunner.java:309)
13-Sep-2017 20:58:45         at org.springframework.test.context.junit4.SpringJUnit4ClassRunner.run(SpringJUnit4ClassRunner.java:174)
13-Sep-2017 20:58:45         at org.apache.maven.surefire.junit4.JUnit4TestSet.execute(JUnit4TestSet.java:59)
13-Sep-2017 20:58:45         at org.apache.maven.surefire.suite.AbstractDirectoryTestSuite.executeTestSet(AbstractDirectoryTestSuite.java:115)
13-Sep-2017 20:58:45         at org.apache.maven.surefire.suite.AbstractDirectoryTestSuite.execute(AbstractDirectoryTestSuite.java:102)
13-Sep-2017 20:58:45         at org.apache.maven.surefire.Surefire.run(Surefire.java:180)
13-Sep-2017 20:58:45         at sun.reflect.NativeMethodAccessorImpl.invoke0(Native Method)
13-Sep-2017 20:58:45         at sun.reflect.NativeMethodAccessorImpl.invoke(NativeMethodAccessorImpl.java:57)
13-Sep-2017 20:58:45         at sun.reflect.DelegatingMethodAccessorImpl.invoke(DelegatingMethodAccessorImpl.java:43)
13-Sep-2017 20:58:45         at java.lang.reflect.Method.invoke(Method.java:606)
13-Sep-2017 20:58:45         at org.apache.maven.surefire.booter.SurefireBooter.runSuitesInProcess(SurefireBooter.java:350)
13-Sep-2017 20:58:45         at org.apache.maven.surefire.booter.SurefireBooter.main(SurefireBooter.java:1021)
13-Sep-2017 20:58:45 Tests run: 11, Failures: 0, Errors: 0, Skipped: 0, Time elapsed: 2.736 sec
13-Sep-2017 20:58:45 Running org.openmrs.web.filter.update.util.FilterUtilTest
13-Sep-2017 20:58:45 Tests run: 2, Failures: 0, Errors: 0, Skipped: 2, Time elapsed: 0.003 sec
13-Sep-2017 20:58:45 Running org.openmrs.web.controller.patient.ShortPatientFormControllerTest
13-Sep-2017 20:58:46 Tests run: 14, Failures: 0, Errors: 0, Skipped: 0, Time elapsed: 0.967 sec
13-Sep-2017 20:58:46 Running org.openmrs.web.controller.UserPropertiesTest
13-Sep-2017 20:58:46 Tests run: 6, Failures: 0, Errors: 0, Skipped: 0, Time elapsed: 0.007 sec
13-Sep-2017 20:58:46 Running org.openmrs.web.controller.OptionsFormControllerTest
13-Sep-2017 20:58:46 Tests run: 12, Failures: 0, Errors: 0, Skipped: 0, Time elapsed: 0.426 sec
13-Sep-2017 20:58:46 Running org.openmrs.web.dwr.PersonListItemTest
13-Sep-2017 20:58:47 Tests run: 8, Failures: 0, Errors: 0, Skipped: 0, Time elapsed: 0.183 sec
13-Sep-2017 20:58:47 Running org.openmrs.web.controller.encounter.EncounterTypeFormControllerTest
13-Sep-2017 20:58:47 Tests run: 2, Failures: 0, Errors: 0, Skipped: 0, Time elapsed: 0.044 sec
13-Sep-2017 20:58:47 Running org.openmrs.web.taglib.PortletTagTest
13-Sep-2017 20:58:48 SLF4J: Class path contains multiple SLF4J bindings.
13-Sep-2017 20:58:48 SLF4J: Found binding in [jar:file:/home/bamboo-agent-2/.m2/repository/org/slf4j/slf4j-log4j12/1.6.0/slf4j-log4j12-1.6.0.jar!/org/slf4j/impl/StaticLoggerBinder.class]
13-Sep-2017 20:58:48 SLF4J: Found binding in [jar:file:/home/bamboo-agent-2/.m2/repository/org/slf4j/slf4j-log4j12/1.6.0/slf4j-log4j12-1.6.0.jar!/org/slf4j/impl/StaticLoggerBinder.class]
13-Sep-2017 20:58:48 SLF4J: See http://www.slf4j.org/codes.html#multiple_bindings for an explanation.
13-Sep-2017 20:58:48 Tests run: 7, Failures: 0, Errors: 0, Skipped: 0, Time elapsed: 1.463 sec
13-Sep-2017 20:58:48 Running org.openmrs.web.obs.ObsFormControllerTest
13-Sep-2017 20:58:48 Tests run: 2, Failures: 0, Errors: 0, Skipped: 0, Time elapsed: 0.07 sec
13-Sep-2017 20:58:48 Running org.openmrs.web.encounter.EncounterDisplayControllerTest
13-Sep-2017 20:58:48 Tests run: 2, Failures: 0, Errors: 0, Skipped: 0, Time elapsed: 0.158 sec
13-Sep-2017 20:58:48 Running org.openmrs.web.controller.concept.ConceptStopWordListControllerTest
13-Sep-2017 20:58:48 Tests run: 5, Failures: 0, Errors: 0, Skipped: 0, Time elapsed: 0.078 sec
13-Sep-2017 20:58:48 Running org.openmrs.web.controller.maintenance.SearchIndexControllerTest
13-Sep-2017 20:58:49 Tests run: 3, Failures: 0, Errors: 0, Skipped: 0, Time elapsed: 0.045 sec
13-Sep-2017 20:58:49 Running org.openmrs.web.controller.form.FieldFormControllerTest
13-Sep-2017 20:58:49 Tests run: 3, Failures: 0, Errors: 0, Skipped: 0, Time elapsed: 0.094 sec
13-Sep-2017 20:58:49 Running org.openmrs.web.controller.form.FieldTypeListControllerTest
13-Sep-2017 20:58:49 ERROR - JDBCExceptionReporter.logExceptions(234) |2017-09-13 20:58:49,141| Referential integrity constraint violation: "FK5CEA0FA808FB57F: PUBLIC.FIELD FOREIGN KEY(FIELD_TYPE) REFERENCES PUBLIC.FIELD_TYPE(FIELD_TYPE_ID) (1)"; SQL statement:
13-Sep-2017 20:58:49 delete from field_type where field_type_id=? [23503-187]
13-Sep-2017 20:58:49 ERROR - JDBCExceptionReporter.logExceptions(234) |2017-09-13 20:58:49,143| Referential integrity constraint violation: "FK5CEA0FA808FB57F: PUBLIC.FIELD FOREIGN KEY(FIELD_TYPE) REFERENCES PUBLIC.FIELD_TYPE(FIELD_TYPE_ID) (1)"; SQL statement:
13-Sep-2017 20:58:49 delete from field_type where field_type_id=? [23503-187]
13-Sep-2017 20:58:49 ERROR - FieldTypeListController.onSubmit(85) |2017-09-13 20:58:49,145| Unable to delete a field type because it is in use. fieldTypeId: 1
13-Sep-2017 20:58:49 org.springframework.dao.DataIntegrityViolationException: Could not execute JDBC batch update; SQL [delete from field_type where field_type_id=?]; constraint ["FK5CEA0FA808FB57F: PUBLIC.FIELD FOREIGN KEY(FIELD_TYPE) REFERENCES PUBLIC.FIELD_TYPE(FIELD_TYPE_ID) (1)"; SQL statement:
13-Sep-2017 20:58:49 delete from field_type where field_type_id=? [23503-187]]; nested exception is org.hibernate.exception.ConstraintViolationException: Could not execute JDBC batch update
13-Sep-2017 20:58:49         at org.springframework.orm.hibernate3.SessionFactoryUtils.convertHibernateAccessException(SessionFactoryUtils.java:645)
13-Sep-2017 20:58:49         at org.springframework.orm.hibernate3.HibernateTransactionManager.convertHibernateAccessException(HibernateTransactionManager.java:794)
13-Sep-2017 20:58:49         at org.springframework.orm.hibernate3.HibernateTransactionManager.doCommit(HibernateTransactionManager.java:665)
13-Sep-2017 20:58:49         at org.springframework.transaction.support.AbstractPlatformTransactionManager.processCommit(AbstractPlatformTransactionManager.java:755)
13-Sep-2017 20:58:49         at org.springframework.transaction.support.AbstractPlatformTransactionManager.commit(AbstractPlatformTransactionManager.java:724)
13-Sep-2017 20:58:49         at org.springframework.transaction.interceptor.TransactionAspectSupport.commitTransactionAfterReturning(TransactionAspectSupport.java:475)
13-Sep-2017 20:58:49         at org.springframework.transaction.interceptor.TransactionAspectSupport.invokeWithinTransaction(TransactionAspectSupport.java:270)
13-Sep-2017 20:58:49         at org.springframework.transaction.interceptor.TransactionInterceptor.invoke(TransactionInterceptor.java:94)
13-Sep-2017 20:58:49         at org.springframework.aop.framework.ReflectiveMethodInvocation.proceed(ReflectiveMethodInvocation.java:172)
13-Sep-2017 20:58:49         at org.springframework.aop.framework.JdkDynamicAopProxy.invoke(JdkDynamicAopProxy.java:204)
13-Sep-2017 20:58:49         at com.sun.proxy.$Proxy70.purgeFieldType(Unknown Source)
13-Sep-2017 20:58:49         at sun.reflect.NativeMethodAccessorImpl.invoke0(Native Method)
13-Sep-2017 20:58:49         at sun.reflect.NativeMethodAccessorImpl.invoke(NativeMethodAccessorImpl.java:57)
13-Sep-2017 20:58:49         at sun.reflect.DelegatingMethodAccessorImpl.invoke(DelegatingMethodAccessorImpl.java:43)
13-Sep-2017 20:58:49         at java.lang.reflect.Method.invoke(Method.java:606)
13-Sep-2017 20:58:49         at org.springframework.aop.support.AopUtils.invokeJoinpointUsingReflection(AopUtils.java:317)
13-Sep-2017 20:58:49         at org.springframework.aop.framework.ReflectiveMethodInvocation.invokeJoinpoint(ReflectiveMethodInvocation.java:183)
13-Sep-2017 20:58:49         at org.springframework.aop.framework.ReflectiveMethodInvocation.proceed(ReflectiveMethodInvocation.java:150)
13-Sep-2017 20:58:49         at org.openmrs.aop.LoggingAdvice.invoke(LoggingAdvice.java:121)
13-Sep-2017 20:58:49         at org.springframework.aop.framework.ReflectiveMethodInvocation.proceed(ReflectiveMethodInvocation.java:172)
13-Sep-2017 20:58:49         at org.springframework.aop.framework.adapter.MethodBeforeAdviceInterceptor.invoke(MethodBeforeAdviceInterceptor.java:51)
13-Sep-2017 20:58:49         at org.springframework.aop.framework.ReflectiveMethodInvocation.proceed(ReflectiveMethodInvocation.java:172)
13-Sep-2017 20:58:49         at org.springframework.aop.framework.adapter.MethodBeforeAdviceInterceptor.invoke(MethodBeforeAdviceInterceptor.java:51)
13-Sep-2017 20:58:49         at org.springframework.aop.framework.ReflectiveMethodInvocation.proceed(ReflectiveMethodInvocation.java:172)
13-Sep-2017 20:58:49         at org.springframework.aop.framework.JdkDynamicAopProxy.invoke(JdkDynamicAopProxy.java:204)
13-Sep-2017 20:58:49         at com.sun.proxy.$Proxy71.purgeFieldType(Unknown Source)
13-Sep-2017 20:58:49         at org.openmrs.web.controller.form.FieldTypeListController.onSubmit(FieldTypeListController.java:71)
13-Sep-2017 20:58:49         at org.springframework.web.servlet.mvc.SimpleFormController.processFormSubmission(SimpleFormController.java:272)
13-Sep-2017 20:58:49         at org.springframework.web.servlet.mvc.AbstractFormController.handleRequestInternal(AbstractFormController.java:268)
13-Sep-2017 20:58:49         at org.springframework.web.servlet.mvc.AbstractController.handleRequest(AbstractController.java:153)
13-Sep-2017 20:58:49         at org.springframework.web.servlet.mvc.SimpleControllerHandlerAdapter.handle(SimpleControllerHandlerAdapter.java:48)
13-Sep-2017 20:58:49         at org.openmrs.web.test.WebTestHelper.handle(WebTestHelper.java:127)
13-Sep-2017 20:58:49         at org.openmrs.web.controller.form.FieldTypeListControllerTest.onSubmit_shouldDisplayAUserFriendlyErrorMessage(FieldTypeListControllerTest.java:44)
13-Sep-2017 20:58:49         at sun.reflect.NativeMethodAccessorImpl.invoke0(Native Method)
13-Sep-2017 20:58:49         at sun.reflect.NativeMethodAccessorImpl.invoke(NativeMethodAccessorImpl.java:57)
13-Sep-2017 20:58:49         at sun.reflect.DelegatingMethodAccessorImpl.invoke(DelegatingMethodAccessorImpl.java:43)
13-Sep-2017 20:58:49         at java.lang.reflect.Method.invoke(Method.java:606)
13-Sep-2017 20:58:49         at org.junit.runners.model.FrameworkMethod$1.runReflectiveCall(FrameworkMethod.java:47)
13-Sep-2017 20:58:49         at org.junit.internal.runners.model.ReflectiveCallable.run(ReflectiveCallable.java:12)
13-Sep-2017 20:58:49         at org.junit.runners.model.FrameworkMethod.invokeExplosively(FrameworkMethod.java:44)
13-Sep-2017 20:58:49         at org.junit.internal.runners.statements.InvokeMethod.evaluate(InvokeMethod.java:17)
13-Sep-2017 20:58:49         at org.junit.internal.runners.statements.RunBefores.evaluate(RunBefores.java:26)
13-Sep-2017 20:58:49         at org.springframework.test.context.junit4.statements.RunBeforeTestMethodCallbacks.evaluate(RunBeforeTestMethodCallbacks.java:74)
13-Sep-2017 20:58:49         at org.junit.internal.runners.statements.RunAfters.evaluate(RunAfters.java:27)
13-Sep-2017 20:58:49         at org.springframework.test.context.junit4.statements.RunAfterTestMethodCallbacks.evaluate(RunAfterTestMethodCallbacks.java:83)
13-Sep-2017 20:58:49         at org.springframework.test.context.junit4.statements.SpringRepeat.evaluate(SpringRepeat.java:72)
13-Sep-2017 20:58:49         at org.springframework.test.context.junit4.SpringJUnit4ClassRunner.runChild(SpringJUnit4ClassRunner.java:231)
13-Sep-2017 20:58:49         at org.springframework.test.context.junit4.SpringJUnit4ClassRunner.runChild(SpringJUnit4ClassRunner.java:88)
13-Sep-2017 20:58:49         at org.junit.runners.ParentRunner$3.run(ParentRunner.java:238)
13-Sep-2017 20:58:49         at org.junit.runners.ParentRunner$1.schedule(ParentRunner.java:63)
13-Sep-2017 20:58:49         at org.junit.runners.ParentRunner.runChildren(ParentRunner.java:236)
13-Sep-2017 20:58:49         at org.junit.runners.ParentRunner.access$000(ParentRunner.java:53)
13-Sep-2017 20:58:49         at org.junit.runners.ParentRunner$2.evaluate(ParentRunner.java:229)
13-Sep-2017 20:58:49         at org.springframework.test.context.junit4.statements.RunBeforeTestClassCallbacks.evaluate(RunBeforeTestClassCallbacks.java:61)
13-Sep-2017 20:58:49         at org.junit.internal.runners.statements.RunAfters.evaluate(RunAfters.java:27)
13-Sep-2017 20:58:49         at org.springframework.test.context.junit4.statements.RunAfterTestClassCallbacks.evaluate(RunAfterTestClassCallbacks.java:71)
13-Sep-2017 20:58:49         at org.junit.runners.ParentRunner.run(ParentRunner.java:309)
13-Sep-2017 20:58:49         at org.springframework.test.context.junit4.SpringJUnit4ClassRunner.run(SpringJUnit4ClassRunner.java:174)
13-Sep-2017 20:58:49         at org.apache.maven.surefire.junit4.JUnit4TestSet.execute(JUnit4TestSet.java:59)
13-Sep-2017 20:58:49         at org.apache.maven.surefire.suite.AbstractDirectoryTestSuite.executeTestSet(AbstractDirectoryTestSuite.java:115)
13-Sep-2017 20:58:49         at org.apache.maven.surefire.suite.AbstractDirectoryTestSuite.execute(AbstractDirectoryTestSuite.java:102)
13-Sep-2017 20:58:49         at org.apache.maven.surefire.Surefire.run(Surefire.java:180)
13-Sep-2017 20:58:49         at sun.reflect.NativeMethodAccessorImpl.invoke0(Native Method)
13-Sep-2017 20:58:49         at sun.reflect.NativeMethodAccessorImpl.invoke(NativeMethodAccessorImpl.java:57)
13-Sep-2017 20:58:49         at sun.reflect.DelegatingMethodAccessorImpl.invoke(DelegatingMethodAccessorImpl.java:43)
13-Sep-2017 20:58:49         at java.lang.reflect.Method.invoke(Method.java:606)
13-Sep-2017 20:58:49         at org.apache.maven.surefire.booter.SurefireBooter.runSuitesInProcess(SurefireBooter.java:350)
13-Sep-2017 20:58:49         at org.apache.maven.surefire.booter.SurefireBooter.main(SurefireBooter.java:1021)
13-Sep-2017 20:58:49 Caused by: org.hibernate.exception.ConstraintViolationException: Could not execute JDBC batch update
13-Sep-2017 20:58:49         at org.hibernate.exception.SQLStateConverter.convert(SQLStateConverter.java:96)
13-Sep-2017 20:58:49         at org.hibernate.exception.JDBCExceptionHelper.convert(JDBCExceptionHelper.java:66)
13-Sep-2017 20:58:49         at org.hibernate.jdbc.AbstractBatcher.executeBatch(AbstractBatcher.java:275)
13-Sep-2017 20:58:49         at org.hibernate.engine.ActionQueue.executeActions(ActionQueue.java:268)
13-Sep-2017 20:58:49         at org.hibernate.engine.ActionQueue.executeActions(ActionQueue.java:189)
13-Sep-2017 20:58:49         at org.hibernate.event.def.AbstractFlushingEventListener.performExecutions(AbstractFlushingEventListener.java:321)
13-Sep-2017 20:58:49         at org.hibernate.event.def.DefaultFlushEventListener.onFlush(DefaultFlushEventListener.java:51)
13-Sep-2017 20:58:49         at org.hibernate.impl.SessionImpl.flush(SessionImpl.java:1216)
13-Sep-2017 20:58:49         at org.hibernate.impl.SessionImpl.managedFlush(SessionImpl.java:383)
13-Sep-2017 20:58:49         at org.hibernate.transaction.JDBCTransaction.commit(JDBCTransaction.java:133)
13-Sep-2017 20:58:49         at org.springframework.orm.hibernate3.HibernateTransactionManager.doCommit(HibernateTransactionManager.java:657)
13-Sep-2017 20:58:49         ... 65 more
13-Sep-2017 20:58:49 Caused by: org.h2.jdbc.JdbcBatchUpdateException: Referential integrity constraint violation: "FK5CEA0FA808FB57F: PUBLIC.FIELD FOREIGN KEY(FIELD_TYPE) REFERENCES PUBLIC.FIELD_TYPE(FIELD_TYPE_ID) (1)"; SQL statement:
13-Sep-2017 20:58:49 delete from field_type where field_type_id=? [23503-187]
13-Sep-2017 20:58:49         at org.h2.jdbc.JdbcPreparedStatement.executeBatch(JdbcPreparedStatement.java:1198)
13-Sep-2017 20:58:49         at com.mchange.v2.c3p0.impl.NewProxyPreparedStatement.executeBatch(NewProxyPreparedStatement.java:1723)
13-Sep-2017 20:58:49         at org.hibernate.jdbc.BatchingBatcher.doExecuteBatch(BatchingBatcher.java:70)
13-Sep-2017 20:58:49         at org.hibernate.jdbc.AbstractBatcher.executeBatch(AbstractBatcher.java:268)
13-Sep-2017 20:58:49         ... 73 more
13-Sep-2017 20:58:49 Tests run: 1, Failures: 0, Errors: 0, Skipped: 0, Time elapsed: 0.063 sec
13-Sep-2017 20:58:49 Running org.openmrs.web.controller.maintenance.GlobalPropertyControllerTest
13-Sep-2017 20:58:49 Tests run: 2, Failures: 0, Errors: 0, Skipped: 0, Time elapsed: 0.109 sec
13-Sep-2017 20:58:49 Running org.openmrs.web.controller.PortletControllerTest
13-Sep-2017 20:58:49 Tests run: 2, Failures: 0, Errors: 0, Skipped: 0, Time elapsed: 0.16 sec
13-Sep-2017 20:58:49 Running org.openmrs.web.controller.program.ProgramFormControllerTest
13-Sep-2017 20:58:49 Tests run: 1, Failures: 0, Errors: 0, Skipped: 0, Time elapsed: 0.13 sec
13-Sep-2017 20:58:49 Running org.openmrs.web.taglib.FormatTagTest
13-Sep-2017 20:58:49 Tests run: 3, Failures: 0, Errors: 0, Skipped: 0, Time elapsed: 0.131 sec
13-Sep-2017 20:58:49 Running org.openmrs.scheduler.web.controller.TaskHelperTest
13-Sep-2017 20:58:51 Tests run: 6, Failures: 0, Errors: 0, Skipped: 0, Time elapsed: 1.707 sec
13-Sep-2017 20:58:51 Running org.openmrs.web.controller.maintenance.SystemInformationControllerTest
13-Sep-2017 20:58:51 Tests run: 5, Failures: 0, Errors: 0, Skipped: 0, Time elapsed: 0.07 sec
13-Sep-2017 20:58:51 Running org.openmrs.web.controller.GlobalPropertyPortletControllerTest
13-Sep-2017 20:58:51 Tests run: 4, Failures: 0, Errors: 0, Skipped: 0, Time elapsed: 0.058 sec
13-Sep-2017 20:58:51 Running org.openmrs.web.controller.encounter.EncounterTypeListControllerTest
13-Sep-2017 20:58:51 Tests run: 1, Failures: 0, Errors: 0, Skipped: 0, Time elapsed: 0.022 sec
13-Sep-2017 20:58:51 Running org.openmrs.module.web.controller.ModuleListControllerTest
13-Sep-2017 20:58:51 Tests run: 1, Failures: 0, Errors: 0, Skipped: 0, Time elapsed: 0.003 sec
13-Sep-2017 20:58:51 Running org.openmrs.web.dwr.DeprecationCheckTest
13-Sep-2017 20:58:51 Tests run: 1, Failures: 0, Errors: 0, Skipped: 0, Time elapsed: 0.031 sec
13-Sep-2017 20:58:51 Running org.openmrs.web.controller.ConceptFormControllerTest
13-Sep-2017 20:58:52 WARN - HibernateConceptDAO.getConceptByName(1742) |2017-09-13 20:58:52,044| Multiple concepts found for 'new concept'
13-Sep-2017 20:58:52 WARN - HibernateConceptDAO.getConceptByName(1742) |2017-09-13 20:58:52,319| Multiple concepts found for 'no such concept'
13-Sep-2017 20:58:52 WARN - HibernateConceptDAO.getConceptByName(1742) |2017-09-13 20:58:52,521| Multiple concepts found for 'no such concept'
13-Sep-2017 20:58:52 WARN - HibernateConceptDAO.getConceptByName(1742) |2017-09-13 20:58:52,994| Multiple concepts found for 'no such concept'
13-Sep-2017 20:58:54 WARN - HibernateConceptDAO.getConceptByName(1742) |2017-09-13 20:58:54,286| Multiple concepts found for 'no such concept'
13-Sep-2017 20:58:54 WARN - HibernateConceptDAO.getConceptByName(1742) |2017-09-13 20:58:54,769| Multiple concepts found for 'no such concept'
13-Sep-2017 20:58:54 WARN - HibernateConceptDAO.getConceptByName(1742) |2017-09-13 20:58:54,884| Multiple concepts found for 'no such concept'
13-Sep-2017 20:58:55 WARN - HibernateConceptDAO.getConceptByName(1742) |2017-09-13 20:58:55,628| Multiple concepts found for 'no such concept'
13-Sep-2017 20:58:55 Tests run: 31, Failures: 0, Errors: 0, Skipped: 0, Time elapsed: 4.163 sec
13-Sep-2017 20:58:55 Running org.openmrs.web.dwr.ConceptListItemTest
13-Sep-2017 20:58:55 Tests run: 4, Failures: 0, Errors: 0, Skipped: 0, Time elapsed: 0.004 sec
13-Sep-2017 20:58:55 Running org.openmrs.web.dwr.DWRProgramWorkflowServiceTest
13-Sep-2017 20:58:56 Tests run: 4, Failures: 0, Errors: 0, Skipped: 0, Time elapsed: 0.319 sec
13-Sep-2017 20:58:56 Running org.openmrs.module.web.extension.ExtensionUtilTest
13-Sep-2017 20:58:56 SLF4J: Class path contains multiple SLF4J bindings.
13-Sep-2017 20:58:56 SLF4J: Found binding in [jar:file:/home/bamboo-agent-2/.m2/repository/org/slf4j/slf4j-log4j12/1.6.0/slf4j-log4j12-1.6.0.jar!/org/slf4j/impl/StaticLoggerBinder.class]
13-Sep-2017 20:58:56 SLF4J: Found binding in [jar:file:/home/bamboo-agent-2/.m2/repository/org/slf4j/slf4j-log4j12/1.6.0/slf4j-log4j12-1.6.0.jar!/org/slf4j/impl/StaticLoggerBinder.class]
13-Sep-2017 20:58:56 SLF4J: See http://www.slf4j.org/codes.html#multiple_bindings for an explanation.
13-Sep-2017 20:58:57 Tests run: 2, Failures: 0, Errors: 0, Skipped: 0, Time elapsed: 1.259 sec
13-Sep-2017 20:58:57 Running org.openmrs.web.dwr.DWRProviderServiceTest
13-Sep-2017 20:58:57 Tests run: 4, Failures: 0, Errors: 0, Skipped: 1, Time elapsed: 0.138 sec
13-Sep-2017 20:58:57 Running org.openmrs.web.dwr.DWRPersonServiceTest
13-Sep-2017 20:58:57 Tests run: 2, Failures: 0, Errors: 0, Skipped: 0, Time elapsed: 0.08 sec
13-Sep-2017 20:58:57 Running org.openmrs.web.filter.update.GZIPFilterTest
13-Sep-2017 20:58:57 Tests run: 1, Failures: 0, Errors: 0, Skipped: 0, Time elapsed: 0.069 sec
13-Sep-2017 20:58:57 Running org.openmrs.web.controller.encounter.EncounterRoleFormControllerTest
13-Sep-2017 20:58:58 Tests run: 8, Failures: 0, Errors: 0, Skipped: 0, Time elapsed: 0.542 sec
13-Sep-2017 20:58:58 Running org.openmrs.web.taglib.OpenmrsMessageTagTest
13-Sep-2017 20:58:58 Tests run: 8, Failures: 0, Errors: 0, Skipped: 0, Time elapsed: 0.129 sec
13-Sep-2017 20:58:58 Running org.openmrs.web.controller.concept.ConceptProposalFormControllerTest
13-Sep-2017 20:58:58 Tests run: 1, Failures: 0, Errors: 0, Skipped: 0, Time elapsed: 0.087 sec
13-Sep-2017 20:58:58 Running org.openmrs.web.controller.provider.ProviderFormControllerTest
13-Sep-2017 20:58:58 Tests run: 2, Failures: 0, Errors: 0, Skipped: 0, Time elapsed: 0.092 sec
13-Sep-2017 20:58:58 Running org.openmrs.web.controller.user.UserListControllerTest
13-Sep-2017 20:58:58 Tests run: 4, Failures: 0, Errors: 0, Skipped: 0, Time elapsed: 0.101 sec
13-Sep-2017 20:58:58
13-Sep-2017 20:58:58 Results :
13-Sep-2017 20:58:58
13-Sep-2017 20:58:58 Tests run: 317, Failures: 0, Errors: 0, Skipped: 6
13-Sep-2017 20:58:58
13-Sep-2017 20:58:58 [INFO]
13-Sep-2017 20:58:58 [INFO] --- maven-jar-plugin:2.3.2:jar (default-jar) @ openmrs-web ---
13-Sep-2017 20:58:58 [INFO] Building jar: /home/bamboo-agent-2/bamboo-agent/xml-data/build-dir/TRUNK-OC12-JOB1/web/target/openmrs-web-1.12.1-SNAPSHOT.jar
13-Sep-2017 20:58:59 [INFO]
13-Sep-2017 20:58:59 [INFO] --- maven-jar-plugin:2.3.2:test-jar (default) @ openmrs-web ---
13-Sep-2017 20:58:59 [INFO] Building jar: /home/bamboo-agent-2/bamboo-agent/xml-data/build-dir/TRUNK-OC12-JOB1/web/target/openmrs-web-1.12.1-SNAPSHOT-tests.jar
13-Sep-2017 20:58:59 [INFO]
13-Sep-2017 20:58:59 [INFO] --- license-maven-plugin:2.6:check (default) @ openmrs-web ---
13-Sep-2017 20:58:59 [INFO] Checking licenses...
13-Sep-2017 20:58:59 [INFO]
13-Sep-2017 20:58:59 [INFO] --- animal-sniffer-maven-plugin:1.14:check (check-java-version) @ openmrs-web ---
13-Sep-2017 20:58:59 [INFO] Checking unresolved references to org.codehaus.mojo.signature:java16:1.1
13-Sep-2017 20:59:03 [INFO]
13-Sep-2017 20:59:03 [INFO] --- maven-install-plugin:2.4:install (default-install) @ openmrs-web ---
13-Sep-2017 20:59:03 [INFO] Installing /home/bamboo-agent-2/bamboo-agent/xml-data/build-dir/TRUNK-OC12-JOB1/web/target/openmrs-web-1.12.1-SNAPSHOT.jar to /home/bamboo-agent-2/.m2/repository/org/openmrs/web/openmrs-web/1.12.1-SNAPSHOT/openmrs-web-1.12.1-SNAPSHOT.jar
13-Sep-2017 20:59:03 [INFO] Installing /home/bamboo-agent-2/bamboo-agent/xml-data/build-dir/TRUNK-OC12-JOB1/web/pom.xml to /home/bamboo-agent-2/.m2/repository/org/openmrs/web/openmrs-web/1.12.1-SNAPSHOT/openmrs-web-1.12.1-SNAPSHOT.pom
13-Sep-2017 20:59:03 [INFO] Installing /home/bamboo-agent-2/bamboo-agent/xml-data/build-dir/TRUNK-OC12-JOB1/web/target/openmrs-web-1.12.1-SNAPSHOT-tests.jar to /home/bamboo-agent-2/.m2/repository/org/openmrs/web/openmrs-web/1.12.1-SNAPSHOT/openmrs-web-1.12.1-SNAPSHOT-tests.jar
13-Sep-2017 20:59:03 [INFO]
13-Sep-2017 20:59:03 [INFO] --- maven-deploy-plugin:2.7:deploy (default-deploy) @ openmrs-web ---
13-Sep-2017 20:59:03 [INFO] Downloading: http://mavenrepo.openmrs.org/nexus/content/repositories/snapshots/org/openmrs/web/openmrs-web/1.12.1-SNAPSHOT/maven-metadata.xml
13-Sep-2017 20:59:03 [INFO] Downloaded: http://mavenrepo.openmrs.org/nexus/content/repositories/snapshots/org/openmrs/web/openmrs-web/1.12.1-SNAPSHOT/maven-metadata.xml (339 B at 1.2 KB/sec)
13-Sep-2017 20:59:03 [INFO] Uploading: http://mavenrepo.openmrs.org/nexus/content/repositories/snapshots/org/openmrs/web/openmrs-web/1.12.1-SNAPSHOT/openmrs-web-1.12.1-20170913.205903-2.jar
13-Sep-2017 20:59:04 [INFO] Uploaded: http://mavenrepo.openmrs.org/nexus/content/repositories/snapshots/org/openmrs/web/openmrs-web/1.12.1-SNAPSHOT/openmrs-web-1.12.1-20170913.205903-2.jar (850 KB at 787.7 KB/sec)
13-Sep-2017 20:59:04 [INFO] Uploading: http://mavenrepo.openmrs.org/nexus/content/repositories/snapshots/org/openmrs/web/openmrs-web/1.12.1-SNAPSHOT/openmrs-web-1.12.1-20170913.205903-2.pom
13-Sep-2017 20:59:05 [INFO] Uploaded: http://mavenrepo.openmrs.org/nexus/content/repositories/snapshots/org/openmrs/web/openmrs-web/1.12.1-SNAPSHOT/openmrs-web-1.12.1-20170913.205903-2.pom (6 KB at 11.3 KB/sec)
13-Sep-2017 20:59:05 [INFO] Downloading: http://mavenrepo.openmrs.org/nexus/content/repositories/snapshots/org/openmrs/web/openmrs-web/maven-metadata.xml
13-Sep-2017 20:59:05 [INFO] Downloaded: http://mavenrepo.openmrs.org/nexus/content/repositories/snapshots/org/openmrs/web/openmrs-web/maven-metadata.xml (2 KB at 4.1 KB/sec)
13-Sep-2017 20:59:05 [INFO] Uploading: http://mavenrepo.openmrs.org/nexus/content/repositories/snapshots/org/openmrs/web/openmrs-web/1.12.1-SNAPSHOT/maven-metadata.xml
13-Sep-2017 20:59:06 [INFO] Uploaded: http://mavenrepo.openmrs.org/nexus/content/repositories/snapshots/org/openmrs/web/openmrs-web/1.12.1-SNAPSHOT/maven-metadata.xml (779 B at 2.1 KB/sec)
13-Sep-2017 20:59:06 [INFO] Uploading: http://mavenrepo.openmrs.org/nexus/content/repositories/snapshots/org/openmrs/web/openmrs-web/maven-metadata.xml
13-Sep-2017 20:59:06 [INFO] Uploaded: http://mavenrepo.openmrs.org/nexus/content/repositories/snapshots/org/openmrs/web/openmrs-web/maven-metadata.xml (989 B at 2.4 KB/sec)
13-Sep-2017 20:59:06 [INFO] Uploading: http://mavenrepo.openmrs.org/nexus/content/repositories/snapshots/org/openmrs/web/openmrs-web/1.12.1-SNAPSHOT/openmrs-web-1.12.1-20170913.205903-2-tests.jar
13-Sep-2017 20:59:06 [INFO] Uploaded: http://mavenrepo.openmrs.org/nexus/content/repositories/snapshots/org/openmrs/web/openmrs-web/1.12.1-SNAPSHOT/openmrs-web-1.12.1-20170913.205903-2-tests.jar (192 KB at 424.0 KB/sec)
13-Sep-2017 20:59:06 [INFO] Uploading: http://mavenrepo.openmrs.org/nexus/content/repositories/snapshots/org/openmrs/web/openmrs-web/1.12.1-SNAPSHOT/maven-metadata.xml
13-Sep-2017 20:59:07 [INFO] Uploaded: http://mavenrepo.openmrs.org/nexus/content/repositories/snapshots/org/openmrs/web/openmrs-web/1.12.1-SNAPSHOT/maven-metadata.xml (992 B at 2.7 KB/sec)
13-Sep-2017 20:59:07 [INFO]                                                                         
13-Sep-2017 20:59:07 [INFO] ------------------------------------------------------------------------
13-Sep-2017 20:59:07 [INFO] Building openmrs-webapp 1.12.1-SNAPSHOT
13-Sep-2017 20:59:07 [INFO] ------------------------------------------------------------------------
13-Sep-2017 20:59:07 [INFO]
13-Sep-2017 20:59:07 [INFO] --- maven-clean-plugin:2.5:clean (default-clean) @ openmrs-webapp ---
13-Sep-2017 20:59:07 [INFO]
13-Sep-2017 20:59:07 [INFO] --- buildnumber-maven-plugin:1.1:create (default) @ openmrs-webapp ---
13-Sep-2017 20:59:07 [INFO]
13-Sep-2017 20:59:07 [INFO] --- build-helper-maven-plugin:1.5:parse-version (parse-version) @ openmrs-webapp ---
13-Sep-2017 20:59:07 [INFO]
13-Sep-2017 20:59:07 [INFO] --- maven-resources-plugin:2.4:resources (default-resources) @ openmrs-webapp ---
13-Sep-2017 20:59:07 [INFO] Using 'UTF-8' encoding to copy filtered resources.
13-Sep-2017 20:59:07 [INFO] Copying 7 resources
13-Sep-2017 20:59:07 [INFO] Copying 1 resource to ../jetty
13-Sep-2017 20:59:07 [INFO]
13-Sep-2017 20:59:07 [INFO] --- maven-antrun-plugin:1.4:run (default) @ openmrs-webapp ---
13-Sep-2017 20:59:07 project.artifactId
13-Sep-2017 20:59:08 [INFO] Executing tasks
13-Sep-2017 20:59:08     [unzip] Expanding: /home/bamboo-agent-2/bamboo-agent/xml-data/build-dir/TRUNK-OC12-JOB1/webapp/src/main/resources/liquibase-demo-data.zip into /home/bamboo-agent-2/bamboo-agent/xml-data/build-dir/TRUNK-OC12-JOB1/webapp/target/classes
13-Sep-2017 20:59:08 [INFO] Executed tasks
13-Sep-2017 20:59:08 [INFO]
13-Sep-2017 20:59:08 [INFO] --- maven-compiler-plugin:2.1:compile (default-compile) @ openmrs-webapp ---
13-Sep-2017 20:59:08 [INFO] No sources to compile
13-Sep-2017 20:59:08 [INFO]
13-Sep-2017 20:59:08 [INFO] --- maven-resources-plugin:2.4:testResources (default-testResources) @ openmrs-webapp ---
13-Sep-2017 20:59:08 [INFO] Using 'UTF-8' encoding to copy filtered resources.
13-Sep-2017 20:59:08 [INFO] Copying 1 resource
13-Sep-2017 20:59:08 [INFO]
13-Sep-2017 20:59:08 [INFO] --- maven-compiler-plugin:2.1:testCompile (default-testCompile) @ openmrs-webapp ---
13-Sep-2017 20:59:08 [INFO] Compiling 3 source files to /home/bamboo-agent-2/bamboo-agent/xml-data/build-dir/TRUNK-OC12-JOB1/webapp/target/test-classes
13-Sep-2017 20:59:09 [INFO]
13-Sep-2017 20:59:09 [INFO] --- maven-surefire-plugin:2.5:test (default-test) @ openmrs-webapp ---
13-Sep-2017 20:59:09 [INFO] Surefire report directory: /home/bamboo-agent-2/bamboo-agent/xml-data/build-dir/TRUNK-OC12-JOB1/webapp/target/surefire-reports
13-Sep-2017 20:59:09
13-Sep-2017 20:59:09 -------------------------------------------------------
13-Sep-2017 20:59:09 T E S T S
13-Sep-2017 20:59:09 -------------------------------------------------------
13-Sep-2017 20:59:09 Running org.openmrs.MessagePropertiesFilesTest
13-Sep-2017 20:59:10 Tests run: 13, Failures: 0, Errors: 0, Skipped: 0, Time elapsed: 0.775 sec
13-Sep-2017 20:59:10
13-Sep-2017 20:59:10 Results :
13-Sep-2017 20:59:10
13-Sep-2017 20:59:10 Tests run: 13, Failures: 0, Errors: 0, Skipped: 0
13-Sep-2017 20:59:10
13-Sep-2017 20:59:10 [INFO]
13-Sep-2017 20:59:10 [INFO] --- maven-war-plugin:2.4:war (default-war) @ openmrs-webapp ---
13-Sep-2017 20:59:11 [INFO] Packaging webapp
13-Sep-2017 20:59:11 [INFO] Assembling webapp [openmrs-webapp] in [/home/bamboo-agent-2/bamboo-agent/xml-data/build-dir/TRUNK-OC12-JOB1/webapp/target/openmrs]
13-Sep-2017 20:59:11 [INFO] Processing war project
13-Sep-2017 20:59:11 [INFO] Copying webapp webResources [/home/bamboo-agent-2/bamboo-agent/xml-data/build-dir/TRUNK-OC12-JOB1/webapp/src/main/webapp] to [/home/bamboo-agent-2/bamboo-agent/xml-data/build-dir/TRUNK-OC12-JOB1/webapp/target/openmrs]
13-Sep-2017 20:59:11 [INFO] Copying webapp resources [/home/bamboo-agent-2/bamboo-agent/xml-data/build-dir/TRUNK-OC12-JOB1/webapp/src/main/webapp]
13-Sep-2017 20:59:12 [INFO] Webapp assembled in [1320 msecs]
13-Sep-2017 20:59:12 [INFO] Building war: /home/bamboo-agent-2/bamboo-agent/xml-data/build-dir/TRUNK-OC12-JOB1/webapp/target/openmrs.war
13-Sep-2017 20:59:16 [INFO]
13-Sep-2017 20:59:16 [INFO] --- maven-jar-plugin:2.3.2:test-jar (default) @ openmrs-webapp ---
13-Sep-2017 20:59:16 [INFO] Building jar: /home/bamboo-agent-2/bamboo-agent/xml-data/build-dir/TRUNK-OC12-JOB1/webapp/target/openmrs-tests.jar
13-Sep-2017 20:59:16 [INFO]
13-Sep-2017 20:59:16 [INFO] --- license-maven-plugin:2.6:check (default) @ openmrs-webapp ---
13-Sep-2017 20:59:16 [INFO] Checking licenses...
13-Sep-2017 20:59:16 [INFO]
13-Sep-2017 20:59:16 [INFO] --- animal-sniffer-maven-plugin:1.14:check (check-java-version) @ openmrs-webapp ---
13-Sep-2017 20:59:16 [INFO] Checking unresolved references to org.codehaus.mojo.signature:java16:1.1
13-Sep-2017 20:59:19 [INFO]
13-Sep-2017 20:59:19 [INFO] --- maven-install-plugin:2.4:install (default-install) @ openmrs-webapp ---
13-Sep-2017 20:59:19 [INFO] Installing /home/bamboo-agent-2/bamboo-agent/xml-data/build-dir/TRUNK-OC12-JOB1/webapp/target/openmrs.war to /home/bamboo-agent-2/.m2/repository/org/openmrs/web/openmrs-webapp/1.12.1-SNAPSHOT/openmrs-webapp-1.12.1-SNAPSHOT.war
13-Sep-2017 20:59:19 [INFO] Installing /home/bamboo-agent-2/bamboo-agent/xml-data/build-dir/TRUNK-OC12-JOB1/webapp/pom.xml to /home/bamboo-agent-2/.m2/repository/org/openmrs/web/openmrs-webapp/1.12.1-SNAPSHOT/openmrs-webapp-1.12.1-SNAPSHOT.pom
13-Sep-2017 20:59:19 [INFO] Installing /home/bamboo-agent-2/bamboo-agent/xml-data/build-dir/TRUNK-OC12-JOB1/webapp/target/openmrs-tests.jar to /home/bamboo-agent-2/.m2/repository/org/openmrs/web/openmrs-webapp/1.12.1-SNAPSHOT/openmrs-webapp-1.12.1-SNAPSHOT-tests.jar
13-Sep-2017 20:59:19 [INFO]
13-Sep-2017 20:59:19 [INFO] --- maven-deploy-plugin:2.7:deploy (default-deploy) @ openmrs-webapp ---
13-Sep-2017 20:59:19 [INFO] Downloading: http://mavenrepo.openmrs.org/nexus/content/repositories/snapshots/org/openmrs/web/openmrs-webapp/1.12.1-SNAPSHOT/maven-metadata.xml
13-Sep-2017 20:59:20 [INFO] Downloaded: http://mavenrepo.openmrs.org/nexus/content/repositories/snapshots/org/openmrs/web/openmrs-webapp/1.12.1-SNAPSHOT/maven-metadata.xml (342 B at 1.0 KB/sec)
13-Sep-2017 20:59:20 [INFO] Uploading: http://mavenrepo.openmrs.org/nexus/content/repositories/snapshots/org/openmrs/web/openmrs-webapp/1.12.1-SNAPSHOT/openmrs-webapp-1.12.1-20170913.205920-2.war
13-Sep-2017 20:59:24 [INFO] Uploaded: http://mavenrepo.openmrs.org/nexus/content/repositories/snapshots/org/openmrs/web/openmrs-webapp/1.12.1-SNAPSHOT/openmrs-webapp-1.12.1-20170913.205920-2.war (48272 KB at 12355.2 KB/sec)
13-Sep-2017 20:59:24 [INFO] Uploading: http://mavenrepo.openmrs.org/nexus/content/repositories/snapshots/org/openmrs/web/openmrs-webapp/1.12.1-SNAPSHOT/openmrs-webapp-1.12.1-20170913.205920-2.pom
13-Sep-2017 20:59:24 [INFO] Uploaded: http://mavenrepo.openmrs.org/nexus/content/repositories/snapshots/org/openmrs/web/openmrs-webapp/1.12.1-SNAPSHOT/openmrs-webapp-1.12.1-20170913.205920-2.pom (11 KB at 24.9 KB/sec)
13-Sep-2017 20:59:24 [INFO] Downloading: http://mavenrepo.openmrs.org/nexus/content/repositories/snapshots/org/openmrs/web/openmrs-webapp/maven-metadata.xml
13-Sep-2017 20:59:24 [INFO] Downloaded: http://mavenrepo.openmrs.org/nexus/content/repositories/snapshots/org/openmrs/web/openmrs-webapp/maven-metadata.xml (2 KB at 4.3 KB/sec)
13-Sep-2017 20:59:24 [INFO] Uploading: http://mavenrepo.openmrs.org/nexus/content/repositories/snapshots/org/openmrs/web/openmrs-webapp/1.12.1-SNAPSHOT/maven-metadata.xml
13-Sep-2017 20:59:25 [INFO] Uploaded: http://mavenrepo.openmrs.org/nexus/content/repositories/snapshots/org/openmrs/web/openmrs-webapp/1.12.1-SNAPSHOT/maven-metadata.xml (782 B at 2.1 KB/sec)
13-Sep-2017 20:59:25 [INFO] Uploading: http://mavenrepo.openmrs.org/nexus/content/repositories/snapshots/org/openmrs/web/openmrs-webapp/maven-metadata.xml
13-Sep-2017 20:59:25 [INFO] Uploaded: http://mavenrepo.openmrs.org/nexus/content/repositories/snapshots/org/openmrs/web/openmrs-webapp/maven-metadata.xml (992 B at 2.5 KB/sec)
13-Sep-2017 20:59:25 [INFO] Uploading: http://mavenrepo.openmrs.org/nexus/content/repositories/snapshots/org/openmrs/web/openmrs-webapp/1.12.1-SNAPSHOT/openmrs-webapp-1.12.1-20170913.205920-2-tests.jar
13-Sep-2017 20:59:26 [INFO] Uploaded: http://mavenrepo.openmrs.org/nexus/content/repositories/snapshots/org/openmrs/web/openmrs-webapp/1.12.1-SNAPSHOT/openmrs-webapp-1.12.1-20170913.205920-2-tests.jar (9 KB at 20.6 KB/sec)
13-Sep-2017 20:59:26 [INFO] Uploading: http://mavenrepo.openmrs.org/nexus/content/repositories/snapshots/org/openmrs/web/openmrs-webapp/1.12.1-SNAPSHOT/maven-metadata.xml
13-Sep-2017 20:59:26 [INFO] Uploaded: http://mavenrepo.openmrs.org/nexus/content/repositories/snapshots/org/openmrs/web/openmrs-webapp/1.12.1-SNAPSHOT/maven-metadata.xml (995 B at 2.8 KB/sec)
13-Sep-2017 20:59:26 [INFO] ------------------------------------------------------------------------
13-Sep-2017 20:59:26 [INFO] Reactor Summary:
13-Sep-2017 20:59:26 [INFO]
13-Sep-2017 20:59:26 [INFO] OpenMRS ............................................ SUCCESS [ 10.666 s]
13-Sep-2017 20:59:26 [INFO] openmrs-tools ...................................... SUCCESS [  7.054 s]
13-Sep-2017 20:59:26 [INFO] openmrs-test ....................................... SUCCESS [  5.060 s]
13-Sep-2017 20:59:26 [INFO] openmrs-api ........................................ SUCCESS [03:06 min]
13-Sep-2017 20:59:26 [INFO] openmrs-web ........................................ SUCCESS [01:11 min]
13-Sep-2017 20:59:26 [INFO] openmrs-webapp ..................................... SUCCESS [ 19.083 s]
13-Sep-2017 20:59:26 [INFO] ------------------------------------------------------------------------
13-Sep-2017 20:59:26 [INFO] BUILD SUCCESS
13-Sep-2017 20:59:26 [INFO] ------------------------------------------------------------------------
13-Sep-2017 20:59:26 [INFO] Total time: 05:00 min
13-Sep-2017 20:59:26 [INFO] Finished at: 2017-09-13T20:59:26+00:00
13-Sep-2017 20:59:27 [INFO] Final Memory: 183M/731M
13-Sep-2017 20:59:27 [INFO] ------------------------------------------------------------------------
13-Sep-2017 20:59:27 Parsing test results under /home/bamboo-agent-2/bamboo-agent/xml-data/build-dir/TRUNK-OC12-JOB1...
13-Sep-2017 20:59:27 Finished task 'Maven 3.x' with result: Success
13-Sep-2017 20:59:27 Running post build plugin 'Docker Container Cleanup'
13-Sep-2017 20:59:27 Running post build plugin 'NCover Results Collector'
13-Sep-2017 20:59:27 Running post build plugin 'Clover Results Collector'
13-Sep-2017 20:59:27 Running post build plugin 'Sauce OnDemand Post Runner'
13-Sep-2017 20:59:27 Running post build plugin 'npm Cache Cleanup'
13-Sep-2017 20:59:27 Running post build plugin 'Artifact Copier'
13-Sep-2017 20:59:27 Publishing an artifact: openmrs 1.12 war
13-Sep-2017 20:59:31 Finished publishing of artifact Shared artifact: [openmrs 1.12 war], pattern: [**/openmrs.war] anchored at: [webapp/target] in 4.047 s
13-Sep-2017 20:59:31 Publishing an artifact: openmrs 1.12 api jar
13-Sep-2017 20:59:31 Finished publishing of artifact Shared artifact: [openmrs 1.12 api jar], pattern: [**/openmrs-api*.jar] anchored at: [webapp/target/openmrs/WEB-INF/lib] in 178.2 ms
13-Sep-2017 20:59:31 Finalising the build...
13-Sep-2017 20:59:31 Stopping timer.
13-Sep-2017 20:59:31 Build TRUNK-OC12-JOB1-88 completed.
13-Sep-2017 20:59:32 Running on server: post build plugin 'NCover Results Collector'
13-Sep-2017 20:59:32 Running on server: post build plugin 'Build Hanging Detection Configuration'
13-Sep-2017 20:59:32 Running on server: post build plugin 'Clover Delta Calculator'
13-Sep-2017 20:59:32 Running on server: post build plugin 'Maven Dependencies Postprocessor'
13-Sep-2017 20:59:32 All post build plugins have finished
13-Sep-2017 20:59:32 Generating build results summary...
13-Sep-2017 20:59:33 Saving build results to disk...
13-Sep-2017 20:59:33 Logging substituted variables...
13-Sep-2017 20:59:34 Indexing build results...
13-Sep-2017 20:59:34 Finished building TRUNK-OC12-JOB1-88.