Plan for OpenMRS Core 1.12.x

Build: #98 was successful

Job: Build and Test was successful

Stages & jobs

  1. Build and Test

  2. Deploy

  3. Release

    Requires a user to start manually

Build log

The build generated 5,827 lines of output.The output is too long and has been truncated to the last 1,000 lines. Download or view full build log

01-Jun-2019 18:29:02         at sun.reflect.NativeMethodAccessorImpl.invoke0(Native Method)
01-Jun-2019 18:29:02         at sun.reflect.NativeMethodAccessorImpl.invoke(NativeMethodAccessorImpl.java:62)
01-Jun-2019 18:29:02         at sun.reflect.DelegatingMethodAccessorImpl.invoke(DelegatingMethodAccessorImpl.java:43)
01-Jun-2019 18:29:02         at java.lang.reflect.Method.invoke(Method.java:498)
01-Jun-2019 18:29:02         at org.springframework.aop.support.AopUtils.invokeJoinpointUsingReflection(AopUtils.java:317)
01-Jun-2019 18:29:02         at org.springframework.aop.framework.ReflectiveMethodInvocation.invokeJoinpoint(ReflectiveMethodInvocation.java:183)
01-Jun-2019 18:29:02         at org.springframework.aop.framework.ReflectiveMethodInvocation.proceed(ReflectiveMethodInvocation.java:150)
01-Jun-2019 18:29:02         at org.springframework.transaction.interceptor.TransactionInterceptor$1.proceedWithInvocation(TransactionInterceptor.java:96)
01-Jun-2019 18:29:02         at org.springframework.transaction.interceptor.TransactionAspectSupport.invokeWithinTransaction(TransactionAspectSupport.java:260)
01-Jun-2019 18:29:02         at org.springframework.transaction.interceptor.TransactionInterceptor.invoke(TransactionInterceptor.java:94)
01-Jun-2019 18:29:02         at org.springframework.aop.framework.ReflectiveMethodInvocation.proceed(ReflectiveMethodInvocation.java:172)
01-Jun-2019 18:29:02         at org.springframework.aop.framework.JdkDynamicAopProxy.invoke(JdkDynamicAopProxy.java:204)
01-Jun-2019 18:29:02         at com.sun.proxy.$Proxy70.saveForm(Unknown Source)
01-Jun-2019 18:29:02         at sun.reflect.NativeMethodAccessorImpl.invoke0(Native Method)
01-Jun-2019 18:29:02         at sun.reflect.NativeMethodAccessorImpl.invoke(NativeMethodAccessorImpl.java:62)
01-Jun-2019 18:29:02         at sun.reflect.DelegatingMethodAccessorImpl.invoke(DelegatingMethodAccessorImpl.java:43)
01-Jun-2019 18:29:02         at java.lang.reflect.Method.invoke(Method.java:498)
01-Jun-2019 18:29:02         at org.springframework.aop.support.AopUtils.invokeJoinpointUsingReflection(AopUtils.java:317)
01-Jun-2019 18:29:02         at org.springframework.aop.framework.ReflectiveMethodInvocation.invokeJoinpoint(ReflectiveMethodInvocation.java:183)
01-Jun-2019 18:29:02         at org.springframework.aop.framework.ReflectiveMethodInvocation.proceed(ReflectiveMethodInvocation.java:150)
01-Jun-2019 18:29:02         at org.openmrs.aop.LoggingAdvice.invoke(LoggingAdvice.java:121)
01-Jun-2019 18:29:02         at org.springframework.aop.framework.ReflectiveMethodInvocation.proceed(ReflectiveMethodInvocation.java:172)
01-Jun-2019 18:29:02         at org.springframework.aop.framework.adapter.MethodBeforeAdviceInterceptor.invoke(MethodBeforeAdviceInterceptor.java:51)
01-Jun-2019 18:29:02         at org.springframework.aop.framework.ReflectiveMethodInvocation.proceed(ReflectiveMethodInvocation.java:172)
01-Jun-2019 18:29:02         at org.springframework.aop.framework.adapter.MethodBeforeAdviceInterceptor.invoke(MethodBeforeAdviceInterceptor.java:51)
01-Jun-2019 18:29:02         at org.springframework.aop.framework.ReflectiveMethodInvocation.proceed(ReflectiveMethodInvocation.java:172)
01-Jun-2019 18:29:02         at org.springframework.aop.framework.JdkDynamicAopProxy.invoke(JdkDynamicAopProxy.java:204)
01-Jun-2019 18:29:02         at com.sun.proxy.$Proxy71.saveForm(Unknown Source)
01-Jun-2019 18:29:02         at org.openmrs.web.controller.form.FormFormController.onSubmit(FormFormController.java:89)
01-Jun-2019 18:29:02         at org.springframework.web.servlet.mvc.SimpleFormController.processFormSubmission(SimpleFormController.java:272)
01-Jun-2019 18:29:02         at org.springframework.web.servlet.mvc.AbstractFormController.handleRequestInternal(AbstractFormController.java:268)
01-Jun-2019 18:29:02         at org.springframework.web.servlet.mvc.AbstractController.handleRequest(AbstractController.java:153)
01-Jun-2019 18:29:02         at org.openmrs.web.controller.form.FormFormControllerTest.shouldNotSaveAFormWhenFormsAreLocked(FormFormControllerTest.java:67)
01-Jun-2019 18:29:02         at sun.reflect.NativeMethodAccessorImpl.invoke0(Native Method)
01-Jun-2019 18:29:02         at sun.reflect.NativeMethodAccessorImpl.invoke(NativeMethodAccessorImpl.java:62)
01-Jun-2019 18:29:02         at sun.reflect.DelegatingMethodAccessorImpl.invoke(DelegatingMethodAccessorImpl.java:43)
01-Jun-2019 18:29:02         at java.lang.reflect.Method.invoke(Method.java:498)
01-Jun-2019 18:29:02         at org.junit.runners.model.FrameworkMethod$1.runReflectiveCall(FrameworkMethod.java:47)
01-Jun-2019 18:29:02         at org.junit.internal.runners.model.ReflectiveCallable.run(ReflectiveCallable.java:12)
01-Jun-2019 18:29:02         at org.junit.runners.model.FrameworkMethod.invokeExplosively(FrameworkMethod.java:44)
01-Jun-2019 18:29:02         at org.junit.internal.runners.statements.InvokeMethod.evaluate(InvokeMethod.java:17)
01-Jun-2019 18:29:02         at org.junit.internal.runners.statements.RunBefores.evaluate(RunBefores.java:26)
01-Jun-2019 18:29:02         at org.springframework.test.context.junit4.statements.RunBeforeTestMethodCallbacks.evaluate(RunBeforeTestMethodCallbacks.java:74)
01-Jun-2019 18:29:02         at org.junit.internal.runners.statements.RunAfters.evaluate(RunAfters.java:27)
01-Jun-2019 18:29:02         at org.springframework.test.context.junit4.statements.RunAfterTestMethodCallbacks.evaluate(RunAfterTestMethodCallbacks.java:83)
01-Jun-2019 18:29:02         at org.springframework.test.context.junit4.statements.SpringRepeat.evaluate(SpringRepeat.java:72)
01-Jun-2019 18:29:02         at org.springframework.test.context.junit4.SpringJUnit4ClassRunner.runChild(SpringJUnit4ClassRunner.java:231)
01-Jun-2019 18:29:02         at org.springframework.test.context.junit4.SpringJUnit4ClassRunner.runChild(SpringJUnit4ClassRunner.java:88)
01-Jun-2019 18:29:02         at org.junit.runners.ParentRunner$3.run(ParentRunner.java:238)
01-Jun-2019 18:29:02         at org.junit.runners.ParentRunner$1.schedule(ParentRunner.java:63)
01-Jun-2019 18:29:02         at org.junit.runners.ParentRunner.runChildren(ParentRunner.java:236)
01-Jun-2019 18:29:02         at org.junit.runners.ParentRunner.access$000(ParentRunner.java:53)
01-Jun-2019 18:29:02         at org.junit.runners.ParentRunner$2.evaluate(ParentRunner.java:229)
01-Jun-2019 18:29:02         at org.springframework.test.context.junit4.statements.RunBeforeTestClassCallbacks.evaluate(RunBeforeTestClassCallbacks.java:61)
01-Jun-2019 18:29:02         at org.junit.internal.runners.statements.RunAfters.evaluate(RunAfters.java:27)
01-Jun-2019 18:29:02         at org.springframework.test.context.junit4.statements.RunAfterTestClassCallbacks.evaluate(RunAfterTestClassCallbacks.java:71)
01-Jun-2019 18:29:02         at org.junit.runners.ParentRunner.run(ParentRunner.java:309)
01-Jun-2019 18:29:02         at org.springframework.test.context.junit4.SpringJUnit4ClassRunner.run(SpringJUnit4ClassRunner.java:174)
01-Jun-2019 18:29:02         at org.apache.maven.surefire.junit4.JUnit4TestSet.execute(JUnit4TestSet.java:59)
01-Jun-2019 18:29:02         at org.apache.maven.surefire.suite.AbstractDirectoryTestSuite.executeTestSet(AbstractDirectoryTestSuite.java:115)
01-Jun-2019 18:29:02         at org.apache.maven.surefire.suite.AbstractDirectoryTestSuite.execute(AbstractDirectoryTestSuite.java:102)
01-Jun-2019 18:29:02         at org.apache.maven.surefire.Surefire.run(Surefire.java:180)
01-Jun-2019 18:29:02         at sun.reflect.NativeMethodAccessorImpl.invoke0(Native Method)
01-Jun-2019 18:29:02         at sun.reflect.NativeMethodAccessorImpl.invoke(NativeMethodAccessorImpl.java:62)
01-Jun-2019 18:29:02         at sun.reflect.DelegatingMethodAccessorImpl.invoke(DelegatingMethodAccessorImpl.java:43)
01-Jun-2019 18:29:02         at java.lang.reflect.Method.invoke(Method.java:498)
01-Jun-2019 18:29:02         at org.apache.maven.surefire.booter.SurefireBooter.runSuitesInProcess(SurefireBooter.java:350)
01-Jun-2019 18:29:02         at org.apache.maven.surefire.booter.SurefireBooter.main(SurefireBooter.java:1021)
01-Jun-2019 18:29:02 Tests run: 1, Failures: 0, Errors: 0, Skipped: 0, Time elapsed: 0.027 sec
01-Jun-2019 18:29:02 Running org.openmrs.web.controller.patient.ShortPatientFormControllerTest
01-Jun-2019 18:29:03 Tests run: 14, Failures: 0, Errors: 0, Skipped: 0, Time elapsed: 0.534 sec
01-Jun-2019 18:29:03 Running org.openmrs.web.servlet.ShowGraphServletTest
01-Jun-2019 18:29:03 Tests run: 7, Failures: 0, Errors: 0, Skipped: 0, Time elapsed: 0.176 sec
01-Jun-2019 18:29:03 Running org.openmrs.scheduler.web.controller.SchedulerFormTest
01-Jun-2019 18:29:03 Tests run: 1, Failures: 0, Errors: 0, Skipped: 0, Time elapsed: 0.018 sec
01-Jun-2019 18:29:03 Running org.openmrs.web.controller.encounter.EncounterRoleFormControllerTest
01-Jun-2019 18:29:03 Tests run: 8, Failures: 0, Errors: 0, Skipped: 0, Time elapsed: 0.287 sec
01-Jun-2019 18:29:03 Running org.openmrs.web.encounter.EncounterDisplayControllerTest
01-Jun-2019 18:29:03 Tests run: 2, Failures: 0, Errors: 0, Skipped: 0, Time elapsed: 0.086 sec
01-Jun-2019 18:29:03 Running org.openmrs.web.controller.user.RoleFormControllerTest
01-Jun-2019 18:29:03 Tests run: 1, Failures: 0, Errors: 0, Skipped: 0, Time elapsed: 0.075 sec
01-Jun-2019 18:29:03 Running org.openmrs.web.taglib.ForEachEncounterTagTest
01-Jun-2019 18:29:03 Tests run: 2, Failures: 0, Errors: 0, Skipped: 0, Time elapsed: 0.141 sec
01-Jun-2019 18:29:03 Running org.openmrs.web.filter.update.UpdateFilterTest
01-Jun-2019 18:29:03 Tests run: 5, Failures: 0, Errors: 0, Skipped: 0, Time elapsed: 0.056 sec
01-Jun-2019 18:29:03 Running org.openmrs.web.controller.concept.ConceptStopWordFormControllerTest
01-Jun-2019 18:29:03 Tests run: 2, Failures: 0, Errors: 0, Skipped: 0, Time elapsed: 0.015 sec
01-Jun-2019 18:29:03 Running org.openmrs.web.controller.encounter.EncounterTypeListControllerTest
01-Jun-2019 18:29:03 Tests run: 1, Failures: 0, Errors: 0, Skipped: 0, Time elapsed: 0.008 sec
01-Jun-2019 18:29:03 Running org.openmrs.web.obs.ObsFormControllerTest
01-Jun-2019 18:29:03 Tests run: 2, Failures: 0, Errors: 0, Skipped: 0, Time elapsed: 0.026 sec
01-Jun-2019 18:29:03 Running org.openmrs.web.filter.update.GZIPFilterTest
01-Jun-2019 18:29:04 Tests run: 1, Failures: 0, Errors: 0, Skipped: 0, Time elapsed: 0.028 sec
01-Jun-2019 18:29:04 Running org.openmrs.web.controller.person.PersonAttributeTypeListControllerTest
01-Jun-2019 18:29:04 Tests run: 9, Failures: 0, Errors: 0, Skipped: 0, Time elapsed: 0.082 sec
01-Jun-2019 18:29:04 Running org.openmrs.web.controller.concept.ConceptSourceFormControllerTest
01-Jun-2019 18:29:04 Tests run: 3, Failures: 0, Errors: 0, Skipped: 0, Time elapsed: 0.022 sec
01-Jun-2019 18:29:04 Running org.openmrs.web.controller.concept.ConceptFormControllerTest
01-Jun-2019 18:29:04 Tests run: 1, Failures: 0, Errors: 0, Skipped: 0, Time elapsed: 0.032 sec
01-Jun-2019 18:29:04 Running org.openmrs.web.servlet.LoginServletTest
01-Jun-2019 18:29:04 Tests run: 3, Failures: 0, Errors: 0, Skipped: 0, Time elapsed: 0.03 sec
01-Jun-2019 18:29:04 Running org.openmrs.web.dwr.DWRPersonServiceTest
01-Jun-2019 18:29:04 Tests run: 2, Failures: 0, Errors: 0, Skipped: 0, Time elapsed: 0.025 sec
01-Jun-2019 18:29:04 Running org.openmrs.web.controller.UserPropertiesTest
01-Jun-2019 18:29:04 Tests run: 6, Failures: 0, Errors: 0, Skipped: 0, Time elapsed: 0.002 sec
01-Jun-2019 18:29:04 Running org.openmrs.web.controller.form.FieldTypeListControllerTest
01-Jun-2019 18:29:04 ERROR - JDBCExceptionReporter.logExceptions(234) |2019-06-01 18:29:04,227| Referential integrity constraint violation: "FK5CEA0FA808FB57F: PUBLIC.FIELD FOREIGN KEY(FIELD_TYPE) REFERENCES PUBLIC.FIELD_TYPE(FIELD_TYPE_ID) (1)"; SQL statement:
01-Jun-2019 18:29:04 delete from field_type where field_type_id=? [23503-187]
01-Jun-2019 18:29:04 ERROR - JDBCExceptionReporter.logExceptions(234) |2019-06-01 18:29:04,228| Referential integrity constraint violation: "FK5CEA0FA808FB57F: PUBLIC.FIELD FOREIGN KEY(FIELD_TYPE) REFERENCES PUBLIC.FIELD_TYPE(FIELD_TYPE_ID) (1)"; SQL statement:
01-Jun-2019 18:29:04 delete from field_type where field_type_id=? [23503-187]
01-Jun-2019 18:29:04 ERROR - FieldTypeListController.onSubmit(85) |2019-06-01 18:29:04,229| Unable to delete a field type because it is in use. fieldTypeId: 1
01-Jun-2019 18:29:04 org.springframework.dao.DataIntegrityViolationException: Could not execute JDBC batch update; SQL [delete from field_type where field_type_id=?]; constraint ["FK5CEA0FA808FB57F: PUBLIC.FIELD FOREIGN KEY(FIELD_TYPE) REFERENCES PUBLIC.FIELD_TYPE(FIELD_TYPE_ID) (1)"; SQL statement:
01-Jun-2019 18:29:04 delete from field_type where field_type_id=? [23503-187]]; nested exception is org.hibernate.exception.ConstraintViolationException: Could not execute JDBC batch update
01-Jun-2019 18:29:04         at org.springframework.orm.hibernate3.SessionFactoryUtils.convertHibernateAccessException(SessionFactoryUtils.java:645)
01-Jun-2019 18:29:04         at org.springframework.orm.hibernate3.HibernateTransactionManager.convertHibernateAccessException(HibernateTransactionManager.java:794)
01-Jun-2019 18:29:04         at org.springframework.orm.hibernate3.HibernateTransactionManager.doCommit(HibernateTransactionManager.java:665)
01-Jun-2019 18:29:04         at org.springframework.transaction.support.AbstractPlatformTransactionManager.processCommit(AbstractPlatformTransactionManager.java:755)
01-Jun-2019 18:29:04         at org.springframework.transaction.support.AbstractPlatformTransactionManager.commit(AbstractPlatformTransactionManager.java:724)
01-Jun-2019 18:29:04         at org.springframework.transaction.interceptor.TransactionAspectSupport.commitTransactionAfterReturning(TransactionAspectSupport.java:475)
01-Jun-2019 18:29:04         at org.springframework.transaction.interceptor.TransactionAspectSupport.invokeWithinTransaction(TransactionAspectSupport.java:270)
01-Jun-2019 18:29:04         at org.springframework.transaction.interceptor.TransactionInterceptor.invoke(TransactionInterceptor.java:94)
01-Jun-2019 18:29:04         at org.springframework.aop.framework.ReflectiveMethodInvocation.proceed(ReflectiveMethodInvocation.java:172)
01-Jun-2019 18:29:04         at org.springframework.aop.framework.JdkDynamicAopProxy.invoke(JdkDynamicAopProxy.java:204)
01-Jun-2019 18:29:04         at com.sun.proxy.$Proxy70.purgeFieldType(Unknown Source)
01-Jun-2019 18:29:04         at sun.reflect.NativeMethodAccessorImpl.invoke0(Native Method)
01-Jun-2019 18:29:04         at sun.reflect.NativeMethodAccessorImpl.invoke(NativeMethodAccessorImpl.java:62)
01-Jun-2019 18:29:04         at sun.reflect.DelegatingMethodAccessorImpl.invoke(DelegatingMethodAccessorImpl.java:43)
01-Jun-2019 18:29:04         at java.lang.reflect.Method.invoke(Method.java:498)
01-Jun-2019 18:29:04         at org.springframework.aop.support.AopUtils.invokeJoinpointUsingReflection(AopUtils.java:317)
01-Jun-2019 18:29:04         at org.springframework.aop.framework.ReflectiveMethodInvocation.invokeJoinpoint(ReflectiveMethodInvocation.java:183)
01-Jun-2019 18:29:04         at org.springframework.aop.framework.ReflectiveMethodInvocation.proceed(ReflectiveMethodInvocation.java:150)
01-Jun-2019 18:29:04         at org.openmrs.aop.LoggingAdvice.invoke(LoggingAdvice.java:121)
01-Jun-2019 18:29:04         at org.springframework.aop.framework.ReflectiveMethodInvocation.proceed(ReflectiveMethodInvocation.java:172)
01-Jun-2019 18:29:04         at org.springframework.aop.framework.adapter.MethodBeforeAdviceInterceptor.invoke(MethodBeforeAdviceInterceptor.java:51)
01-Jun-2019 18:29:04         at org.springframework.aop.framework.ReflectiveMethodInvocation.proceed(ReflectiveMethodInvocation.java:172)
01-Jun-2019 18:29:04         at org.springframework.aop.framework.adapter.MethodBeforeAdviceInterceptor.invoke(MethodBeforeAdviceInterceptor.java:51)
01-Jun-2019 18:29:04         at org.springframework.aop.framework.ReflectiveMethodInvocation.proceed(ReflectiveMethodInvocation.java:172)
01-Jun-2019 18:29:04         at org.springframework.aop.framework.JdkDynamicAopProxy.invoke(JdkDynamicAopProxy.java:204)
01-Jun-2019 18:29:04         at com.sun.proxy.$Proxy71.purgeFieldType(Unknown Source)
01-Jun-2019 18:29:04         at org.openmrs.web.controller.form.FieldTypeListController.onSubmit(FieldTypeListController.java:71)
01-Jun-2019 18:29:04         at org.springframework.web.servlet.mvc.SimpleFormController.processFormSubmission(SimpleFormController.java:272)
01-Jun-2019 18:29:04         at org.springframework.web.servlet.mvc.AbstractFormController.handleRequestInternal(AbstractFormController.java:268)
01-Jun-2019 18:29:04         at org.springframework.web.servlet.mvc.AbstractController.handleRequest(AbstractController.java:153)
01-Jun-2019 18:29:04         at org.springframework.web.servlet.mvc.SimpleControllerHandlerAdapter.handle(SimpleControllerHandlerAdapter.java:48)
01-Jun-2019 18:29:04         at org.openmrs.web.test.WebTestHelper.handle(WebTestHelper.java:127)
01-Jun-2019 18:29:04         at org.openmrs.web.controller.form.FieldTypeListControllerTest.onSubmit_shouldDisplayAUserFriendlyErrorMessage(FieldTypeListControllerTest.java:44)
01-Jun-2019 18:29:04         at sun.reflect.NativeMethodAccessorImpl.invoke0(Native Method)
01-Jun-2019 18:29:04         at sun.reflect.NativeMethodAccessorImpl.invoke(NativeMethodAccessorImpl.java:62)
01-Jun-2019 18:29:04         at sun.reflect.DelegatingMethodAccessorImpl.invoke(DelegatingMethodAccessorImpl.java:43)
01-Jun-2019 18:29:04         at java.lang.reflect.Method.invoke(Method.java:498)
01-Jun-2019 18:29:04         at org.junit.runners.model.FrameworkMethod$1.runReflectiveCall(FrameworkMethod.java:47)
01-Jun-2019 18:29:04         at org.junit.internal.runners.model.ReflectiveCallable.run(ReflectiveCallable.java:12)
01-Jun-2019 18:29:04         at org.junit.runners.model.FrameworkMethod.invokeExplosively(FrameworkMethod.java:44)
01-Jun-2019 18:29:04         at org.junit.internal.runners.statements.InvokeMethod.evaluate(InvokeMethod.java:17)
01-Jun-2019 18:29:04         at org.junit.internal.runners.statements.RunBefores.evaluate(RunBefores.java:26)
01-Jun-2019 18:29:04         at org.springframework.test.context.junit4.statements.RunBeforeTestMethodCallbacks.evaluate(RunBeforeTestMethodCallbacks.java:74)
01-Jun-2019 18:29:04         at org.junit.internal.runners.statements.RunAfters.evaluate(RunAfters.java:27)
01-Jun-2019 18:29:04         at org.springframework.test.context.junit4.statements.RunAfterTestMethodCallbacks.evaluate(RunAfterTestMethodCallbacks.java:83)
01-Jun-2019 18:29:04         at org.springframework.test.context.junit4.statements.SpringRepeat.evaluate(SpringRepeat.java:72)
01-Jun-2019 18:29:04         at org.springframework.test.context.junit4.SpringJUnit4ClassRunner.runChild(SpringJUnit4ClassRunner.java:231)
01-Jun-2019 18:29:04         at org.springframework.test.context.junit4.SpringJUnit4ClassRunner.runChild(SpringJUnit4ClassRunner.java:88)
01-Jun-2019 18:29:04         at org.junit.runners.ParentRunner$3.run(ParentRunner.java:238)
01-Jun-2019 18:29:04         at org.junit.runners.ParentRunner$1.schedule(ParentRunner.java:63)
01-Jun-2019 18:29:04         at org.junit.runners.ParentRunner.runChildren(ParentRunner.java:236)
01-Jun-2019 18:29:04         at org.junit.runners.ParentRunner.access$000(ParentRunner.java:53)
01-Jun-2019 18:29:04         at org.junit.runners.ParentRunner$2.evaluate(ParentRunner.java:229)
01-Jun-2019 18:29:04         at org.springframework.test.context.junit4.statements.RunBeforeTestClassCallbacks.evaluate(RunBeforeTestClassCallbacks.java:61)
01-Jun-2019 18:29:04         at org.junit.internal.runners.statements.RunAfters.evaluate(RunAfters.java:27)
01-Jun-2019 18:29:04         at org.springframework.test.context.junit4.statements.RunAfterTestClassCallbacks.evaluate(RunAfterTestClassCallbacks.java:71)
01-Jun-2019 18:29:04         at org.junit.runners.ParentRunner.run(ParentRunner.java:309)
01-Jun-2019 18:29:04         at org.springframework.test.context.junit4.SpringJUnit4ClassRunner.run(SpringJUnit4ClassRunner.java:174)
01-Jun-2019 18:29:04         at org.apache.maven.surefire.junit4.JUnit4TestSet.execute(JUnit4TestSet.java:59)
01-Jun-2019 18:29:04         at org.apache.maven.surefire.suite.AbstractDirectoryTestSuite.executeTestSet(AbstractDirectoryTestSuite.java:115)
01-Jun-2019 18:29:04         at org.apache.maven.surefire.suite.AbstractDirectoryTestSuite.execute(AbstractDirectoryTestSuite.java:102)
01-Jun-2019 18:29:04         at org.apache.maven.surefire.Surefire.run(Surefire.java:180)
01-Jun-2019 18:29:04         at sun.reflect.NativeMethodAccessorImpl.invoke0(Native Method)
01-Jun-2019 18:29:04         at sun.reflect.NativeMethodAccessorImpl.invoke(NativeMethodAccessorImpl.java:62)
01-Jun-2019 18:29:04         at sun.reflect.DelegatingMethodAccessorImpl.invoke(DelegatingMethodAccessorImpl.java:43)
01-Jun-2019 18:29:04         at java.lang.reflect.Method.invoke(Method.java:498)
01-Jun-2019 18:29:04         at org.apache.maven.surefire.booter.SurefireBooter.runSuitesInProcess(SurefireBooter.java:350)
01-Jun-2019 18:29:04         at org.apache.maven.surefire.booter.SurefireBooter.main(SurefireBooter.java:1021)
01-Jun-2019 18:29:04 Caused by: org.hibernate.exception.ConstraintViolationException: Could not execute JDBC batch update
01-Jun-2019 18:29:04         at org.hibernate.exception.SQLStateConverter.convert(SQLStateConverter.java:96)
01-Jun-2019 18:29:04         at org.hibernate.exception.JDBCExceptionHelper.convert(JDBCExceptionHelper.java:66)
01-Jun-2019 18:29:04         at org.hibernate.jdbc.AbstractBatcher.executeBatch(AbstractBatcher.java:275)
01-Jun-2019 18:29:04         at org.hibernate.engine.ActionQueue.executeActions(ActionQueue.java:268)
01-Jun-2019 18:29:04         at org.hibernate.engine.ActionQueue.executeActions(ActionQueue.java:189)
01-Jun-2019 18:29:04         at org.hibernate.event.def.AbstractFlushingEventListener.performExecutions(AbstractFlushingEventListener.java:321)
01-Jun-2019 18:29:04         at org.hibernate.event.def.DefaultFlushEventListener.onFlush(DefaultFlushEventListener.java:51)
01-Jun-2019 18:29:04         at org.hibernate.impl.SessionImpl.flush(SessionImpl.java:1216)
01-Jun-2019 18:29:04         at org.hibernate.impl.SessionImpl.managedFlush(SessionImpl.java:383)
01-Jun-2019 18:29:04         at org.hibernate.transaction.JDBCTransaction.commit(JDBCTransaction.java:133)
01-Jun-2019 18:29:04         at org.springframework.orm.hibernate3.HibernateTransactionManager.doCommit(HibernateTransactionManager.java:657)
01-Jun-2019 18:29:04         ... 65 more
01-Jun-2019 18:29:04 Caused by: org.h2.jdbc.JdbcBatchUpdateException: Referential integrity constraint violation: "FK5CEA0FA808FB57F: PUBLIC.FIELD FOREIGN KEY(FIELD_TYPE) REFERENCES PUBLIC.FIELD_TYPE(FIELD_TYPE_ID) (1)"; SQL statement:
01-Jun-2019 18:29:04 delete from field_type where field_type_id=? [23503-187]
01-Jun-2019 18:29:04         at org.h2.jdbc.JdbcPreparedStatement.executeBatch(JdbcPreparedStatement.java:1198)
01-Jun-2019 18:29:04         at com.mchange.v2.c3p0.impl.NewProxyPreparedStatement.executeBatch(NewProxyPreparedStatement.java:1723)
01-Jun-2019 18:29:04         at org.hibernate.jdbc.BatchingBatcher.doExecuteBatch(BatchingBatcher.java:70)
01-Jun-2019 18:29:04         at org.hibernate.jdbc.AbstractBatcher.executeBatch(AbstractBatcher.java:268)
01-Jun-2019 18:29:04         ... 73 more
01-Jun-2019 18:29:04 Tests run: 1, Failures: 0, Errors: 0, Skipped: 0, Time elapsed: 0.054 sec
01-Jun-2019 18:29:04 Running org.openmrs.web.dwr.ProviderListItemTest
01-Jun-2019 18:29:04 Tests run: 4, Failures: 0, Errors: 0, Skipped: 0, Time elapsed: 0.003 sec
01-Jun-2019 18:29:04 Running org.openmrs.web.dwr.DeprecationCheckTest
01-Jun-2019 18:29:04 Tests run: 1, Failures: 0, Errors: 0, Skipped: 0, Time elapsed: 0.015 sec
01-Jun-2019 18:29:04 Running org.openmrs.web.controller.patient.PatientIdentifierTypeFormControllerTest
01-Jun-2019 18:29:04 ERROR - PatientIdentifierTypeFormController.onSubmit(119) |2019-06-01 18:29:04,291| PatientIdentifierType.locked
01-Jun-2019 18:29:04 org.openmrs.api.PatientIdentifierTypeLockedException: PatientIdentifierType.locked
01-Jun-2019 18:29:04         at org.openmrs.api.impl.PatientServiceImpl.checkIfPatientIdentifierTypesAreLocked(PatientServiceImpl.java:1771)
01-Jun-2019 18:29:04         at org.openmrs.api.impl.PatientServiceImpl.savePatientIdentifierType(PatientServiceImpl.java:582)
01-Jun-2019 18:29:04         at sun.reflect.NativeMethodAccessorImpl.invoke0(Native Method)
01-Jun-2019 18:29:04         at sun.reflect.NativeMethodAccessorImpl.invoke(NativeMethodAccessorImpl.java:62)
01-Jun-2019 18:29:04         at sun.reflect.DelegatingMethodAccessorImpl.invoke(DelegatingMethodAccessorImpl.java:43)
01-Jun-2019 18:29:04         at java.lang.reflect.Method.invoke(Method.java:498)
01-Jun-2019 18:29:04         at org.springframework.aop.support.AopUtils.invokeJoinpointUsingReflection(AopUtils.java:317)
01-Jun-2019 18:29:04         at org.springframework.aop.framework.ReflectiveMethodInvocation.invokeJoinpoint(ReflectiveMethodInvocation.java:183)
01-Jun-2019 18:29:04         at org.springframework.aop.framework.ReflectiveMethodInvocation.proceed(ReflectiveMethodInvocation.java:150)
01-Jun-2019 18:29:04         at org.springframework.transaction.interceptor.TransactionInterceptor$1.proceedWithInvocation(TransactionInterceptor.java:96)
01-Jun-2019 18:29:04         at org.springframework.transaction.interceptor.TransactionAspectSupport.invokeWithinTransaction(TransactionAspectSupport.java:260)
01-Jun-2019 18:29:04         at org.springframework.transaction.interceptor.TransactionInterceptor.invoke(TransactionInterceptor.java:94)
01-Jun-2019 18:29:04         at org.springframework.aop.framework.ReflectiveMethodInvocation.proceed(ReflectiveMethodInvocation.java:172)
01-Jun-2019 18:29:04         at org.springframework.aop.framework.JdkDynamicAopProxy.invoke(JdkDynamicAopProxy.java:204)
01-Jun-2019 18:29:04         at com.sun.proxy.$Proxy53.savePatientIdentifierType(Unknown Source)
01-Jun-2019 18:29:04         at sun.reflect.NativeMethodAccessorImpl.invoke0(Native Method)
01-Jun-2019 18:29:04         at sun.reflect.NativeMethodAccessorImpl.invoke(NativeMethodAccessorImpl.java:62)
01-Jun-2019 18:29:04         at sun.reflect.DelegatingMethodAccessorImpl.invoke(DelegatingMethodAccessorImpl.java:43)
01-Jun-2019 18:29:04         at java.lang.reflect.Method.invoke(Method.java:498)
01-Jun-2019 18:29:04         at org.springframework.aop.support.AopUtils.invokeJoinpointUsingReflection(AopUtils.java:317)
01-Jun-2019 18:29:04         at org.springframework.aop.framework.ReflectiveMethodInvocation.invokeJoinpoint(ReflectiveMethodInvocation.java:183)
01-Jun-2019 18:29:04         at org.springframework.aop.framework.ReflectiveMethodInvocation.proceed(ReflectiveMethodInvocation.java:150)
01-Jun-2019 18:29:04         at org.openmrs.aop.LoggingAdvice.invoke(LoggingAdvice.java:121)
01-Jun-2019 18:29:04         at org.springframework.aop.framework.ReflectiveMethodInvocation.proceed(ReflectiveMethodInvocation.java:172)
01-Jun-2019 18:29:04         at org.springframework.aop.framework.adapter.MethodBeforeAdviceInterceptor.invoke(MethodBeforeAdviceInterceptor.java:51)
01-Jun-2019 18:29:04         at org.springframework.aop.framework.ReflectiveMethodInvocation.proceed(ReflectiveMethodInvocation.java:172)
01-Jun-2019 18:29:04         at org.springframework.aop.framework.adapter.MethodBeforeAdviceInterceptor.invoke(MethodBeforeAdviceInterceptor.java:51)
01-Jun-2019 18:29:04         at org.springframework.aop.framework.ReflectiveMethodInvocation.proceed(ReflectiveMethodInvocation.java:172)
01-Jun-2019 18:29:04         at org.springframework.aop.framework.JdkDynamicAopProxy.invoke(JdkDynamicAopProxy.java:204)
01-Jun-2019 18:29:04         at com.sun.proxy.$Proxy54.savePatientIdentifierType(Unknown Source)
01-Jun-2019 18:29:04         at org.openmrs.web.controller.patient.PatientIdentifierTypeFormController.onSubmit(PatientIdentifierTypeFormController.java:84)
01-Jun-2019 18:29:04         at org.springframework.web.servlet.mvc.SimpleFormController.processFormSubmission(SimpleFormController.java:272)
01-Jun-2019 18:29:04         at org.springframework.web.servlet.mvc.AbstractFormController.handleRequestInternal(AbstractFormController.java:268)
01-Jun-2019 18:29:04         at org.springframework.web.servlet.mvc.AbstractController.handleRequest(AbstractController.java:153)
01-Jun-2019 18:29:04         at org.openmrs.web.controller.patient.PatientIdentifierTypeFormControllerTest.shouldNotSavePatientIdentifierTypeWhenPatientIdentifierTypesAreLocked(PatientIdentifierTypeFormControllerTest.java:54)
01-Jun-2019 18:29:04         at sun.reflect.NativeMethodAccessorImpl.invoke0(Native Method)
01-Jun-2019 18:29:04         at sun.reflect.NativeMethodAccessorImpl.invoke(NativeMethodAccessorImpl.java:62)
01-Jun-2019 18:29:04         at sun.reflect.DelegatingMethodAccessorImpl.invoke(DelegatingMethodAccessorImpl.java:43)
01-Jun-2019 18:29:04         at java.lang.reflect.Method.invoke(Method.java:498)
01-Jun-2019 18:29:04         at org.junit.runners.model.FrameworkMethod$1.runReflectiveCall(FrameworkMethod.java:47)
01-Jun-2019 18:29:04         at org.junit.internal.runners.model.ReflectiveCallable.run(ReflectiveCallable.java:12)
01-Jun-2019 18:29:04         at org.junit.runners.model.FrameworkMethod.invokeExplosively(FrameworkMethod.java:44)
01-Jun-2019 18:29:04         at org.junit.internal.runners.statements.InvokeMethod.evaluate(InvokeMethod.java:17)
01-Jun-2019 18:29:04         at org.junit.internal.runners.statements.RunBefores.evaluate(RunBefores.java:26)
01-Jun-2019 18:29:04         at org.springframework.test.context.junit4.statements.RunBeforeTestMethodCallbacks.evaluate(RunBeforeTestMethodCallbacks.java:74)
01-Jun-2019 18:29:04         at org.junit.internal.runners.statements.RunAfters.evaluate(RunAfters.java:27)
01-Jun-2019 18:29:04         at org.springframework.test.context.junit4.statements.RunAfterTestMethodCallbacks.evaluate(RunAfterTestMethodCallbacks.java:83)
01-Jun-2019 18:29:04         at org.springframework.test.context.junit4.statements.SpringRepeat.evaluate(SpringRepeat.java:72)
01-Jun-2019 18:29:04         at org.springframework.test.context.junit4.SpringJUnit4ClassRunner.runChild(SpringJUnit4ClassRunner.java:231)
01-Jun-2019 18:29:04         at org.springframework.test.context.junit4.SpringJUnit4ClassRunner.runChild(SpringJUnit4ClassRunner.java:88)
01-Jun-2019 18:29:04         at org.junit.runners.ParentRunner$3.run(ParentRunner.java:238)
01-Jun-2019 18:29:04         at org.junit.runners.ParentRunner$1.schedule(ParentRunner.java:63)
01-Jun-2019 18:29:04         at org.junit.runners.ParentRunner.runChildren(ParentRunner.java:236)
01-Jun-2019 18:29:04         at org.junit.runners.ParentRunner.access$000(ParentRunner.java:53)
01-Jun-2019 18:29:04         at org.junit.runners.ParentRunner$2.evaluate(ParentRunner.java:229)
01-Jun-2019 18:29:04         at org.springframework.test.context.junit4.statements.RunBeforeTestClassCallbacks.evaluate(RunBeforeTestClassCallbacks.java:61)
01-Jun-2019 18:29:04         at org.junit.internal.runners.statements.RunAfters.evaluate(RunAfters.java:27)
01-Jun-2019 18:29:04         at org.springframework.test.context.junit4.statements.RunAfterTestClassCallbacks.evaluate(RunAfterTestClassCallbacks.java:71)
01-Jun-2019 18:29:04         at org.junit.runners.ParentRunner.run(ParentRunner.java:309)
01-Jun-2019 18:29:04         at org.springframework.test.context.junit4.SpringJUnit4ClassRunner.run(SpringJUnit4ClassRunner.java:174)
01-Jun-2019 18:29:04         at org.apache.maven.surefire.junit4.JUnit4TestSet.execute(JUnit4TestSet.java:59)
01-Jun-2019 18:29:04         at org.apache.maven.surefire.suite.AbstractDirectoryTestSuite.executeTestSet(AbstractDirectoryTestSuite.java:115)
01-Jun-2019 18:29:04         at org.apache.maven.surefire.suite.AbstractDirectoryTestSuite.execute(AbstractDirectoryTestSuite.java:102)
01-Jun-2019 18:29:04         at org.apache.maven.surefire.Surefire.run(Surefire.java:180)
01-Jun-2019 18:29:04         at sun.reflect.NativeMethodAccessorImpl.invoke0(Native Method)
01-Jun-2019 18:29:04         at sun.reflect.NativeMethodAccessorImpl.invoke(NativeMethodAccessorImpl.java:62)
01-Jun-2019 18:29:04         at sun.reflect.DelegatingMethodAccessorImpl.invoke(DelegatingMethodAccessorImpl.java:43)
01-Jun-2019 18:29:04         at java.lang.reflect.Method.invoke(Method.java:498)
01-Jun-2019 18:29:04         at org.apache.maven.surefire.booter.SurefireBooter.runSuitesInProcess(SurefireBooter.java:350)
01-Jun-2019 18:29:04         at org.apache.maven.surefire.booter.SurefireBooter.main(SurefireBooter.java:1021)
01-Jun-2019 18:29:04 ERROR - PatientServiceImpl.getDefaultIdentifierValidator(1471) |2019-06-01 18:29:04,295| Global Property patient.defaultPatientIdentifierValidator not set to an actual class.
01-Jun-2019 18:29:04 java.lang.ClassNotFoundException:
01-Jun-2019 18:29:04         at java.lang.Class.forName0(Native Method)
01-Jun-2019 18:29:04         at java.lang.Class.forName(Class.java:264)
01-Jun-2019 18:29:04         at org.openmrs.api.impl.PatientServiceImpl.getDefaultIdentifierValidator(PatientServiceImpl.java:1468)
01-Jun-2019 18:29:04         at sun.reflect.NativeMethodAccessorImpl.invoke0(Native Method)
01-Jun-2019 18:29:04         at sun.reflect.NativeMethodAccessorImpl.invoke(NativeMethodAccessorImpl.java:62)
01-Jun-2019 18:29:04         at sun.reflect.DelegatingMethodAccessorImpl.invoke(DelegatingMethodAccessorImpl.java:43)
01-Jun-2019 18:29:04         at java.lang.reflect.Method.invoke(Method.java:498)
01-Jun-2019 18:29:04         at org.springframework.aop.support.AopUtils.invokeJoinpointUsingReflection(AopUtils.java:317)
01-Jun-2019 18:29:04         at org.springframework.aop.framework.ReflectiveMethodInvocation.invokeJoinpoint(ReflectiveMethodInvocation.java:183)
01-Jun-2019 18:29:04         at org.springframework.aop.framework.ReflectiveMethodInvocation.proceed(ReflectiveMethodInvocation.java:150)
01-Jun-2019 18:29:04         at org.springframework.transaction.interceptor.TransactionInterceptor$1.proceedWithInvocation(TransactionInterceptor.java:96)
01-Jun-2019 18:29:04         at org.springframework.transaction.interceptor.TransactionAspectSupport.invokeWithinTransaction(TransactionAspectSupport.java:260)
01-Jun-2019 18:29:04         at org.springframework.transaction.interceptor.TransactionInterceptor.invoke(TransactionInterceptor.java:94)
01-Jun-2019 18:29:04         at org.springframework.aop.framework.ReflectiveMethodInvocation.proceed(ReflectiveMethodInvocation.java:172)
01-Jun-2019 18:29:04         at org.springframework.aop.framework.JdkDynamicAopProxy.invoke(JdkDynamicAopProxy.java:204)
01-Jun-2019 18:29:04         at com.sun.proxy.$Proxy53.getDefaultIdentifierValidator(Unknown Source)
01-Jun-2019 18:29:04         at sun.reflect.NativeMethodAccessorImpl.invoke0(Native Method)
01-Jun-2019 18:29:04         at sun.reflect.NativeMethodAccessorImpl.invoke(NativeMethodAccessorImpl.java:62)
01-Jun-2019 18:29:04         at sun.reflect.DelegatingMethodAccessorImpl.invoke(DelegatingMethodAccessorImpl.java:43)
01-Jun-2019 18:29:04         at java.lang.reflect.Method.invoke(Method.java:498)
01-Jun-2019 18:29:04         at org.springframework.aop.support.AopUtils.invokeJoinpointUsingReflection(AopUtils.java:317)
01-Jun-2019 18:29:04         at org.springframework.aop.framework.ReflectiveMethodInvocation.invokeJoinpoint(ReflectiveMethodInvocation.java:183)
01-Jun-2019 18:29:04         at org.springframework.aop.framework.ReflectiveMethodInvocation.proceed(ReflectiveMethodInvocation.java:150)
01-Jun-2019 18:29:04         at org.openmrs.aop.LoggingAdvice.invoke(LoggingAdvice.java:121)
01-Jun-2019 18:29:04         at org.springframework.aop.framework.ReflectiveMethodInvocation.proceed(ReflectiveMethodInvocation.java:172)
01-Jun-2019 18:29:04         at org.springframework.aop.framework.adapter.MethodBeforeAdviceInterceptor.invoke(MethodBeforeAdviceInterceptor.java:51)
01-Jun-2019 18:29:04         at org.springframework.aop.framework.ReflectiveMethodInvocation.proceed(ReflectiveMethodInvocation.java:172)
01-Jun-2019 18:29:04         at org.springframework.aop.framework.adapter.MethodBeforeAdviceInterceptor.invoke(MethodBeforeAdviceInterceptor.java:51)
01-Jun-2019 18:29:04         at org.springframework.aop.framework.ReflectiveMethodInvocation.proceed(ReflectiveMethodInvocation.java:172)
01-Jun-2019 18:29:04         at org.springframework.aop.framework.JdkDynamicAopProxy.invoke(JdkDynamicAopProxy.java:204)
01-Jun-2019 18:29:04         at com.sun.proxy.$Proxy54.getDefaultIdentifierValidator(Unknown Source)
01-Jun-2019 18:29:04         at org.openmrs.web.controller.patient.PatientIdentifierTypeFormController.referenceData(PatientIdentifierTypeFormController.java:170)
01-Jun-2019 18:29:04         at org.springframework.web.servlet.mvc.AbstractFormController.showForm(AbstractFormController.java:578)
01-Jun-2019 18:29:04         at org.springframework.web.servlet.mvc.SimpleFormController.showForm(SimpleFormController.java:201)
01-Jun-2019 18:29:04         at org.springframework.web.servlet.mvc.SimpleFormController.showForm(SimpleFormController.java:178)
01-Jun-2019 18:29:04         at org.openmrs.web.controller.patient.PatientIdentifierTypeFormController.onSubmit(PatientIdentifierTypeFormController.java:122)
01-Jun-2019 18:29:04         at org.springframework.web.servlet.mvc.SimpleFormController.processFormSubmission(SimpleFormController.java:272)
01-Jun-2019 18:29:04         at org.springframework.web.servlet.mvc.AbstractFormController.handleRequestInternal(AbstractFormController.java:268)
01-Jun-2019 18:29:04         at org.springframework.web.servlet.mvc.AbstractController.handleRequest(AbstractController.java:153)
01-Jun-2019 18:29:04         at org.openmrs.web.controller.patient.PatientIdentifierTypeFormControllerTest.shouldNotSavePatientIdentifierTypeWhenPatientIdentifierTypesAreLocked(PatientIdentifierTypeFormControllerTest.java:54)
01-Jun-2019 18:29:04         at sun.reflect.NativeMethodAccessorImpl.invoke0(Native Method)
01-Jun-2019 18:29:04         at sun.reflect.NativeMethodAccessorImpl.invoke(NativeMethodAccessorImpl.java:62)
01-Jun-2019 18:29:04         at sun.reflect.DelegatingMethodAccessorImpl.invoke(DelegatingMethodAccessorImpl.java:43)
01-Jun-2019 18:29:04         at java.lang.reflect.Method.invoke(Method.java:498)
01-Jun-2019 18:29:04         at org.junit.runners.model.FrameworkMethod$1.runReflectiveCall(FrameworkMethod.java:47)
01-Jun-2019 18:29:04         at org.junit.internal.runners.model.ReflectiveCallable.run(ReflectiveCallable.java:12)
01-Jun-2019 18:29:04         at org.junit.runners.model.FrameworkMethod.invokeExplosively(FrameworkMethod.java:44)
01-Jun-2019 18:29:04         at org.junit.internal.runners.statements.InvokeMethod.evaluate(InvokeMethod.java:17)
01-Jun-2019 18:29:04         at org.junit.internal.runners.statements.RunBefores.evaluate(RunBefores.java:26)
01-Jun-2019 18:29:04         at org.springframework.test.context.junit4.statements.RunBeforeTestMethodCallbacks.evaluate(RunBeforeTestMethodCallbacks.java:74)
01-Jun-2019 18:29:04         at org.junit.internal.runners.statements.RunAfters.evaluate(RunAfters.java:27)
01-Jun-2019 18:29:04         at org.springframework.test.context.junit4.statements.RunAfterTestMethodCallbacks.evaluate(RunAfterTestMethodCallbacks.java:83)
01-Jun-2019 18:29:04         at org.springframework.test.context.junit4.statements.SpringRepeat.evaluate(SpringRepeat.java:72)
01-Jun-2019 18:29:04         at org.springframework.test.context.junit4.SpringJUnit4ClassRunner.runChild(SpringJUnit4ClassRunner.java:231)
01-Jun-2019 18:29:04         at org.springframework.test.context.junit4.SpringJUnit4ClassRunner.runChild(SpringJUnit4ClassRunner.java:88)
01-Jun-2019 18:29:04         at org.junit.runners.ParentRunner$3.run(ParentRunner.java:238)
01-Jun-2019 18:29:04         at org.junit.runners.ParentRunner$1.schedule(ParentRunner.java:63)
01-Jun-2019 18:29:04         at org.junit.runners.ParentRunner.runChildren(ParentRunner.java:236)
01-Jun-2019 18:29:04         at org.junit.runners.ParentRunner.access$000(ParentRunner.java:53)
01-Jun-2019 18:29:04         at org.junit.runners.ParentRunner$2.evaluate(ParentRunner.java:229)
01-Jun-2019 18:29:04         at org.springframework.test.context.junit4.statements.RunBeforeTestClassCallbacks.evaluate(RunBeforeTestClassCallbacks.java:61)
01-Jun-2019 18:29:04         at org.junit.internal.runners.statements.RunAfters.evaluate(RunAfters.java:27)
01-Jun-2019 18:29:04         at org.springframework.test.context.junit4.statements.RunAfterTestClassCallbacks.evaluate(RunAfterTestClassCallbacks.java:71)
01-Jun-2019 18:29:04         at org.junit.runners.ParentRunner.run(ParentRunner.java:309)
01-Jun-2019 18:29:04         at org.springframework.test.context.junit4.SpringJUnit4ClassRunner.run(SpringJUnit4ClassRunner.java:174)
01-Jun-2019 18:29:04         at org.apache.maven.surefire.junit4.JUnit4TestSet.execute(JUnit4TestSet.java:59)
01-Jun-2019 18:29:04         at org.apache.maven.surefire.suite.AbstractDirectoryTestSuite.executeTestSet(AbstractDirectoryTestSuite.java:115)
01-Jun-2019 18:29:04         at org.apache.maven.surefire.suite.AbstractDirectoryTestSuite.execute(AbstractDirectoryTestSuite.java:102)
01-Jun-2019 18:29:04         at org.apache.maven.surefire.Surefire.run(Surefire.java:180)
01-Jun-2019 18:29:04         at sun.reflect.NativeMethodAccessorImpl.invoke0(Native Method)
01-Jun-2019 18:29:04         at sun.reflect.NativeMethodAccessorImpl.invoke(NativeMethodAccessorImpl.java:62)
01-Jun-2019 18:29:04         at sun.reflect.DelegatingMethodAccessorImpl.invoke(DelegatingMethodAccessorImpl.java:43)
01-Jun-2019 18:29:04         at java.lang.reflect.Method.invoke(Method.java:498)
01-Jun-2019 18:29:04         at org.apache.maven.surefire.booter.SurefireBooter.runSuitesInProcess(SurefireBooter.java:350)
01-Jun-2019 18:29:04         at org.apache.maven.surefire.booter.SurefireBooter.main(SurefireBooter.java:1021)
01-Jun-2019 18:29:04 ERROR - PatientIdentifierTypeFormController.onSubmit(119) |2019-06-01 18:29:04,311| PatientIdentifierType.locked
01-Jun-2019 18:29:04 org.openmrs.api.PatientIdentifierTypeLockedException: PatientIdentifierType.locked
01-Jun-2019 18:29:04         at org.openmrs.api.impl.PatientServiceImpl.checkIfPatientIdentifierTypesAreLocked(PatientServiceImpl.java:1771)
01-Jun-2019 18:29:04         at org.openmrs.api.impl.PatientServiceImpl.purgePatientIdentifierType(PatientServiceImpl.java:690)
01-Jun-2019 18:29:04         at sun.reflect.NativeMethodAccessorImpl.invoke0(Native Method)
01-Jun-2019 18:29:04         at sun.reflect.NativeMethodAccessorImpl.invoke(NativeMethodAccessorImpl.java:62)
01-Jun-2019 18:29:04         at sun.reflect.DelegatingMethodAccessorImpl.invoke(DelegatingMethodAccessorImpl.java:43)
01-Jun-2019 18:29:04         at java.lang.reflect.Method.invoke(Method.java:498)
01-Jun-2019 18:29:04         at org.springframework.aop.support.AopUtils.invokeJoinpointUsingReflection(AopUtils.java:317)
01-Jun-2019 18:29:04         at org.springframework.aop.framework.ReflectiveMethodInvocation.invokeJoinpoint(ReflectiveMethodInvocation.java:183)
01-Jun-2019 18:29:04         at org.springframework.aop.framework.ReflectiveMethodInvocation.proceed(ReflectiveMethodInvocation.java:150)
01-Jun-2019 18:29:04         at org.springframework.transaction.interceptor.TransactionInterceptor$1.proceedWithInvocation(TransactionInterceptor.java:96)
01-Jun-2019 18:29:04         at org.springframework.transaction.interceptor.TransactionAspectSupport.invokeWithinTransaction(TransactionAspectSupport.java:260)
01-Jun-2019 18:29:04         at org.springframework.transaction.interceptor.TransactionInterceptor.invoke(TransactionInterceptor.java:94)
01-Jun-2019 18:29:04         at org.springframework.aop.framework.ReflectiveMethodInvocation.proceed(ReflectiveMethodInvocation.java:172)
01-Jun-2019 18:29:04         at org.springframework.aop.framework.JdkDynamicAopProxy.invoke(JdkDynamicAopProxy.java:204)
01-Jun-2019 18:29:04         at com.sun.proxy.$Proxy53.purgePatientIdentifierType(Unknown Source)
01-Jun-2019 18:29:04         at sun.reflect.NativeMethodAccessorImpl.invoke0(Native Method)
01-Jun-2019 18:29:04         at sun.reflect.NativeMethodAccessorImpl.invoke(NativeMethodAccessorImpl.java:62)
01-Jun-2019 18:29:04         at sun.reflect.DelegatingMethodAccessorImpl.invoke(DelegatingMethodAccessorImpl.java:43)
01-Jun-2019 18:29:04         at java.lang.reflect.Method.invoke(Method.java:498)
01-Jun-2019 18:29:04         at org.springframework.aop.support.AopUtils.invokeJoinpointUsingReflection(AopUtils.java:317)
01-Jun-2019 18:29:04         at org.springframework.aop.framework.ReflectiveMethodInvocation.invokeJoinpoint(ReflectiveMethodInvocation.java:183)
01-Jun-2019 18:29:04         at org.springframework.aop.framework.ReflectiveMethodInvocation.proceed(ReflectiveMethodInvocation.java:150)
01-Jun-2019 18:29:04         at org.openmrs.aop.LoggingAdvice.invoke(LoggingAdvice.java:121)
01-Jun-2019 18:29:04         at org.springframework.aop.framework.ReflectiveMethodInvocation.proceed(ReflectiveMethodInvocation.java:172)
01-Jun-2019 18:29:04         at org.springframework.aop.framework.adapter.MethodBeforeAdviceInterceptor.invoke(MethodBeforeAdviceInterceptor.java:51)
01-Jun-2019 18:29:04         at org.springframework.aop.framework.ReflectiveMethodInvocation.proceed(ReflectiveMethodInvocation.java:172)
01-Jun-2019 18:29:04         at org.springframework.aop.framework.adapter.MethodBeforeAdviceInterceptor.invoke(MethodBeforeAdviceInterceptor.java:51)
01-Jun-2019 18:29:04         at org.springframework.aop.framework.ReflectiveMethodInvocation.proceed(ReflectiveMethodInvocation.java:172)
01-Jun-2019 18:29:04         at org.springframework.aop.framework.JdkDynamicAopProxy.invoke(JdkDynamicAopProxy.java:204)
01-Jun-2019 18:29:04         at com.sun.proxy.$Proxy54.purgePatientIdentifierType(Unknown Source)
01-Jun-2019 18:29:04         at org.openmrs.web.controller.patient.PatientIdentifierTypeFormController.onSubmit(PatientIdentifierTypeFormController.java:102)
01-Jun-2019 18:29:04         at org.springframework.web.servlet.mvc.SimpleFormController.processFormSubmission(SimpleFormController.java:272)
01-Jun-2019 18:29:04         at org.springframework.web.servlet.mvc.AbstractFormController.handleRequestInternal(AbstractFormController.java:268)
01-Jun-2019 18:29:04         at org.springframework.web.servlet.mvc.AbstractController.handleRequest(AbstractController.java:153)
01-Jun-2019 18:29:04         at org.openmrs.web.controller.patient.PatientIdentifierTypeFormControllerTest.shouldNotDeletePatientIdentifierTypeWhenPatientIdentifierTypesAreLocked(PatientIdentifierTypeFormControllerTest.java:85)
01-Jun-2019 18:29:04         at sun.reflect.NativeMethodAccessorImpl.invoke0(Native Method)
01-Jun-2019 18:29:04         at sun.reflect.NativeMethodAccessorImpl.invoke(NativeMethodAccessorImpl.java:62)
01-Jun-2019 18:29:04         at sun.reflect.DelegatingMethodAccessorImpl.invoke(DelegatingMethodAccessorImpl.java:43)
01-Jun-2019 18:29:04         at java.lang.reflect.Method.invoke(Method.java:498)
01-Jun-2019 18:29:04         at org.junit.runners.model.FrameworkMethod$1.runReflectiveCall(FrameworkMethod.java:47)
01-Jun-2019 18:29:04         at org.junit.internal.runners.model.ReflectiveCallable.run(ReflectiveCallable.java:12)
01-Jun-2019 18:29:04         at org.junit.runners.model.FrameworkMethod.invokeExplosively(FrameworkMethod.java:44)
01-Jun-2019 18:29:04         at org.junit.internal.runners.statements.InvokeMethod.evaluate(InvokeMethod.java:17)
01-Jun-2019 18:29:04         at org.junit.internal.runners.statements.RunBefores.evaluate(RunBefores.java:26)
01-Jun-2019 18:29:04         at org.springframework.test.context.junit4.statements.RunBeforeTestMethodCallbacks.evaluate(RunBeforeTestMethodCallbacks.java:74)
01-Jun-2019 18:29:04         at org.junit.internal.runners.statements.RunAfters.evaluate(RunAfters.java:27)
01-Jun-2019 18:29:04         at org.springframework.test.context.junit4.statements.RunAfterTestMethodCallbacks.evaluate(RunAfterTestMethodCallbacks.java:83)
01-Jun-2019 18:29:04         at org.springframework.test.context.junit4.statements.SpringRepeat.evaluate(SpringRepeat.java:72)
01-Jun-2019 18:29:04         at org.springframework.test.context.junit4.SpringJUnit4ClassRunner.runChild(SpringJUnit4ClassRunner.java:231)
01-Jun-2019 18:29:04         at org.springframework.test.context.junit4.SpringJUnit4ClassRunner.runChild(SpringJUnit4ClassRunner.java:88)
01-Jun-2019 18:29:04         at org.junit.runners.ParentRunner$3.run(ParentRunner.java:238)
01-Jun-2019 18:29:04         at org.junit.runners.ParentRunner$1.schedule(ParentRunner.java:63)
01-Jun-2019 18:29:04         at org.junit.runners.ParentRunner.runChildren(ParentRunner.java:236)
01-Jun-2019 18:29:04         at org.junit.runners.ParentRunner.access$000(ParentRunner.java:53)
01-Jun-2019 18:29:04         at org.junit.runners.ParentRunner$2.evaluate(ParentRunner.java:229)
01-Jun-2019 18:29:04         at org.springframework.test.context.junit4.statements.RunBeforeTestClassCallbacks.evaluate(RunBeforeTestClassCallbacks.java:61)
01-Jun-2019 18:29:04         at org.junit.internal.runners.statements.RunAfters.evaluate(RunAfters.java:27)
01-Jun-2019 18:29:04         at org.springframework.test.context.junit4.statements.RunAfterTestClassCallbacks.evaluate(RunAfterTestClassCallbacks.java:71)
01-Jun-2019 18:29:04         at org.junit.runners.ParentRunner.run(ParentRunner.java:309)
01-Jun-2019 18:29:04         at org.springframework.test.context.junit4.SpringJUnit4ClassRunner.run(SpringJUnit4ClassRunner.java:174)
01-Jun-2019 18:29:04         at org.apache.maven.surefire.junit4.JUnit4TestSet.execute(JUnit4TestSet.java:59)
01-Jun-2019 18:29:04         at org.apache.maven.surefire.suite.AbstractDirectoryTestSuite.executeTestSet(AbstractDirectoryTestSuite.java:115)
01-Jun-2019 18:29:04         at org.apache.maven.surefire.suite.AbstractDirectoryTestSuite.execute(AbstractDirectoryTestSuite.java:102)
01-Jun-2019 18:29:04         at org.apache.maven.surefire.Surefire.run(Surefire.java:180)
01-Jun-2019 18:29:04         at sun.reflect.NativeMethodAccessorImpl.invoke0(Native Method)
01-Jun-2019 18:29:04         at sun.reflect.NativeMethodAccessorImpl.invoke(NativeMethodAccessorImpl.java:62)
01-Jun-2019 18:29:04         at sun.reflect.DelegatingMethodAccessorImpl.invoke(DelegatingMethodAccessorImpl.java:43)
01-Jun-2019 18:29:04         at java.lang.reflect.Method.invoke(Method.java:498)
01-Jun-2019 18:29:04         at org.apache.maven.surefire.booter.SurefireBooter.runSuitesInProcess(SurefireBooter.java:350)
01-Jun-2019 18:29:04         at org.apache.maven.surefire.booter.SurefireBooter.main(SurefireBooter.java:1021)
01-Jun-2019 18:29:04 ERROR - PatientServiceImpl.getDefaultIdentifierValidator(1471) |2019-06-01 18:29:04,330| Global Property patient.defaultPatientIdentifierValidator not set to an actual class.
01-Jun-2019 18:29:04 java.lang.ClassNotFoundException:
01-Jun-2019 18:29:04         at java.lang.Class.forName0(Native Method)
01-Jun-2019 18:29:04         at java.lang.Class.forName(Class.java:264)
01-Jun-2019 18:29:04         at org.openmrs.api.impl.PatientServiceImpl.getDefaultIdentifierValidator(PatientServiceImpl.java:1468)
01-Jun-2019 18:29:04         at sun.reflect.NativeMethodAccessorImpl.invoke0(Native Method)
01-Jun-2019 18:29:04         at sun.reflect.NativeMethodAccessorImpl.invoke(NativeMethodAccessorImpl.java:62)
01-Jun-2019 18:29:04         at sun.reflect.DelegatingMethodAccessorImpl.invoke(DelegatingMethodAccessorImpl.java:43)
01-Jun-2019 18:29:04         at java.lang.reflect.Method.invoke(Method.java:498)
01-Jun-2019 18:29:04         at org.springframework.aop.support.AopUtils.invokeJoinpointUsingReflection(AopUtils.java:317)
01-Jun-2019 18:29:04         at org.springframework.aop.framework.ReflectiveMethodInvocation.invokeJoinpoint(ReflectiveMethodInvocation.java:183)
01-Jun-2019 18:29:04         at org.springframework.aop.framework.ReflectiveMethodInvocation.proceed(ReflectiveMethodInvocation.java:150)
01-Jun-2019 18:29:04         at org.springframework.transaction.interceptor.TransactionInterceptor$1.proceedWithInvocation(TransactionInterceptor.java:96)
01-Jun-2019 18:29:04         at org.springframework.transaction.interceptor.TransactionAspectSupport.invokeWithinTransaction(TransactionAspectSupport.java:260)
01-Jun-2019 18:29:04         at org.springframework.transaction.interceptor.TransactionInterceptor.invoke(TransactionInterceptor.java:94)
01-Jun-2019 18:29:04         at org.springframework.aop.framework.ReflectiveMethodInvocation.proceed(ReflectiveMethodInvocation.java:172)
01-Jun-2019 18:29:04         at org.springframework.aop.framework.JdkDynamicAopProxy.invoke(JdkDynamicAopProxy.java:204)
01-Jun-2019 18:29:04         at com.sun.proxy.$Proxy53.getDefaultIdentifierValidator(Unknown Source)
01-Jun-2019 18:29:04         at sun.reflect.NativeMethodAccessorImpl.invoke0(Native Method)
01-Jun-2019 18:29:04         at sun.reflect.NativeMethodAccessorImpl.invoke(NativeMethodAccessorImpl.java:62)
01-Jun-2019 18:29:04         at sun.reflect.DelegatingMethodAccessorImpl.invoke(DelegatingMethodAccessorImpl.java:43)
01-Jun-2019 18:29:04         at java.lang.reflect.Method.invoke(Method.java:498)
01-Jun-2019 18:29:04         at org.springframework.aop.support.AopUtils.invokeJoinpointUsingReflection(AopUtils.java:317)
01-Jun-2019 18:29:04         at org.springframework.aop.framework.ReflectiveMethodInvocation.invokeJoinpoint(ReflectiveMethodInvocation.java:183)
01-Jun-2019 18:29:04         at org.springframework.aop.framework.ReflectiveMethodInvocation.proceed(ReflectiveMethodInvocation.java:150)
01-Jun-2019 18:29:04         at org.openmrs.aop.LoggingAdvice.invoke(LoggingAdvice.java:121)
01-Jun-2019 18:29:04         at org.springframework.aop.framework.ReflectiveMethodInvocation.proceed(ReflectiveMethodInvocation.java:172)
01-Jun-2019 18:29:04         at org.springframework.aop.framework.adapter.MethodBeforeAdviceInterceptor.invoke(MethodBeforeAdviceInterceptor.java:51)
01-Jun-2019 18:29:04         at org.springframework.aop.framework.ReflectiveMethodInvocation.proceed(ReflectiveMethodInvocation.java:172)
01-Jun-2019 18:29:04         at org.springframework.aop.framework.adapter.MethodBeforeAdviceInterceptor.invoke(MethodBeforeAdviceInterceptor.java:51)
01-Jun-2019 18:29:04         at org.springframework.aop.framework.ReflectiveMethodInvocation.proceed(ReflectiveMethodInvocation.java:172)
01-Jun-2019 18:29:04         at org.springframework.aop.framework.JdkDynamicAopProxy.invoke(JdkDynamicAopProxy.java:204)
01-Jun-2019 18:29:04         at com.sun.proxy.$Proxy54.getDefaultIdentifierValidator(Unknown Source)
01-Jun-2019 18:29:04         at org.openmrs.web.controller.patient.PatientIdentifierTypeFormController.referenceData(PatientIdentifierTypeFormController.java:170)
01-Jun-2019 18:29:04         at org.springframework.web.servlet.mvc.AbstractFormController.showForm(AbstractFormController.java:578)
01-Jun-2019 18:29:04         at org.springframework.web.servlet.mvc.SimpleFormController.showForm(SimpleFormController.java:201)
01-Jun-2019 18:29:04         at org.springframework.web.servlet.mvc.SimpleFormController.showForm(SimpleFormController.java:178)
01-Jun-2019 18:29:04         at org.openmrs.web.controller.patient.PatientIdentifierTypeFormController.onSubmit(PatientIdentifierTypeFormController.java:122)
01-Jun-2019 18:29:04         at org.springframework.web.servlet.mvc.SimpleFormController.processFormSubmission(SimpleFormController.java:272)
01-Jun-2019 18:29:04         at org.springframework.web.servlet.mvc.AbstractFormController.handleRequestInternal(AbstractFormController.java:268)
01-Jun-2019 18:29:04         at org.springframework.web.servlet.mvc.AbstractController.handleRequest(AbstractController.java:153)
01-Jun-2019 18:29:04         at org.openmrs.web.controller.patient.PatientIdentifierTypeFormControllerTest.shouldNotDeletePatientIdentifierTypeWhenPatientIdentifierTypesAreLocked(PatientIdentifierTypeFormControllerTest.java:85)
01-Jun-2019 18:29:04         at sun.reflect.NativeMethodAccessorImpl.invoke0(Native Method)
01-Jun-2019 18:29:04         at sun.reflect.NativeMethodAccessorImpl.invoke(NativeMethodAccessorImpl.java:62)
01-Jun-2019 18:29:04         at sun.reflect.DelegatingMethodAccessorImpl.invoke(DelegatingMethodAccessorImpl.java:43)
01-Jun-2019 18:29:04         at java.lang.reflect.Method.invoke(Method.java:498)
01-Jun-2019 18:29:04         at org.junit.runners.model.FrameworkMethod$1.runReflectiveCall(FrameworkMethod.java:47)
01-Jun-2019 18:29:04         at org.junit.internal.runners.model.ReflectiveCallable.run(ReflectiveCallable.java:12)
01-Jun-2019 18:29:04         at org.junit.runners.model.FrameworkMethod.invokeExplosively(FrameworkMethod.java:44)
01-Jun-2019 18:29:04         at org.junit.internal.runners.statements.InvokeMethod.evaluate(InvokeMethod.java:17)
01-Jun-2019 18:29:04         at org.junit.internal.runners.statements.RunBefores.evaluate(RunBefores.java:26)
01-Jun-2019 18:29:04         at org.springframework.test.context.junit4.statements.RunBeforeTestMethodCallbacks.evaluate(RunBeforeTestMethodCallbacks.java:74)
01-Jun-2019 18:29:04         at org.junit.internal.runners.statements.RunAfters.evaluate(RunAfters.java:27)
01-Jun-2019 18:29:04         at org.springframework.test.context.junit4.statements.RunAfterTestMethodCallbacks.evaluate(RunAfterTestMethodCallbacks.java:83)
01-Jun-2019 18:29:04         at org.springframework.test.context.junit4.statements.SpringRepeat.evaluate(SpringRepeat.java:72)
01-Jun-2019 18:29:04         at org.springframework.test.context.junit4.SpringJUnit4ClassRunner.runChild(SpringJUnit4ClassRunner.java:231)
01-Jun-2019 18:29:04         at org.springframework.test.context.junit4.SpringJUnit4ClassRunner.runChild(SpringJUnit4ClassRunner.java:88)
01-Jun-2019 18:29:04         at org.junit.runners.ParentRunner$3.run(ParentRunner.java:238)
01-Jun-2019 18:29:04         at org.junit.runners.ParentRunner$1.schedule(ParentRunner.java:63)
01-Jun-2019 18:29:04         at org.junit.runners.ParentRunner.runChildren(ParentRunner.java:236)
01-Jun-2019 18:29:04         at org.junit.runners.ParentRunner.access$000(ParentRunner.java:53)
01-Jun-2019 18:29:04         at org.junit.runners.ParentRunner$2.evaluate(ParentRunner.java:229)
01-Jun-2019 18:29:04         at org.springframework.test.context.junit4.statements.RunBeforeTestClassCallbacks.evaluate(RunBeforeTestClassCallbacks.java:61)
01-Jun-2019 18:29:04         at org.junit.internal.runners.statements.RunAfters.evaluate(RunAfters.java:27)
01-Jun-2019 18:29:04         at org.springframework.test.context.junit4.statements.RunAfterTestClassCallbacks.evaluate(RunAfterTestClassCallbacks.java:71)
01-Jun-2019 18:29:04         at org.junit.runners.ParentRunner.run(ParentRunner.java:309)
01-Jun-2019 18:29:04         at org.springframework.test.context.junit4.SpringJUnit4ClassRunner.run(SpringJUnit4ClassRunner.java:174)
01-Jun-2019 18:29:04         at org.apache.maven.surefire.junit4.JUnit4TestSet.execute(JUnit4TestSet.java:59)
01-Jun-2019 18:29:04         at org.apache.maven.surefire.suite.AbstractDirectoryTestSuite.executeTestSet(AbstractDirectoryTestSuite.java:115)
01-Jun-2019 18:29:04         at org.apache.maven.surefire.suite.AbstractDirectoryTestSuite.execute(AbstractDirectoryTestSuite.java:102)
01-Jun-2019 18:29:04         at org.apache.maven.surefire.Surefire.run(Surefire.java:180)
01-Jun-2019 18:29:04         at sun.reflect.NativeMethodAccessorImpl.invoke0(Native Method)
01-Jun-2019 18:29:04         at sun.reflect.NativeMethodAccessorImpl.invoke(NativeMethodAccessorImpl.java:62)
01-Jun-2019 18:29:04         at sun.reflect.DelegatingMethodAccessorImpl.invoke(DelegatingMethodAccessorImpl.java:43)
01-Jun-2019 18:29:04         at java.lang.reflect.Method.invoke(Method.java:498)
01-Jun-2019 18:29:04         at org.apache.maven.surefire.booter.SurefireBooter.runSuitesInProcess(SurefireBooter.java:350)
01-Jun-2019 18:29:04         at org.apache.maven.surefire.booter.SurefireBooter.main(SurefireBooter.java:1021)
01-Jun-2019 18:29:04 ERROR - PatientIdentifierTypeFormController.onSubmit(119) |2019-06-01 18:29:04,376| PatientIdentifierType.locked
01-Jun-2019 18:29:04 org.openmrs.api.PatientIdentifierTypeLockedException: PatientIdentifierType.locked
01-Jun-2019 18:29:04         at org.openmrs.api.impl.PatientServiceImpl.checkIfPatientIdentifierTypesAreLocked(PatientServiceImpl.java:1771)
01-Jun-2019 18:29:04         at org.openmrs.api.impl.PatientServiceImpl.unretirePatientIdentifierType(PatientServiceImpl.java:678)
01-Jun-2019 18:29:04         at sun.reflect.NativeMethodAccessorImpl.invoke0(Native Method)
01-Jun-2019 18:29:04         at sun.reflect.NativeMethodAccessorImpl.invoke(NativeMethodAccessorImpl.java:62)
01-Jun-2019 18:29:04         at sun.reflect.DelegatingMethodAccessorImpl.invoke(DelegatingMethodAccessorImpl.java:43)
01-Jun-2019 18:29:04         at java.lang.reflect.Method.invoke(Method.java:498)
01-Jun-2019 18:29:04         at org.springframework.aop.support.AopUtils.invokeJoinpointUsingReflection(AopUtils.java:317)
01-Jun-2019 18:29:04         at org.springframework.aop.framework.ReflectiveMethodInvocation.invokeJoinpoint(ReflectiveMethodInvocation.java:183)
01-Jun-2019 18:29:04         at org.springframework.aop.framework.ReflectiveMethodInvocation.proceed(ReflectiveMethodInvocation.java:150)
01-Jun-2019 18:29:04         at org.springframework.transaction.interceptor.TransactionInterceptor$1.proceedWithInvocation(TransactionInterceptor.java:96)
01-Jun-2019 18:29:04         at org.springframework.transaction.interceptor.TransactionAspectSupport.invokeWithinTransaction(TransactionAspectSupport.java:260)
01-Jun-2019 18:29:04         at org.springframework.transaction.interceptor.TransactionInterceptor.invoke(TransactionInterceptor.java:94)
01-Jun-2019 18:29:04         at org.springframework.aop.framework.ReflectiveMethodInvocation.proceed(ReflectiveMethodInvocation.java:172)
01-Jun-2019 18:29:04         at org.springframework.aop.framework.JdkDynamicAopProxy.invoke(JdkDynamicAopProxy.java:204)
01-Jun-2019 18:29:04         at com.sun.proxy.$Proxy53.unretirePatientIdentifierType(Unknown Source)
01-Jun-2019 18:29:04         at sun.reflect.NativeMethodAccessorImpl.invoke0(Native Method)
01-Jun-2019 18:29:04         at sun.reflect.NativeMethodAccessorImpl.invoke(NativeMethodAccessorImpl.java:62)
01-Jun-2019 18:29:04         at sun.reflect.DelegatingMethodAccessorImpl.invoke(DelegatingMethodAccessorImpl.java:43)
01-Jun-2019 18:29:04         at java.lang.reflect.Method.invoke(Method.java:498)
01-Jun-2019 18:29:04         at org.springframework.aop.support.AopUtils.invokeJoinpointUsingReflection(AopUtils.java:317)
01-Jun-2019 18:29:04         at org.springframework.aop.framework.ReflectiveMethodInvocation.invokeJoinpoint(ReflectiveMethodInvocation.java:183)
01-Jun-2019 18:29:04         at org.springframework.aop.framework.ReflectiveMethodInvocation.proceed(ReflectiveMethodInvocation.java:150)
01-Jun-2019 18:29:04         at org.openmrs.aop.LoggingAdvice.invoke(LoggingAdvice.java:121)
01-Jun-2019 18:29:04         at org.springframework.aop.framework.ReflectiveMethodInvocation.proceed(ReflectiveMethodInvocation.java:172)
01-Jun-2019 18:29:04         at org.springframework.aop.framework.adapter.MethodBeforeAdviceInterceptor.invoke(MethodBeforeAdviceInterceptor.java:51)
01-Jun-2019 18:29:04         at org.springframework.aop.framework.ReflectiveMethodInvocation.proceed(ReflectiveMethodInvocation.java:172)
01-Jun-2019 18:29:04         at org.springframework.aop.framework.adapter.MethodBeforeAdviceInterceptor.invoke(MethodBeforeAdviceInterceptor.java:51)
01-Jun-2019 18:29:04         at org.springframework.aop.framework.ReflectiveMethodInvocation.proceed(ReflectiveMethodInvocation.java:172)
01-Jun-2019 18:29:04         at org.springframework.aop.framework.JdkDynamicAopProxy.invoke(JdkDynamicAopProxy.java:204)
01-Jun-2019 18:29:04         at com.sun.proxy.$Proxy54.unretirePatientIdentifierType(Unknown Source)
01-Jun-2019 18:29:04         at org.openmrs.web.controller.patient.PatientIdentifierTypeFormController.onSubmit(PatientIdentifierTypeFormController.java:113)
01-Jun-2019 18:29:04         at org.springframework.web.servlet.mvc.SimpleFormController.processFormSubmission(SimpleFormController.java:272)
01-Jun-2019 18:29:04         at org.springframework.web.servlet.mvc.AbstractFormController.handleRequestInternal(AbstractFormController.java:268)
01-Jun-2019 18:29:04         at org.springframework.web.servlet.mvc.AbstractController.handleRequest(AbstractController.java:153)
01-Jun-2019 18:29:04         at org.openmrs.web.controller.patient.PatientIdentifierTypeFormControllerTest.shouldNotUnretirePatientIdentifierTypeWhenPatientIdentifierTypesAreLocked(PatientIdentifierTypeFormControllerTest.java:75)
01-Jun-2019 18:29:04         at sun.reflect.NativeMethodAccessorImpl.invoke0(Native Method)
01-Jun-2019 18:29:04         at sun.reflect.NativeMethodAccessorImpl.invoke(NativeMethodAccessorImpl.java:62)
01-Jun-2019 18:29:04         at sun.reflect.DelegatingMethodAccessorImpl.invoke(DelegatingMethodAccessorImpl.java:43)
01-Jun-2019 18:29:04         at java.lang.reflect.Method.invoke(Method.java:498)
01-Jun-2019 18:29:04         at org.junit.runners.model.FrameworkMethod$1.runReflectiveCall(FrameworkMethod.java:47)
01-Jun-2019 18:29:04         at org.junit.internal.runners.model.ReflectiveCallable.run(ReflectiveCallable.java:12)
01-Jun-2019 18:29:04         at org.junit.runners.model.FrameworkMethod.invokeExplosively(FrameworkMethod.java:44)
01-Jun-2019 18:29:04         at org.junit.internal.runners.statements.InvokeMethod.evaluate(InvokeMethod.java:17)
01-Jun-2019 18:29:04         at org.junit.internal.runners.statements.RunBefores.evaluate(RunBefores.java:26)
01-Jun-2019 18:29:04         at org.springframework.test.context.junit4.statements.RunBeforeTestMethodCallbacks.evaluate(RunBeforeTestMethodCallbacks.java:74)
01-Jun-2019 18:29:04         at org.junit.internal.runners.statements.RunAfters.evaluate(RunAfters.java:27)
01-Jun-2019 18:29:04         at org.springframework.test.context.junit4.statements.RunAfterTestMethodCallbacks.evaluate(RunAfterTestMethodCallbacks.java:83)
01-Jun-2019 18:29:04         at org.springframework.test.context.junit4.statements.SpringRepeat.evaluate(SpringRepeat.java:72)
01-Jun-2019 18:29:04         at org.springframework.test.context.junit4.SpringJUnit4ClassRunner.runChild(SpringJUnit4ClassRunner.java:231)
01-Jun-2019 18:29:04         at org.springframework.test.context.junit4.SpringJUnit4ClassRunner.runChild(SpringJUnit4ClassRunner.java:88)
01-Jun-2019 18:29:04         at org.junit.runners.ParentRunner$3.run(ParentRunner.java:238)
01-Jun-2019 18:29:04         at org.junit.runners.ParentRunner$1.schedule(ParentRunner.java:63)
01-Jun-2019 18:29:04         at org.junit.runners.ParentRunner.runChildren(ParentRunner.java:236)
01-Jun-2019 18:29:04         at org.junit.runners.ParentRunner.access$000(ParentRunner.java:53)
01-Jun-2019 18:29:04         at org.junit.runners.ParentRunner$2.evaluate(ParentRunner.java:229)
01-Jun-2019 18:29:04         at org.springframework.test.context.junit4.statements.RunBeforeTestClassCallbacks.evaluate(RunBeforeTestClassCallbacks.java:61)
01-Jun-2019 18:29:04         at org.junit.internal.runners.statements.RunAfters.evaluate(RunAfters.java:27)
01-Jun-2019 18:29:04         at org.springframework.test.context.junit4.statements.RunAfterTestClassCallbacks.evaluate(RunAfterTestClassCallbacks.java:71)
01-Jun-2019 18:29:04         at org.junit.runners.ParentRunner.run(ParentRunner.java:309)
01-Jun-2019 18:29:04         at org.springframework.test.context.junit4.SpringJUnit4ClassRunner.run(SpringJUnit4ClassRunner.java:174)
01-Jun-2019 18:29:04         at org.apache.maven.surefire.junit4.JUnit4TestSet.execute(JUnit4TestSet.java:59)
01-Jun-2019 18:29:04         at org.apache.maven.surefire.suite.AbstractDirectoryTestSuite.executeTestSet(AbstractDirectoryTestSuite.java:115)
01-Jun-2019 18:29:04         at org.apache.maven.surefire.suite.AbstractDirectoryTestSuite.execute(AbstractDirectoryTestSuite.java:102)
01-Jun-2019 18:29:04         at org.apache.maven.surefire.Surefire.run(Surefire.java:180)
01-Jun-2019 18:29:04         at sun.reflect.NativeMethodAccessorImpl.invoke0(Native Method)
01-Jun-2019 18:29:04         at sun.reflect.NativeMethodAccessorImpl.invoke(NativeMethodAccessorImpl.java:62)
01-Jun-2019 18:29:04         at sun.reflect.DelegatingMethodAccessorImpl.invoke(DelegatingMethodAccessorImpl.java:43)
01-Jun-2019 18:29:04         at java.lang.reflect.Method.invoke(Method.java:498)
01-Jun-2019 18:29:04         at org.apache.maven.surefire.booter.SurefireBooter.runSuitesInProcess(SurefireBooter.java:350)
01-Jun-2019 18:29:04         at org.apache.maven.surefire.booter.SurefireBooter.main(SurefireBooter.java:1021)
01-Jun-2019 18:29:04 ERROR - PatientServiceImpl.getDefaultIdentifierValidator(1471) |2019-06-01 18:29:04,379| Global Property patient.defaultPatientIdentifierValidator not set to an actual class.
01-Jun-2019 18:29:04 java.lang.ClassNotFoundException:
01-Jun-2019 18:29:04         at java.lang.Class.forName0(Native Method)
01-Jun-2019 18:29:04         at java.lang.Class.forName(Class.java:264)
01-Jun-2019 18:29:04         at org.openmrs.api.impl.PatientServiceImpl.getDefaultIdentifierValidator(PatientServiceImpl.java:1468)
01-Jun-2019 18:29:04         at sun.reflect.NativeMethodAccessorImpl.invoke0(Native Method)
01-Jun-2019 18:29:04         at sun.reflect.NativeMethodAccessorImpl.invoke(NativeMethodAccessorImpl.java:62)
01-Jun-2019 18:29:04         at sun.reflect.DelegatingMethodAccessorImpl.invoke(DelegatingMethodAccessorImpl.java:43)
01-Jun-2019 18:29:04         at java.lang.reflect.Method.invoke(Method.java:498)
01-Jun-2019 18:29:04         at org.springframework.aop.support.AopUtils.invokeJoinpointUsingReflection(AopUtils.java:317)
01-Jun-2019 18:29:04         at org.springframework.aop.framework.ReflectiveMethodInvocation.invokeJoinpoint(ReflectiveMethodInvocation.java:183)
01-Jun-2019 18:29:04         at org.springframework.aop.framework.ReflectiveMethodInvocation.proceed(ReflectiveMethodInvocation.java:150)
01-Jun-2019 18:29:04         at org.springframework.transaction.interceptor.TransactionInterceptor$1.proceedWithInvocation(TransactionInterceptor.java:96)
01-Jun-2019 18:29:04         at org.springframework.transaction.interceptor.TransactionAspectSupport.invokeWithinTransaction(TransactionAspectSupport.java:260)
01-Jun-2019 18:29:04         at org.springframework.transaction.interceptor.TransactionInterceptor.invoke(TransactionInterceptor.java:94)
01-Jun-2019 18:29:04         at org.springframework.aop.framework.ReflectiveMethodInvocation.proceed(ReflectiveMethodInvocation.java:172)
01-Jun-2019 18:29:04         at org.springframework.aop.framework.JdkDynamicAopProxy.invoke(JdkDynamicAopProxy.java:204)
01-Jun-2019 18:29:04         at com.sun.proxy.$Proxy53.getDefaultIdentifierValidator(Unknown Source)
01-Jun-2019 18:29:04         at sun.reflect.NativeMethodAccessorImpl.invoke0(Native Method)
01-Jun-2019 18:29:04         at sun.reflect.NativeMethodAccessorImpl.invoke(NativeMethodAccessorImpl.java:62)
01-Jun-2019 18:29:04         at sun.reflect.DelegatingMethodAccessorImpl.invoke(DelegatingMethodAccessorImpl.java:43)
01-Jun-2019 18:29:04         at java.lang.reflect.Method.invoke(Method.java:498)
01-Jun-2019 18:29:04         at org.springframework.aop.support.AopUtils.invokeJoinpointUsingReflection(AopUtils.java:317)
01-Jun-2019 18:29:04         at org.springframework.aop.framework.ReflectiveMethodInvocation.invokeJoinpoint(ReflectiveMethodInvocation.java:183)
01-Jun-2019 18:29:04         at org.springframework.aop.framework.ReflectiveMethodInvocation.proceed(ReflectiveMethodInvocation.java:150)
01-Jun-2019 18:29:04         at org.openmrs.aop.LoggingAdvice.invoke(LoggingAdvice.java:121)
01-Jun-2019 18:29:04         at org.springframework.aop.framework.ReflectiveMethodInvocation.proceed(ReflectiveMethodInvocation.java:172)
01-Jun-2019 18:29:04         at org.springframework.aop.framework.adapter.MethodBeforeAdviceInterceptor.invoke(MethodBeforeAdviceInterceptor.java:51)
01-Jun-2019 18:29:04         at org.springframework.aop.framework.ReflectiveMethodInvocation.proceed(ReflectiveMethodInvocation.java:172)
01-Jun-2019 18:29:04         at org.springframework.aop.framework.adapter.MethodBeforeAdviceInterceptor.invoke(MethodBeforeAdviceInterceptor.java:51)
01-Jun-2019 18:29:04         at org.springframework.aop.framework.ReflectiveMethodInvocation.proceed(ReflectiveMethodInvocation.java:172)
01-Jun-2019 18:29:04         at org.springframework.aop.framework.JdkDynamicAopProxy.invoke(JdkDynamicAopProxy.java:204)
01-Jun-2019 18:29:04         at com.sun.proxy.$Proxy54.getDefaultIdentifierValidator(Unknown Source)
01-Jun-2019 18:29:04         at org.openmrs.web.controller.patient.PatientIdentifierTypeFormController.referenceData(PatientIdentifierTypeFormController.java:170)
01-Jun-2019 18:29:04         at org.springframework.web.servlet.mvc.AbstractFormController.showForm(AbstractFormController.java:578)
01-Jun-2019 18:29:04         at org.springframework.web.servlet.mvc.SimpleFormController.showForm(SimpleFormController.java:201)
01-Jun-2019 18:29:04         at org.springframework.web.servlet.mvc.SimpleFormController.showForm(SimpleFormController.java:178)
01-Jun-2019 18:29:04         at org.openmrs.web.controller.patient.PatientIdentifierTypeFormController.onSubmit(PatientIdentifierTypeFormController.java:122)
01-Jun-2019 18:29:04         at org.springframework.web.servlet.mvc.SimpleFormController.processFormSubmission(SimpleFormController.java:272)
01-Jun-2019 18:29:04         at org.springframework.web.servlet.mvc.AbstractFormController.handleRequestInternal(AbstractFormController.java:268)
01-Jun-2019 18:29:04         at org.springframework.web.servlet.mvc.AbstractController.handleRequest(AbstractController.java:153)
01-Jun-2019 18:29:04         at org.openmrs.web.controller.patient.PatientIdentifierTypeFormControllerTest.shouldNotUnretirePatientIdentifierTypeWhenPatientIdentifierTypesAreLocked(PatientIdentifierTypeFormControllerTest.java:75)
01-Jun-2019 18:29:04         at sun.reflect.NativeMethodAccessorImpl.invoke0(Native Method)
01-Jun-2019 18:29:04         at sun.reflect.NativeMethodAccessorImpl.invoke(NativeMethodAccessorImpl.java:62)
01-Jun-2019 18:29:04         at sun.reflect.DelegatingMethodAccessorImpl.invoke(DelegatingMethodAccessorImpl.java:43)
01-Jun-2019 18:29:04         at java.lang.reflect.Method.invoke(Method.java:498)
01-Jun-2019 18:29:04         at org.junit.runners.model.FrameworkMethod$1.runReflectiveCall(FrameworkMethod.java:47)
01-Jun-2019 18:29:04         at org.junit.internal.runners.model.ReflectiveCallable.run(ReflectiveCallable.java:12)
01-Jun-2019 18:29:04         at org.junit.runners.model.FrameworkMethod.invokeExplosively(FrameworkMethod.java:44)
01-Jun-2019 18:29:04         at org.junit.internal.runners.statements.InvokeMethod.evaluate(InvokeMethod.java:17)
01-Jun-2019 18:29:04         at org.junit.internal.runners.statements.RunBefores.evaluate(RunBefores.java:26)
01-Jun-2019 18:29:04         at org.springframework.test.context.junit4.statements.RunBeforeTestMethodCallbacks.evaluate(RunBeforeTestMethodCallbacks.java:74)
01-Jun-2019 18:29:04         at org.junit.internal.runners.statements.RunAfters.evaluate(RunAfters.java:27)
01-Jun-2019 18:29:04         at org.springframework.test.context.junit4.statements.RunAfterTestMethodCallbacks.evaluate(RunAfterTestMethodCallbacks.java:83)
01-Jun-2019 18:29:04         at org.springframework.test.context.junit4.statements.SpringRepeat.evaluate(SpringRepeat.java:72)
01-Jun-2019 18:29:04         at org.springframework.test.context.junit4.SpringJUnit4ClassRunner.runChild(SpringJUnit4ClassRunner.java:231)
01-Jun-2019 18:29:04         at org.springframework.test.context.junit4.SpringJUnit4ClassRunner.runChild(SpringJUnit4ClassRunner.java:88)
01-Jun-2019 18:29:04         at org.junit.runners.ParentRunner$3.run(ParentRunner.java:238)
01-Jun-2019 18:29:04         at org.junit.runners.ParentRunner$1.schedule(ParentRunner.java:63)
01-Jun-2019 18:29:04         at org.junit.runners.ParentRunner.runChildren(ParentRunner.java:236)
01-Jun-2019 18:29:04         at org.junit.runners.ParentRunner.access$000(ParentRunner.java:53)
01-Jun-2019 18:29:04         at org.junit.runners.ParentRunner$2.evaluate(ParentRunner.java:229)
01-Jun-2019 18:29:04         at org.springframework.test.context.junit4.statements.RunBeforeTestClassCallbacks.evaluate(RunBeforeTestClassCallbacks.java:61)
01-Jun-2019 18:29:04         at org.junit.internal.runners.statements.RunAfters.evaluate(RunAfters.java:27)
01-Jun-2019 18:29:04         at org.springframework.test.context.junit4.statements.RunAfterTestClassCallbacks.evaluate(RunAfterTestClassCallbacks.java:71)
01-Jun-2019 18:29:04         at org.junit.runners.ParentRunner.run(ParentRunner.java:309)
01-Jun-2019 18:29:04         at org.springframework.test.context.junit4.SpringJUnit4ClassRunner.run(SpringJUnit4ClassRunner.java:174)
01-Jun-2019 18:29:04         at org.apache.maven.surefire.junit4.JUnit4TestSet.execute(JUnit4TestSet.java:59)
01-Jun-2019 18:29:04         at org.apache.maven.surefire.suite.AbstractDirectoryTestSuite.executeTestSet(AbstractDirectoryTestSuite.java:115)
01-Jun-2019 18:29:04         at org.apache.maven.surefire.suite.AbstractDirectoryTestSuite.execute(AbstractDirectoryTestSuite.java:102)
01-Jun-2019 18:29:04         at org.apache.maven.surefire.Surefire.run(Surefire.java:180)
01-Jun-2019 18:29:04         at sun.reflect.NativeMethodAccessorImpl.invoke0(Native Method)
01-Jun-2019 18:29:04         at sun.reflect.NativeMethodAccessorImpl.invoke(NativeMethodAccessorImpl.java:62)
01-Jun-2019 18:29:04         at sun.reflect.DelegatingMethodAccessorImpl.invoke(DelegatingMethodAccessorImpl.java:43)
01-Jun-2019 18:29:04         at java.lang.reflect.Method.invoke(Method.java:498)
01-Jun-2019 18:29:04         at org.apache.maven.surefire.booter.SurefireBooter.runSuitesInProcess(SurefireBooter.java:350)
01-Jun-2019 18:29:04         at org.apache.maven.surefire.booter.SurefireBooter.main(SurefireBooter.java:1021)
01-Jun-2019 18:29:04 ERROR - PatientIdentifierTypeFormController.onSubmit(119) |2019-06-01 18:29:04,409| PatientIdentifierType.locked
01-Jun-2019 18:29:04 org.openmrs.api.PatientIdentifierTypeLockedException: PatientIdentifierType.locked
01-Jun-2019 18:29:04         at org.openmrs.api.impl.PatientServiceImpl.checkIfPatientIdentifierTypesAreLocked(PatientServiceImpl.java:1771)
01-Jun-2019 18:29:04         at org.openmrs.api.impl.PatientServiceImpl.retirePatientIdentifierType(PatientServiceImpl.java:661)
01-Jun-2019 18:29:04         at sun.reflect.NativeMethodAccessorImpl.invoke0(Native Method)
01-Jun-2019 18:29:04         at sun.reflect.NativeMethodAccessorImpl.invoke(NativeMethodAccessorImpl.java:62)
01-Jun-2019 18:29:04         at sun.reflect.DelegatingMethodAccessorImpl.invoke(DelegatingMethodAccessorImpl.java:43)
01-Jun-2019 18:29:04         at java.lang.reflect.Method.invoke(Method.java:498)
01-Jun-2019 18:29:04         at org.springframework.aop.support.AopUtils.invokeJoinpointUsingReflection(AopUtils.java:317)
01-Jun-2019 18:29:04         at org.springframework.aop.framework.ReflectiveMethodInvocation.invokeJoinpoint(ReflectiveMethodInvocation.java:183)
01-Jun-2019 18:29:04         at org.springframework.aop.framework.ReflectiveMethodInvocation.proceed(ReflectiveMethodInvocation.java:150)
01-Jun-2019 18:29:04         at org.springframework.transaction.interceptor.TransactionInterceptor$1.proceedWithInvocation(TransactionInterceptor.java:96)
01-Jun-2019 18:29:04         at org.springframework.transaction.interceptor.TransactionAspectSupport.invokeWithinTransaction(TransactionAspectSupport.java:260)
01-Jun-2019 18:29:04         at org.springframework.transaction.interceptor.TransactionInterceptor.invoke(TransactionInterceptor.java:94)
01-Jun-2019 18:29:04         at org.springframework.aop.framework.ReflectiveMethodInvocation.proceed(ReflectiveMethodInvocation.java:172)
01-Jun-2019 18:29:04         at org.springframework.aop.framework.JdkDynamicAopProxy.invoke(JdkDynamicAopProxy.java:204)
01-Jun-2019 18:29:04         at com.sun.proxy.$Proxy53.retirePatientIdentifierType(Unknown Source)
01-Jun-2019 18:29:04         at sun.reflect.NativeMethodAccessorImpl.invoke0(Native Method)
01-Jun-2019 18:29:04         at sun.reflect.NativeMethodAccessorImpl.invoke(NativeMethodAccessorImpl.java:62)
01-Jun-2019 18:29:04         at sun.reflect.DelegatingMethodAccessorImpl.invoke(DelegatingMethodAccessorImpl.java:43)
01-Jun-2019 18:29:04         at java.lang.reflect.Method.invoke(Method.java:498)
01-Jun-2019 18:29:04         at org.springframework.aop.support.AopUtils.invokeJoinpointUsingReflection(AopUtils.java:317)
01-Jun-2019 18:29:04         at org.springframework.aop.framework.ReflectiveMethodInvocation.invokeJoinpoint(ReflectiveMethodInvocation.java:183)
01-Jun-2019 18:29:04         at org.springframework.aop.framework.ReflectiveMethodInvocation.proceed(ReflectiveMethodInvocation.java:150)
01-Jun-2019 18:29:04         at org.openmrs.aop.LoggingAdvice.invoke(LoggingAdvice.java:121)
01-Jun-2019 18:29:04         at org.springframework.aop.framework.ReflectiveMethodInvocation.proceed(ReflectiveMethodInvocation.java:172)
01-Jun-2019 18:29:04         at org.springframework.aop.framework.adapter.MethodBeforeAdviceInterceptor.invoke(MethodBeforeAdviceInterceptor.java:51)
01-Jun-2019 18:29:04         at org.springframework.aop.framework.ReflectiveMethodInvocation.proceed(ReflectiveMethodInvocation.java:172)
01-Jun-2019 18:29:04         at org.springframework.aop.framework.adapter.MethodBeforeAdviceInterceptor.invoke(MethodBeforeAdviceInterceptor.java:51)
01-Jun-2019 18:29:04         at org.springframework.aop.framework.ReflectiveMethodInvocation.proceed(ReflectiveMethodInvocation.java:172)
01-Jun-2019 18:29:04         at org.springframework.aop.framework.JdkDynamicAopProxy.invoke(JdkDynamicAopProxy.java:204)
01-Jun-2019 18:29:04         at com.sun.proxy.$Proxy54.retirePatientIdentifierType(Unknown Source)
01-Jun-2019 18:29:04         at org.openmrs.web.controller.patient.PatientIdentifierTypeFormController.onSubmit(PatientIdentifierTypeFormController.java:95)
01-Jun-2019 18:29:04         at org.springframework.web.servlet.mvc.SimpleFormController.processFormSubmission(SimpleFormController.java:272)
01-Jun-2019 18:29:04         at org.springframework.web.servlet.mvc.AbstractFormController.handleRequestInternal(AbstractFormController.java:268)
01-Jun-2019 18:29:04         at org.springframework.web.servlet.mvc.AbstractController.handleRequest(AbstractController.java:153)
01-Jun-2019 18:29:04         at org.openmrs.web.controller.patient.PatientIdentifierTypeFormControllerTest.shouldNotRetirePatientIdentifierTypeWhenPatientIdentifierTypesAreLocked(PatientIdentifierTypeFormControllerTest.java:65)
01-Jun-2019 18:29:04         at sun.reflect.NativeMethodAccessorImpl.invoke0(Native Method)
01-Jun-2019 18:29:04         at sun.reflect.NativeMethodAccessorImpl.invoke(NativeMethodAccessorImpl.java:62)
01-Jun-2019 18:29:04         at sun.reflect.DelegatingMethodAccessorImpl.invoke(DelegatingMethodAccessorImpl.java:43)
01-Jun-2019 18:29:04         at java.lang.reflect.Method.invoke(Method.java:498)
01-Jun-2019 18:29:04         at org.junit.runners.model.FrameworkMethod$1.runReflectiveCall(FrameworkMethod.java:47)
01-Jun-2019 18:29:04         at org.junit.internal.runners.model.ReflectiveCallable.run(ReflectiveCallable.java:12)
01-Jun-2019 18:29:04         at org.junit.runners.model.FrameworkMethod.invokeExplosively(FrameworkMethod.java:44)
01-Jun-2019 18:29:04         at org.junit.internal.runners.statements.InvokeMethod.evaluate(InvokeMethod.java:17)
01-Jun-2019 18:29:04         at org.junit.internal.runners.statements.RunBefores.evaluate(RunBefores.java:26)
01-Jun-2019 18:29:04         at org.springframework.test.context.junit4.statements.RunBeforeTestMethodCallbacks.evaluate(RunBeforeTestMethodCallbacks.java:74)
01-Jun-2019 18:29:04         at org.junit.internal.runners.statements.RunAfters.evaluate(RunAfters.java:27)
01-Jun-2019 18:29:04         at org.springframework.test.context.junit4.statements.RunAfterTestMethodCallbacks.evaluate(RunAfterTestMethodCallbacks.java:83)
01-Jun-2019 18:29:04         at org.springframework.test.context.junit4.statements.SpringRepeat.evaluate(SpringRepeat.java:72)
01-Jun-2019 18:29:04         at org.springframework.test.context.junit4.SpringJUnit4ClassRunner.runChild(SpringJUnit4ClassRunner.java:231)
01-Jun-2019 18:29:04         at org.springframework.test.context.junit4.SpringJUnit4ClassRunner.runChild(SpringJUnit4ClassRunner.java:88)
01-Jun-2019 18:29:04         at org.junit.runners.ParentRunner$3.run(ParentRunner.java:238)
01-Jun-2019 18:29:04         at org.junit.runners.ParentRunner$1.schedule(ParentRunner.java:63)
01-Jun-2019 18:29:04         at org.junit.runners.ParentRunner.runChildren(ParentRunner.java:236)
01-Jun-2019 18:29:04         at org.junit.runners.ParentRunner.access$000(ParentRunner.java:53)
01-Jun-2019 18:29:04         at org.junit.runners.ParentRunner$2.evaluate(ParentRunner.java:229)
01-Jun-2019 18:29:04         at org.springframework.test.context.junit4.statements.RunBeforeTestClassCallbacks.evaluate(RunBeforeTestClassCallbacks.java:61)
01-Jun-2019 18:29:04         at org.junit.internal.runners.statements.RunAfters.evaluate(RunAfters.java:27)
01-Jun-2019 18:29:04         at org.springframework.test.context.junit4.statements.RunAfterTestClassCallbacks.evaluate(RunAfterTestClassCallbacks.java:71)
01-Jun-2019 18:29:04         at org.junit.runners.ParentRunner.run(ParentRunner.java:309)
01-Jun-2019 18:29:04         at org.springframework.test.context.junit4.SpringJUnit4ClassRunner.run(SpringJUnit4ClassRunner.java:174)
01-Jun-2019 18:29:04         at org.apache.maven.surefire.junit4.JUnit4TestSet.execute(JUnit4TestSet.java:59)
01-Jun-2019 18:29:04         at org.apache.maven.surefire.suite.AbstractDirectoryTestSuite.executeTestSet(AbstractDirectoryTestSuite.java:115)
01-Jun-2019 18:29:04         at org.apache.maven.surefire.suite.AbstractDirectoryTestSuite.execute(AbstractDirectoryTestSuite.java:102)
01-Jun-2019 18:29:04         at org.apache.maven.surefire.Surefire.run(Surefire.java:180)
01-Jun-2019 18:29:04         at sun.reflect.NativeMethodAccessorImpl.invoke0(Native Method)
01-Jun-2019 18:29:04         at sun.reflect.NativeMethodAccessorImpl.invoke(NativeMethodAccessorImpl.java:62)
01-Jun-2019 18:29:04         at sun.reflect.DelegatingMethodAccessorImpl.invoke(DelegatingMethodAccessorImpl.java:43)
01-Jun-2019 18:29:04         at java.lang.reflect.Method.invoke(Method.java:498)
01-Jun-2019 18:29:04         at org.apache.maven.surefire.booter.SurefireBooter.runSuitesInProcess(SurefireBooter.java:350)
01-Jun-2019 18:29:04         at org.apache.maven.surefire.booter.SurefireBooter.main(SurefireBooter.java:1021)
01-Jun-2019 18:29:04 ERROR - PatientServiceImpl.getDefaultIdentifierValidator(1471) |2019-06-01 18:29:04,417| Global Property patient.defaultPatientIdentifierValidator not set to an actual class.
01-Jun-2019 18:29:04 java.lang.ClassNotFoundException:
01-Jun-2019 18:29:04         at java.lang.Class.forName0(Native Method)
01-Jun-2019 18:29:04         at java.lang.Class.forName(Class.java:264)
01-Jun-2019 18:29:04         at org.openmrs.api.impl.PatientServiceImpl.getDefaultIdentifierValidator(PatientServiceImpl.java:1468)
01-Jun-2019 18:29:04         at sun.reflect.NativeMethodAccessorImpl.invoke0(Native Method)
01-Jun-2019 18:29:04         at sun.reflect.NativeMethodAccessorImpl.invoke(NativeMethodAccessorImpl.java:62)
01-Jun-2019 18:29:04         at sun.reflect.DelegatingMethodAccessorImpl.invoke(DelegatingMethodAccessorImpl.java:43)
01-Jun-2019 18:29:04         at java.lang.reflect.Method.invoke(Method.java:498)
01-Jun-2019 18:29:04         at org.springframework.aop.support.AopUtils.invokeJoinpointUsingReflection(AopUtils.java:317)
01-Jun-2019 18:29:04         at org.springframework.aop.framework.ReflectiveMethodInvocation.invokeJoinpoint(ReflectiveMethodInvocation.java:183)
01-Jun-2019 18:29:04         at org.springframework.aop.framework.ReflectiveMethodInvocation.proceed(ReflectiveMethodInvocation.java:150)
01-Jun-2019 18:29:04         at org.springframework.transaction.interceptor.TransactionInterceptor$1.proceedWithInvocation(TransactionInterceptor.java:96)
01-Jun-2019 18:29:04         at org.springframework.transaction.interceptor.TransactionAspectSupport.invokeWithinTransaction(TransactionAspectSupport.java:260)
01-Jun-2019 18:29:04         at org.springframework.transaction.interceptor.TransactionInterceptor.invoke(TransactionInterceptor.java:94)
01-Jun-2019 18:29:04         at org.springframework.aop.framework.ReflectiveMethodInvocation.proceed(ReflectiveMethodInvocation.java:172)
01-Jun-2019 18:29:04         at org.springframework.aop.framework.JdkDynamicAopProxy.invoke(JdkDynamicAopProxy.java:204)
01-Jun-2019 18:29:04         at com.sun.proxy.$Proxy53.getDefaultIdentifierValidator(Unknown Source)
01-Jun-2019 18:29:04         at sun.reflect.NativeMethodAccessorImpl.invoke0(Native Method)
01-Jun-2019 18:29:04         at sun.reflect.NativeMethodAccessorImpl.invoke(NativeMethodAccessorImpl.java:62)
01-Jun-2019 18:29:04         at sun.reflect.DelegatingMethodAccessorImpl.invoke(DelegatingMethodAccessorImpl.java:43)
01-Jun-2019 18:29:04         at java.lang.reflect.Method.invoke(Method.java:498)
01-Jun-2019 18:29:04         at org.springframework.aop.support.AopUtils.invokeJoinpointUsingReflection(AopUtils.java:317)
01-Jun-2019 18:29:04         at org.springframework.aop.framework.ReflectiveMethodInvocation.invokeJoinpoint(ReflectiveMethodInvocation.java:183)
01-Jun-2019 18:29:04         at org.springframework.aop.framework.ReflectiveMethodInvocation.proceed(ReflectiveMethodInvocation.java:150)
01-Jun-2019 18:29:04         at org.openmrs.aop.LoggingAdvice.invoke(LoggingAdvice.java:121)
01-Jun-2019 18:29:04         at org.springframework.aop.framework.ReflectiveMethodInvocation.proceed(ReflectiveMethodInvocation.java:172)
01-Jun-2019 18:29:04         at org.springframework.aop.framework.adapter.MethodBeforeAdviceInterceptor.invoke(MethodBeforeAdviceInterceptor.java:51)
01-Jun-2019 18:29:04         at org.springframework.aop.framework.ReflectiveMethodInvocation.proceed(ReflectiveMethodInvocation.java:172)
01-Jun-2019 18:29:04         at org.springframework.aop.framework.adapter.MethodBeforeAdviceInterceptor.invoke(MethodBeforeAdviceInterceptor.java:51)
01-Jun-2019 18:29:04         at org.springframework.aop.framework.ReflectiveMethodInvocation.proceed(ReflectiveMethodInvocation.java:172)
01-Jun-2019 18:29:04         at org.springframework.aop.framework.JdkDynamicAopProxy.invoke(JdkDynamicAopProxy.java:204)
01-Jun-2019 18:29:04         at com.sun.proxy.$Proxy54.getDefaultIdentifierValidator(Unknown Source)
01-Jun-2019 18:29:04         at org.openmrs.web.controller.patient.PatientIdentifierTypeFormController.referenceData(PatientIdentifierTypeFormController.java:170)
01-Jun-2019 18:29:04         at org.springframework.web.servlet.mvc.AbstractFormController.showForm(AbstractFormController.java:578)
01-Jun-2019 18:29:04         at org.springframework.web.servlet.mvc.SimpleFormController.showForm(SimpleFormController.java:201)
01-Jun-2019 18:29:04         at org.springframework.web.servlet.mvc.SimpleFormController.showForm(SimpleFormController.java:178)
01-Jun-2019 18:29:04         at org.openmrs.web.controller.patient.PatientIdentifierTypeFormController.onSubmit(PatientIdentifierTypeFormController.java:122)
01-Jun-2019 18:29:04         at org.springframework.web.servlet.mvc.SimpleFormController.processFormSubmission(SimpleFormController.java:272)
01-Jun-2019 18:29:04         at org.springframework.web.servlet.mvc.AbstractFormController.handleRequestInternal(AbstractFormController.java:268)
01-Jun-2019 18:29:04         at org.springframework.web.servlet.mvc.AbstractController.handleRequest(AbstractController.java:153)
01-Jun-2019 18:29:04         at org.openmrs.web.controller.patient.PatientIdentifierTypeFormControllerTest.shouldNotRetirePatientIdentifierTypeWhenPatientIdentifierTypesAreLocked(PatientIdentifierTypeFormControllerTest.java:65)
01-Jun-2019 18:29:04         at sun.reflect.NativeMethodAccessorImpl.invoke0(Native Method)
01-Jun-2019 18:29:04         at sun.reflect.NativeMethodAccessorImpl.invoke(NativeMethodAccessorImpl.java:62)
01-Jun-2019 18:29:04         at sun.reflect.DelegatingMethodAccessorImpl.invoke(DelegatingMethodAccessorImpl.java:43)
01-Jun-2019 18:29:04         at java.lang.reflect.Method.invoke(Method.java:498)
01-Jun-2019 18:29:04         at org.junit.runners.model.FrameworkMethod$1.runReflectiveCall(FrameworkMethod.java:47)
01-Jun-2019 18:29:04         at org.junit.internal.runners.model.ReflectiveCallable.run(ReflectiveCallable.java:12)
01-Jun-2019 18:29:04         at org.junit.runners.model.FrameworkMethod.invokeExplosively(FrameworkMethod.java:44)
01-Jun-2019 18:29:04         at org.junit.internal.runners.statements.InvokeMethod.evaluate(InvokeMethod.java:17)
01-Jun-2019 18:29:04         at org.junit.internal.runners.statements.RunBefores.evaluate(RunBefores.java:26)
01-Jun-2019 18:29:04         at org.springframework.test.context.junit4.statements.RunBeforeTestMethodCallbacks.evaluate(RunBeforeTestMethodCallbacks.java:74)
01-Jun-2019 18:29:04         at org.junit.internal.runners.statements.RunAfters.evaluate(RunAfters.java:27)
01-Jun-2019 18:29:04         at org.springframework.test.context.junit4.statements.RunAfterTestMethodCallbacks.evaluate(RunAfterTestMethodCallbacks.java:83)
01-Jun-2019 18:29:04         at org.springframework.test.context.junit4.statements.SpringRepeat.evaluate(SpringRepeat.java:72)
01-Jun-2019 18:29:04         at org.springframework.test.context.junit4.SpringJUnit4ClassRunner.runChild(SpringJUnit4ClassRunner.java:231)
01-Jun-2019 18:29:04         at org.springframework.test.context.junit4.SpringJUnit4ClassRunner.runChild(SpringJUnit4ClassRunner.java:88)
01-Jun-2019 18:29:04         at org.junit.runners.ParentRunner$3.run(ParentRunner.java:238)
01-Jun-2019 18:29:04         at org.junit.runners.ParentRunner$1.schedule(ParentRunner.java:63)
01-Jun-2019 18:29:04         at org.junit.runners.ParentRunner.runChildren(ParentRunner.java:236)
01-Jun-2019 18:29:04         at org.junit.runners.ParentRunner.access$000(ParentRunner.java:53)
01-Jun-2019 18:29:04         at org.junit.runners.ParentRunner$2.evaluate(ParentRunner.java:229)
01-Jun-2019 18:29:04         at org.springframework.test.context.junit4.statements.RunBeforeTestClassCallbacks.evaluate(RunBeforeTestClassCallbacks.java:61)
01-Jun-2019 18:29:04         at org.junit.internal.runners.statements.RunAfters.evaluate(RunAfters.java:27)
01-Jun-2019 18:29:04         at org.springframework.test.context.junit4.statements.RunAfterTestClassCallbacks.evaluate(RunAfterTestClassCallbacks.java:71)
01-Jun-2019 18:29:04         at org.junit.runners.ParentRunner.run(ParentRunner.java:309)
01-Jun-2019 18:29:04         at org.springframework.test.context.junit4.SpringJUnit4ClassRunner.run(SpringJUnit4ClassRunner.java:174)
01-Jun-2019 18:29:04         at org.apache.maven.surefire.junit4.JUnit4TestSet.execute(JUnit4TestSet.java:59)
01-Jun-2019 18:29:04         at org.apache.maven.surefire.suite.AbstractDirectoryTestSuite.executeTestSet(AbstractDirectoryTestSuite.java:115)
01-Jun-2019 18:29:04         at org.apache.maven.surefire.suite.AbstractDirectoryTestSuite.execute(AbstractDirectoryTestSuite.java:102)
01-Jun-2019 18:29:04         at org.apache.maven.surefire.Surefire.run(Surefire.java:180)
01-Jun-2019 18:29:04         at sun.reflect.NativeMethodAccessorImpl.invoke0(Native Method)
01-Jun-2019 18:29:04         at sun.reflect.NativeMethodAccessorImpl.invoke(NativeMethodAccessorImpl.java:62)
01-Jun-2019 18:29:04         at sun.reflect.DelegatingMethodAccessorImpl.invoke(DelegatingMethodAccessorImpl.java:43)
01-Jun-2019 18:29:04         at java.lang.reflect.Method.invoke(Method.java:498)
01-Jun-2019 18:29:04         at org.apache.maven.surefire.booter.SurefireBooter.runSuitesInProcess(SurefireBooter.java:350)
01-Jun-2019 18:29:04         at org.apache.maven.surefire.booter.SurefireBooter.main(SurefireBooter.java:1021)
01-Jun-2019 18:29:04 Tests run: 4, Failures: 0, Errors: 0, Skipped: 0, Time elapsed: 0.155 sec
01-Jun-2019 18:29:04 Running org.openmrs.web.taglib.RequireTagTest
01-Jun-2019 18:29:04 Tests run: 8, Failures: 0, Errors: 0, Skipped: 0, Time elapsed: 0.195 sec
01-Jun-2019 18:29:04 Running org.openmrs.web.controller.user.UserListControllerTest
01-Jun-2019 18:29:04 Tests run: 4, Failures: 0, Errors: 0, Skipped: 0, Time elapsed: 0.186 sec
01-Jun-2019 18:29:04 Running org.openmrs.web.taglib.FormatTagTest
01-Jun-2019 18:29:04 Tests run: 3, Failures: 0, Errors: 0, Skipped: 0, Time elapsed: 0.07 sec
01-Jun-2019 18:29:04 Running org.openmrs.web.dwr.DWRPatientServiceTest
01-Jun-2019 18:29:04 Tests run: 6, Failures: 0, Errors: 0, Skipped: 2, Time elapsed: 0.088 sec
01-Jun-2019 18:29:04 Running org.openmrs.web.dwr.ConceptListItemTest
01-Jun-2019 18:29:04 Tests run: 4, Failures: 0, Errors: 0, Skipped: 0, Time elapsed: 0.002 sec
01-Jun-2019 18:29:04 Running org.openmrs.scheduler.web.controller.TaskHelperTest
01-Jun-2019 18:29:06 Tests run: 6, Failures: 0, Errors: 0, Skipped: 0, Time elapsed: 1.325 sec
01-Jun-2019 18:29:06 Running org.openmrs.web.dwr.DWRProgramWorkflowServiceTest
01-Jun-2019 18:29:06 Tests run: 4, Failures: 0, Errors: 0, Skipped: 0, Time elapsed: 0.186 sec
01-Jun-2019 18:29:06 Running org.openmrs.web.controller.concept.ConceptProposalFormControllerTest
01-Jun-2019 18:29:06 Tests run: 1, Failures: 0, Errors: 0, Skipped: 0, Time elapsed: 0.046 sec
01-Jun-2019 18:29:06 Running org.openmrs.web.controller.PortletControllerTest
01-Jun-2019 18:29:06 Tests run: 2, Failures: 0, Errors: 0, Skipped: 0, Time elapsed: 0.08 sec
01-Jun-2019 18:29:06 Running org.openmrs.web.controller.concept.ConceptStopWordListControllerTest
01-Jun-2019 18:29:06 Tests run: 5, Failures: 0, Errors: 0, Skipped: 0, Time elapsed: 0.026 sec
01-Jun-2019 18:29:06 Running org.openmrs.scheduler.web.controller.SchedulerFormControllerTest
01-Jun-2019 18:29:07 ERROR - JDBCExceptionReporter.logExceptions(234) |2019-06-01 18:29:07,725| Unique index or primary key violation: "CONSTRAINT_INDEX_24 ON PUBLIC.SCHEDULER_TASK_CONFIG(UUID) VALUES ('29754c38-6711-11e0-9d74-18a905e044dc', 1)"; SQL statement:
01-Jun-2019 18:29:07 insert into scheduler_task_config (task_config_id, uuid, name, description, schedulable_class, repeat_interval, start_time, start_time_pattern, last_execution_time, start_on_startup, started, created_by, changed_by, date_created, date_changed) values (null, ?, ?, ?, ?, ?, ?, ?, ?, ?, ?, ?, ?, ?, ?) [23505-187]
01-Jun-2019 18:29:07 Tests run: 4, Failures: 0, Errors: 0, Skipped: 1, Time elapsed: 1.16 sec
01-Jun-2019 18:29:07 Running org.openmrs.web.controller.form.FieldFormControllerTest
01-Jun-2019 18:29:07 Tests run: 3, Failures: 0, Errors: 0, Skipped: 0, Time elapsed: 0.164 sec
01-Jun-2019 18:29:07 Running org.openmrs.web.ForgotPasswordFormControllerTest
01-Jun-2019 18:29:08 Tests run: 8, Failures: 0, Errors: 0, Skipped: 0, Time elapsed: 0.084 sec
01-Jun-2019 18:29:08
01-Jun-2019 18:29:08 Results :
01-Jun-2019 18:29:08
01-Jun-2019 18:29:08 Tests run: 318, Failures: 0, Errors: 0, Skipped: 6
01-Jun-2019 18:29:08
01-Jun-2019 18:29:08 [INFO]
01-Jun-2019 18:29:08 [INFO] --- maven-jar-plugin:2.3.2:jar (default-jar) @ openmrs-web ---
01-Jun-2019 18:29:08 [INFO] Building jar: /home/bamboo-agent/bamboo-agent/xml-data/build-dir/TRUNK-OC12-JOB1/web/target/openmrs-web-1.12.2-SNAPSHOT.jar
01-Jun-2019 18:29:08 [INFO]
01-Jun-2019 18:29:08 [INFO] --- maven-jar-plugin:2.3.2:test-jar (default) @ openmrs-web ---
01-Jun-2019 18:29:08 [INFO] Building jar: /home/bamboo-agent/bamboo-agent/xml-data/build-dir/TRUNK-OC12-JOB1/web/target/openmrs-web-1.12.2-SNAPSHOT-tests.jar
01-Jun-2019 18:29:08 [INFO]
01-Jun-2019 18:29:08 [INFO] --- license-maven-plugin:2.6:check (default) @ openmrs-web ---
01-Jun-2019 18:29:08 [INFO] Checking licenses...
01-Jun-2019 18:29:08 [INFO]
01-Jun-2019 18:29:08 [INFO] --- animal-sniffer-maven-plugin:1.14:check (check-java-version) @ openmrs-web ---
01-Jun-2019 18:29:08 [INFO] Checking unresolved references to org.codehaus.mojo.signature:java16:1.1
01-Jun-2019 18:29:10 [INFO]
01-Jun-2019 18:29:10 [INFO] --- maven-install-plugin:2.4:install (default-install) @ openmrs-web ---
01-Jun-2019 18:29:10 [INFO] Installing /home/bamboo-agent/bamboo-agent/xml-data/build-dir/TRUNK-OC12-JOB1/web/target/openmrs-web-1.12.2-SNAPSHOT.jar to /home/bamboo-agent/.m2/repository/org/openmrs/web/openmrs-web/1.12.2-SNAPSHOT/openmrs-web-1.12.2-SNAPSHOT.jar
01-Jun-2019 18:29:10 [INFO] Installing /home/bamboo-agent/bamboo-agent/xml-data/build-dir/TRUNK-OC12-JOB1/web/pom.xml to /home/bamboo-agent/.m2/repository/org/openmrs/web/openmrs-web/1.12.2-SNAPSHOT/openmrs-web-1.12.2-SNAPSHOT.pom
01-Jun-2019 18:29:10 [INFO] Installing /home/bamboo-agent/bamboo-agent/xml-data/build-dir/TRUNK-OC12-JOB1/web/target/openmrs-web-1.12.2-SNAPSHOT-tests.jar to /home/bamboo-agent/.m2/repository/org/openmrs/web/openmrs-web/1.12.2-SNAPSHOT/openmrs-web-1.12.2-SNAPSHOT-tests.jar
01-Jun-2019 18:29:10 [INFO]
01-Jun-2019 18:29:10 [INFO] --- maven-deploy-plugin:2.7:deploy (default-deploy) @ openmrs-web ---
01-Jun-2019 18:29:10 [INFO] Downloading: http://mavenrepo.openmrs.org/nexus/content/repositories/snapshots/org/openmrs/web/openmrs-web/1.12.2-SNAPSHOT/maven-metadata.xml
01-Jun-2019 18:29:10 [INFO] Downloaded: http://mavenrepo.openmrs.org/nexus/content/repositories/snapshots/org/openmrs/web/openmrs-web/1.12.2-SNAPSHOT/maven-metadata.xml (992 B at 2.8 KB/sec)
01-Jun-2019 18:29:10 [INFO] Uploading: http://mavenrepo.openmrs.org/nexus/content/repositories/snapshots/org/openmrs/web/openmrs-web/1.12.2-SNAPSHOT/openmrs-web-1.12.2-20190601.182910-2.jar
01-Jun-2019 18:29:11 [INFO] Uploaded: http://mavenrepo.openmrs.org/nexus/content/repositories/snapshots/org/openmrs/web/openmrs-web/1.12.2-SNAPSHOT/openmrs-web-1.12.2-20190601.182910-2.jar (850 KB at 804.2 KB/sec)
01-Jun-2019 18:29:11 [INFO] Uploading: http://mavenrepo.openmrs.org/nexus/content/repositories/snapshots/org/openmrs/web/openmrs-web/1.12.2-SNAPSHOT/openmrs-web-1.12.2-20190601.182910-2.pom
01-Jun-2019 18:29:12 [INFO] Uploaded: http://mavenrepo.openmrs.org/nexus/content/repositories/snapshots/org/openmrs/web/openmrs-web/1.12.2-SNAPSHOT/openmrs-web-1.12.2-20190601.182910-2.pom (6 KB at 13.3 KB/sec)
01-Jun-2019 18:29:12 [INFO] Downloading: http://mavenrepo.openmrs.org/nexus/content/repositories/snapshots/org/openmrs/web/openmrs-web/maven-metadata.xml
01-Jun-2019 18:29:12 [INFO] Downloaded: http://mavenrepo.openmrs.org/nexus/content/repositories/snapshots/org/openmrs/web/openmrs-web/maven-metadata.xml (2 KB at 6.1 KB/sec)
01-Jun-2019 18:29:12 [INFO] Uploading: http://mavenrepo.openmrs.org/nexus/content/repositories/snapshots/org/openmrs/web/openmrs-web/1.12.2-SNAPSHOT/maven-metadata.xml
01-Jun-2019 18:29:12 [INFO] Uploaded: http://mavenrepo.openmrs.org/nexus/content/repositories/snapshots/org/openmrs/web/openmrs-web/1.12.2-SNAPSHOT/maven-metadata.xml (992 B at 2.6 KB/sec)
01-Jun-2019 18:29:12 [INFO] Uploading: http://mavenrepo.openmrs.org/nexus/content/repositories/snapshots/org/openmrs/web/openmrs-web/maven-metadata.xml
01-Jun-2019 18:29:13 [INFO] Uploaded: http://mavenrepo.openmrs.org/nexus/content/repositories/snapshots/org/openmrs/web/openmrs-web/maven-metadata.xml (2 KB at 3.7 KB/sec)
01-Jun-2019 18:29:13 [INFO] Uploading: http://mavenrepo.openmrs.org/nexus/content/repositories/snapshots/org/openmrs/web/openmrs-web/1.12.2-SNAPSHOT/openmrs-web-1.12.2-20190601.182910-2-tests.jar
01-Jun-2019 18:29:13 [INFO] Uploaded: http://mavenrepo.openmrs.org/nexus/content/repositories/snapshots/org/openmrs/web/openmrs-web/1.12.2-SNAPSHOT/openmrs-web-1.12.2-20190601.182910-2-tests.jar (193 KB at 406.2 KB/sec)
01-Jun-2019 18:29:13 [INFO] Uploading: http://mavenrepo.openmrs.org/nexus/content/repositories/snapshots/org/openmrs/web/openmrs-web/1.12.2-SNAPSHOT/maven-metadata.xml
01-Jun-2019 18:29:13 [INFO] Uploaded: http://mavenrepo.openmrs.org/nexus/content/repositories/snapshots/org/openmrs/web/openmrs-web/1.12.2-SNAPSHOT/maven-metadata.xml (992 B at 2.5 KB/sec)
01-Jun-2019 18:29:13 [INFO]                                                                         
01-Jun-2019 18:29:13 [INFO] ------------------------------------------------------------------------
01-Jun-2019 18:29:13 [INFO] Building openmrs-webapp 1.12.2-SNAPSHOT
01-Jun-2019 18:29:13 [INFO] ------------------------------------------------------------------------
01-Jun-2019 18:29:14 [INFO]
01-Jun-2019 18:29:14 [INFO] --- maven-clean-plugin:2.5:clean (default-clean) @ openmrs-webapp ---
01-Jun-2019 18:29:14 [INFO]
01-Jun-2019 18:29:14 [INFO] --- buildnumber-maven-plugin:1.1:create (default) @ openmrs-webapp ---
01-Jun-2019 18:29:14 [INFO]
01-Jun-2019 18:29:14 [INFO] --- build-helper-maven-plugin:1.5:parse-version (parse-version) @ openmrs-webapp ---
01-Jun-2019 18:29:14 [INFO]
01-Jun-2019 18:29:14 [INFO] --- maven-resources-plugin:2.4:resources (default-resources) @ openmrs-webapp ---
01-Jun-2019 18:29:14 [INFO] Using 'UTF-8' encoding to copy filtered resources.
01-Jun-2019 18:29:14 [INFO] Copying 7 resources
01-Jun-2019 18:29:14 [INFO] Copying 1 resource to ../jetty
01-Jun-2019 18:29:14 [INFO]
01-Jun-2019 18:29:14 [INFO] --- maven-antrun-plugin:1.4:run (default) @ openmrs-webapp ---
01-Jun-2019 18:29:14 project.artifactId
01-Jun-2019 18:29:14 [INFO] Executing tasks
01-Jun-2019 18:29:14     [unzip] Expanding: /home/bamboo-agent/bamboo-agent/xml-data/build-dir/TRUNK-OC12-JOB1/webapp/src/main/resources/liquibase-demo-data.zip into /home/bamboo-agent/bamboo-agent/xml-data/build-dir/TRUNK-OC12-JOB1/webapp/target/classes
01-Jun-2019 18:29:14 [INFO] Executed tasks
01-Jun-2019 18:29:14 [INFO]
01-Jun-2019 18:29:14 [INFO] --- maven-compiler-plugin:2.1:compile (default-compile) @ openmrs-webapp ---
01-Jun-2019 18:29:14 [INFO] No sources to compile
01-Jun-2019 18:29:14 [INFO]
01-Jun-2019 18:29:14 [INFO] --- maven-resources-plugin:2.4:testResources (default-testResources) @ openmrs-webapp ---
01-Jun-2019 18:29:14 [INFO] Using 'UTF-8' encoding to copy filtered resources.
01-Jun-2019 18:29:14 [INFO] Copying 1 resource
01-Jun-2019 18:29:14 [INFO]
01-Jun-2019 18:29:14 [INFO] --- maven-compiler-plugin:2.1:testCompile (default-testCompile) @ openmrs-webapp ---
01-Jun-2019 18:29:14 [INFO] Compiling 3 source files to /home/bamboo-agent/bamboo-agent/xml-data/build-dir/TRUNK-OC12-JOB1/webapp/target/test-classes
01-Jun-2019 18:29:15 [INFO]
01-Jun-2019 18:29:15 [INFO] --- maven-surefire-plugin:2.5:test (default-test) @ openmrs-webapp ---
01-Jun-2019 18:29:15 [INFO] Surefire report directory: /home/bamboo-agent/bamboo-agent/xml-data/build-dir/TRUNK-OC12-JOB1/webapp/target/surefire-reports
01-Jun-2019 18:29:15 OpenJDK 64-Bit Server VM warning: ignoring option MaxPermSize=512m; support was removed in 8.0
01-Jun-2019 18:29:15
01-Jun-2019 18:29:15 -------------------------------------------------------
01-Jun-2019 18:29:15 T E S T S
01-Jun-2019 18:29:15 -------------------------------------------------------
01-Jun-2019 18:29:15 Running org.openmrs.MessagePropertiesFilesTest
01-Jun-2019 18:29:15 Tests run: 13, Failures: 0, Errors: 0, Skipped: 0, Time elapsed: 0.388 sec
01-Jun-2019 18:29:15
01-Jun-2019 18:29:15 Results :
01-Jun-2019 18:29:15
01-Jun-2019 18:29:15 Tests run: 13, Failures: 0, Errors: 0, Skipped: 0
01-Jun-2019 18:29:15
01-Jun-2019 18:29:15 [INFO]
01-Jun-2019 18:29:15 [INFO] --- maven-war-plugin:2.4:war (default-war) @ openmrs-webapp ---
01-Jun-2019 18:29:16 [INFO] Packaging webapp
01-Jun-2019 18:29:16 [INFO] Assembling webapp [openmrs-webapp] in [/home/bamboo-agent/bamboo-agent/xml-data/build-dir/TRUNK-OC12-JOB1/webapp/target/openmrs]
01-Jun-2019 18:29:16 [INFO] Processing war project
01-Jun-2019 18:29:16 [INFO] Copying webapp webResources [/home/bamboo-agent/bamboo-agent/xml-data/build-dir/TRUNK-OC12-JOB1/webapp/src/main/webapp] to [/home/bamboo-agent/bamboo-agent/xml-data/build-dir/TRUNK-OC12-JOB1/webapp/target/openmrs]
01-Jun-2019 18:29:16 [INFO] Copying webapp resources [/home/bamboo-agent/bamboo-agent/xml-data/build-dir/TRUNK-OC12-JOB1/webapp/src/main/webapp]
01-Jun-2019 18:29:16 [INFO] Webapp assembled in [435 msecs]
01-Jun-2019 18:29:16 [INFO] Building war: /home/bamboo-agent/bamboo-agent/xml-data/build-dir/TRUNK-OC12-JOB1/webapp/target/openmrs.war
01-Jun-2019 18:29:19 [INFO]
01-Jun-2019 18:29:19 [INFO] --- maven-jar-plugin:2.3.2:test-jar (default) @ openmrs-webapp ---
01-Jun-2019 18:29:19 [INFO] Building jar: /home/bamboo-agent/bamboo-agent/xml-data/build-dir/TRUNK-OC12-JOB1/webapp/target/openmrs-tests.jar
01-Jun-2019 18:29:19 [INFO]
01-Jun-2019 18:29:19 [INFO] --- license-maven-plugin:2.6:check (default) @ openmrs-webapp ---
01-Jun-2019 18:29:19 [INFO] Checking licenses...
01-Jun-2019 18:29:19 [INFO]
01-Jun-2019 18:29:19 [INFO] --- animal-sniffer-maven-plugin:1.14:check (check-java-version) @ openmrs-webapp ---
01-Jun-2019 18:29:19 [INFO] Checking unresolved references to org.codehaus.mojo.signature:java16:1.1
01-Jun-2019 18:29:20 [INFO]
01-Jun-2019 18:29:20 [INFO] --- maven-install-plugin:2.4:install (default-install) @ openmrs-webapp ---
01-Jun-2019 18:29:20 [INFO] Installing /home/bamboo-agent/bamboo-agent/xml-data/build-dir/TRUNK-OC12-JOB1/webapp/target/openmrs.war to /home/bamboo-agent/.m2/repository/org/openmrs/web/openmrs-webapp/1.12.2-SNAPSHOT/openmrs-webapp-1.12.2-SNAPSHOT.war
01-Jun-2019 18:29:20 [INFO] Installing /home/bamboo-agent/bamboo-agent/xml-data/build-dir/TRUNK-OC12-JOB1/webapp/pom.xml to /home/bamboo-agent/.m2/repository/org/openmrs/web/openmrs-webapp/1.12.2-SNAPSHOT/openmrs-webapp-1.12.2-SNAPSHOT.pom
01-Jun-2019 18:29:20 [INFO] Installing /home/bamboo-agent/bamboo-agent/xml-data/build-dir/TRUNK-OC12-JOB1/webapp/target/openmrs-tests.jar to /home/bamboo-agent/.m2/repository/org/openmrs/web/openmrs-webapp/1.12.2-SNAPSHOT/openmrs-webapp-1.12.2-SNAPSHOT-tests.jar
01-Jun-2019 18:29:20 [INFO]
01-Jun-2019 18:29:20 [INFO] --- maven-deploy-plugin:2.7:deploy (default-deploy) @ openmrs-webapp ---
01-Jun-2019 18:29:20 [INFO] Downloading: http://mavenrepo.openmrs.org/nexus/content/repositories/snapshots/org/openmrs/web/openmrs-webapp/1.12.2-SNAPSHOT/maven-metadata.xml
01-Jun-2019 18:29:21 [INFO] Downloaded: http://mavenrepo.openmrs.org/nexus/content/repositories/snapshots/org/openmrs/web/openmrs-webapp/1.12.2-SNAPSHOT/maven-metadata.xml (995 B at 2.7 KB/sec)
01-Jun-2019 18:29:21 [INFO] Uploading: http://mavenrepo.openmrs.org/nexus/content/repositories/snapshots/org/openmrs/web/openmrs-webapp/1.12.2-SNAPSHOT/openmrs-webapp-1.12.2-20190601.182921-2.war
01-Jun-2019 18:29:27 [INFO] Uploaded: http://mavenrepo.openmrs.org/nexus/content/repositories/snapshots/org/openmrs/web/openmrs-webapp/1.12.2-SNAPSHOT/openmrs-webapp-1.12.2-20190601.182921-2.war (50888 KB at 8242.2 KB/sec)
01-Jun-2019 18:29:27 [INFO] Uploading: http://mavenrepo.openmrs.org/nexus/content/repositories/snapshots/org/openmrs/web/openmrs-webapp/1.12.2-SNAPSHOT/openmrs-webapp-1.12.2-20190601.182921-2.pom
01-Jun-2019 18:29:27 [INFO] Uploaded: http://mavenrepo.openmrs.org/nexus/content/repositories/snapshots/org/openmrs/web/openmrs-webapp/1.12.2-SNAPSHOT/openmrs-webapp-1.12.2-20190601.182921-2.pom (11 KB at 23.5 KB/sec)
01-Jun-2019 18:29:27 [INFO] Downloading: http://mavenrepo.openmrs.org/nexus/content/repositories/snapshots/org/openmrs/web/openmrs-webapp/maven-metadata.xml
01-Jun-2019 18:29:28 [INFO] Downloaded: http://mavenrepo.openmrs.org/nexus/content/repositories/snapshots/org/openmrs/web/openmrs-webapp/maven-metadata.xml (2 KB at 6.2 KB/sec)
01-Jun-2019 18:29:28 [INFO] Uploading: http://mavenrepo.openmrs.org/nexus/content/repositories/snapshots/org/openmrs/web/openmrs-webapp/1.12.2-SNAPSHOT/maven-metadata.xml
01-Jun-2019 18:29:28 [INFO] Uploaded: http://mavenrepo.openmrs.org/nexus/content/repositories/snapshots/org/openmrs/web/openmrs-webapp/1.12.2-SNAPSHOT/maven-metadata.xml (995 B at 2.5 KB/sec)
01-Jun-2019 18:29:28 [INFO] Uploading: http://mavenrepo.openmrs.org/nexus/content/repositories/snapshots/org/openmrs/web/openmrs-webapp/maven-metadata.xml
01-Jun-2019 18:29:29 [INFO] Uploaded: http://mavenrepo.openmrs.org/nexus/content/repositories/snapshots/org/openmrs/web/openmrs-webapp/maven-metadata.xml (2 KB at 3.4 KB/sec)
01-Jun-2019 18:29:29 [INFO] Uploading: http://mavenrepo.openmrs.org/nexus/content/repositories/snapshots/org/openmrs/web/openmrs-webapp/1.12.2-SNAPSHOT/openmrs-webapp-1.12.2-20190601.182921-2-tests.jar
01-Jun-2019 18:29:29 [INFO] Uploaded: http://mavenrepo.openmrs.org/nexus/content/repositories/snapshots/org/openmrs/web/openmrs-webapp/1.12.2-SNAPSHOT/openmrs-webapp-1.12.2-20190601.182921-2-tests.jar (9 KB at 20.0 KB/sec)
01-Jun-2019 18:29:29 [INFO] Uploading: http://mavenrepo.openmrs.org/nexus/content/repositories/snapshots/org/openmrs/web/openmrs-webapp/1.12.2-SNAPSHOT/maven-metadata.xml
01-Jun-2019 18:29:29 [INFO] Uploaded: http://mavenrepo.openmrs.org/nexus/content/repositories/snapshots/org/openmrs/web/openmrs-webapp/1.12.2-SNAPSHOT/maven-metadata.xml (995 B at 2.6 KB/sec)
01-Jun-2019 18:29:29 [INFO] ------------------------------------------------------------------------
01-Jun-2019 18:29:29 [INFO] Reactor Summary:
01-Jun-2019 18:29:29 [INFO]
01-Jun-2019 18:29:29 [INFO] OpenMRS ............................................ SUCCESS [  5.904 s]
01-Jun-2019 18:29:29 [INFO] openmrs-tools ...................................... SUCCESS [  4.564 s]
01-Jun-2019 18:29:29 [INFO] openmrs-test ....................................... SUCCESS [  3.428 s]
01-Jun-2019 18:29:29 [INFO] openmrs-api ........................................ SUCCESS [01:37 min]
01-Jun-2019 18:29:29 [INFO] openmrs-web ........................................ SUCCESS [ 40.056 s]
01-Jun-2019 18:29:29 [INFO] openmrs-webapp ..................................... SUCCESS [ 15.879 s]
01-Jun-2019 18:29:29 [INFO] ------------------------------------------------------------------------
01-Jun-2019 18:29:29 [INFO] BUILD SUCCESS
01-Jun-2019 18:29:29 [INFO] ------------------------------------------------------------------------
01-Jun-2019 18:29:29 [INFO] Total time: 02:47 min
01-Jun-2019 18:29:29 [INFO] Finished at: 2019-06-01T18:29:29+00:00
01-Jun-2019 18:29:30 [INFO] Final Memory: 90M/423M
01-Jun-2019 18:29:30 [INFO] ------------------------------------------------------------------------
01-Jun-2019 18:29:30 Parsing test results under /home/bamboo-agent/bamboo-agent/xml-data/build-dir/TRUNK-OC12-JOB1...
01-Jun-2019 18:29:31 Finished task 'Maven 3.x' with result: Success
01-Jun-2019 18:29:31 Running post build plugin 'Docker Container Cleanup'
01-Jun-2019 18:29:31 Running post build plugin 'NCover Results Collector'
01-Jun-2019 18:29:31 Running post build plugin 'Clover Results Collector'
01-Jun-2019 18:29:31 Running post build plugin 'Sauce OnDemand Post Runner'
01-Jun-2019 18:29:31 Running post build plugin 'npm Cache Cleanup'
01-Jun-2019 18:29:31 Running post build plugin 'Artifact Copier'
01-Jun-2019 18:29:31 Publishing an artifact: openmrs 1.12 war
01-Jun-2019 18:29:33 Finished publishing of artifact Non required shared artifact: [openmrs 1.12 war], pattern: [**/openmrs.war] anchored at: [webapp/target] in 2.746 s
01-Jun-2019 18:29:33 Publishing an artifact: openmrs 1.12 api jar
01-Jun-2019 18:29:34 Finished publishing of artifact Non required shared artifact: [openmrs 1.12 api jar], pattern: [**/openmrs-api*.jar] anchored at: [webapp/target/openmrs/WEB-INF/lib] in 799.2 ms
01-Jun-2019 18:29:34 Finalising the build...
01-Jun-2019 18:29:34 Stopping timer.
01-Jun-2019 18:29:34 Build TRUNK-OC12-JOB1-98 completed.
01-Jun-2019 18:29:34 Running on server: post build plugin 'NCover Results Collector'
01-Jun-2019 18:29:34 Running on server: post build plugin 'Build Hanging Detection Configuration'
01-Jun-2019 18:29:34 Running on server: post build plugin 'Clover Delta Calculator'
01-Jun-2019 18:29:34 Running on server: post build plugin 'Maven Dependencies Postprocessor'
01-Jun-2019 18:29:34 All post build plugins have finished
01-Jun-2019 18:29:35 Generating build results summary...
01-Jun-2019 18:29:37 Saving build results to disk...
01-Jun-2019 18:29:38 Logging substituted variables...
01-Jun-2019 18:29:38 Indexing build results...
01-Jun-2019 18:29:38 Finished building TRUNK-OC12-JOB1-98.