Plan for OpenMRS Core 2.0.x

Stages & jobs

  1. Build and Test

  2. Deploy

  3. Release

    Requires a user to start manually

Logs

The following logs have been generated by the jobs in this plan.
  • Expand all
  • Collapse all
Job Logs
Collapse Integration Test Build and Test Download or View
22-Sep-2019 17:51:04 [INFO] openmrs-tools ...................................... SUCCESS [  0.628 s]
22-Sep-2019 17:51:04 [INFO] openmrs-test ....................................... SUCCESS [  0.860 s]
22-Sep-2019 17:51:04 [INFO] openmrs-api ........................................ FAILURE [01:39 min]
22-Sep-2019 17:51:04 [INFO] openmrs-web ........................................ SKIPPED
22-Sep-2019 17:51:04 [INFO] openmrs-webapp ..................................... SKIPPED
22-Sep-2019 17:51:04 [INFO] ------------------------------------------------------------------------
22-Sep-2019 17:51:04 [INFO] BUILD FAILURE
22-Sep-2019 17:51:04 [INFO] ------------------------------------------------------------------------
22-Sep-2019 17:51:04 [INFO] Total time: 01:42 min
22-Sep-2019 17:51:04 [INFO] Finished at: 2019-09-22T17:51:04+00:00
22-Sep-2019 17:51:05 [INFO] Final Memory: 54M/435M
22-Sep-2019 17:51:05 [INFO] ------------------------------------------------------------------------
22-Sep-2019 17:51:05 [ERROR] Failed to execute goal org.apache.maven.plugins:maven-surefire-plugin:2.18.1:test (integration-test) on project openmrs-api: There are test failures.
22-Sep-2019 17:51:05 [ERROR]
22-Sep-2019 17:51:05 [ERROR] Please refer to /home/bamboo-agent/bamboo-agent/xml-data/build-dir/TRUNK-OC2-IT/api/target/surefire-reports for the individual test results.
22-Sep-2019 17:51:05 [ERROR] -> [Help 1]
22-Sep-2019 17:51:05 [ERROR]
22-Sep-2019 17:51:05 [ERROR] To see the full stack trace of the errors, re-run Maven with the -e switch.
22-Sep-2019 17:51:05 [ERROR] Re-run Maven using the -X switch to enable full debug logging.
22-Sep-2019 17:51:05 [ERROR]
22-Sep-2019 17:51:05 [ERROR] For more information about the errors and possible solutions, please read the following articles:
22-Sep-2019 17:51:05 [ERROR] [Help 1] http://cwiki.apache.org/confluence/display/MAVEN/MojoFailureException
22-Sep-2019 17:51:05 [ERROR]
22-Sep-2019 17:51:05 [ERROR] After correcting the problems, you can resume the build with the command
22-Sep-2019 17:51:05 [ERROR]   mvn <goals> -rf :openmrs-api