Plan for OpenMRS Core 2.0.x

Build: #240 failed Changes by dkayiwa <kayiwadaniel@gmail.com>

Stages & jobs

  1. Build and Test

  2. Deploy

  3. Release

    Requires a user to start manually

Logs

The following logs have been generated by the jobs in this plan.
  • Expand all
  • Collapse all
Job Logs
Collapse Build and Test Build and Test Download or View
29-Oct-2020 14:34:54 [INFO] openmrs-api ........................................ FAILURE [ 16.133 s]
29-Oct-2020 14:34:54 [INFO] openmrs-web ........................................ SKIPPED
29-Oct-2020 14:34:54 [INFO] openmrs-webapp ..................................... SKIPPED
29-Oct-2020 14:34:54 [INFO] ------------------------------------------------------------------------
29-Oct-2020 14:34:54 [INFO] BUILD FAILURE
29-Oct-2020 14:34:54 [INFO] ------------------------------------------------------------------------
29-Oct-2020 14:34:54 [INFO] Total time: 18.490 s
29-Oct-2020 14:34:54 [INFO] Finished at: 2020-10-29T14:34:54+00:00
29-Oct-2020 14:34:55 [INFO] Final Memory: 58M/547M
29-Oct-2020 14:34:55 [INFO] ------------------------------------------------------------------------
29-Oct-2020 14:34:55 [ERROR] Failed to execute goal org.apache.maven.plugins:maven-compiler-plugin:2.1:testCompile (default-testCompile) on project openmrs-api: Compilation failure
29-Oct-2020 14:34:55 [ERROR] /home/bamboo-agent/bamboo-agent/xml-data/build-dir/TRUNK-OC2-JOB1/api/src/test/java/org/openmrs/api/db/hibernate/DropMillisecondsHibernateInterceptorTest.java:[80,2] error: cannot find symbol
29-Oct-2020 14:34:55 [ERROR] -> [Help 1]
29-Oct-2020 14:34:55 [ERROR]
29-Oct-2020 14:34:55 [ERROR] To see the full stack trace of the errors, re-run Maven with the -e switch.
29-Oct-2020 14:34:55 [ERROR] Re-run Maven using the -X switch to enable full debug logging.
29-Oct-2020 14:34:55 [ERROR]
29-Oct-2020 14:34:55 [ERROR] For more information about the errors and possible solutions, please read the following articles:
29-Oct-2020 14:34:55 [ERROR] [Help 1] http://cwiki.apache.org/confluence/display/MAVEN/MojoFailureException
29-Oct-2020 14:34:55 [ERROR]
29-Oct-2020 14:34:55 [ERROR] After correcting the problems, you can resume the build with the command
29-Oct-2020 14:34:55 [ERROR]   mvn <goals> -rf :openmrs-api
29-Oct-2020 14:34:55 Unable to publish artifact [openmrs-war]: the source directory /home/bamboo-agent/bamboo-agent/xml-data/build-dir/TRUNK-OC2-JOB1/webapp/target does not exist.
29-Oct-2020 14:34:55 Unable to publish artifact [openmrs-api]: the source directory /home/bamboo-agent/bamboo-agent/xml-data/build-dir/TRUNK-OC2-JOB1/webapp/target/openmrs/WEB-INF/lib does not exist.
29-Oct-2020 14:34:55 Unable to publish artifact [sonar-issues]: the source directory /home/bamboo-agent/bamboo-agent/xml-data/build-dir/TRUNK-OC2-JOB1/target/sonar/issues-report does not exist.
Collapse Integration Test Build and Test Download or View
29-Oct-2020 14:34:20 [INFO] OpenMRS ............................................ SUCCESS [  1.196 s]
29-Oct-2020 14:34:20 [INFO] openmrs-tools ...................................... SUCCESS [  0.636 s]
29-Oct-2020 14:34:20 [INFO] openmrs-test ....................................... SUCCESS [  0.653 s]
29-Oct-2020 14:34:20 [INFO] openmrs-api ........................................ FAILURE [ 16.651 s]
29-Oct-2020 14:34:20 [INFO] openmrs-web ........................................ SKIPPED
29-Oct-2020 14:34:20 [INFO] openmrs-webapp ..................................... SKIPPED
29-Oct-2020 14:34:20 [INFO] ------------------------------------------------------------------------
29-Oct-2020 14:34:20 [INFO] BUILD FAILURE
29-Oct-2020 14:34:20 [INFO] ------------------------------------------------------------------------
29-Oct-2020 14:34:20 [INFO] Total time: 19.489 s
29-Oct-2020 14:34:20 [INFO] Finished at: 2020-10-29T14:34:20+00:00
29-Oct-2020 14:34:20 [INFO] Final Memory: 54M/451M
29-Oct-2020 14:34:20 [INFO] ------------------------------------------------------------------------
29-Oct-2020 14:34:20 [ERROR] Failed to execute goal org.apache.maven.plugins:maven-compiler-plugin:2.1:testCompile (default-testCompile) on project openmrs-api: Compilation failure
29-Oct-2020 14:34:20 [ERROR] /home/bamboo-agent/bamboo-agent/xml-data/build-dir/TRUNK-OC2-IT/api/src/test/java/org/openmrs/api/db/hibernate/DropMillisecondsHibernateInterceptorTest.java:[80,2] error: cannot find symbol
29-Oct-2020 14:34:20 [ERROR] -> [Help 1]
29-Oct-2020 14:34:20 [ERROR]
29-Oct-2020 14:34:20 [ERROR] To see the full stack trace of the errors, re-run Maven with the -e switch.
29-Oct-2020 14:34:20 [ERROR] Re-run Maven using the -X switch to enable full debug logging.
29-Oct-2020 14:34:20 [ERROR]
29-Oct-2020 14:34:20 [ERROR] For more information about the errors and possible solutions, please read the following articles:
29-Oct-2020 14:34:20 [ERROR] [Help 1] http://cwiki.apache.org/confluence/display/MAVEN/MojoFailureException
29-Oct-2020 14:34:20 [ERROR]
29-Oct-2020 14:34:20 [ERROR] After correcting the problems, you can resume the build with the command
29-Oct-2020 14:34:20 [ERROR]   mvn <goals> -rf :openmrs-api