Plan for OpenMRS Core 2.0.x

Build: #49 failed Changes by Wyclif Luyima

Stages & jobs

  1. Build and Test

  2. Deploy

  3. Release

    Requires a user to start manually

Test results

  • 3,242 tests in total
  • 5 tests failed
  • 5 failures are new
  • 34 tests were quarantined / skipped
  • 7 minutes taken in total.
New test failures 5
Status Test View job Duration
Collapse Failed ObsTest setFormField_shouldMarkTheObsAsDirtyWhenTheValueHasBeenChanged History
Build and Test < 1 sec
java.lang.InstantiationException: [Z
	at java.lang.Class.getConstructor0(Class.java:3082)
	at java.lang.Class.newInstance(Class.java:412)
	at org.openmrs.ObsTest.generateValue(ObsTest.java:127)
	at org.openmrs.ObsTest.setFieldValue(ObsTest.java:90)
	at org.openmrs.ObsTest.createObs(ObsTest.java:77)
	at org.openmrs.ObsTest.setFormField_shouldMarkTheObsAsDirtyWhenTheValueHasBeenChanged(ObsTest.java:761)
Collapse Failed ObsTest setFormField_shouldNotMarkTheObsAsDirtyWhenTheValueHasNotBeenChanged History
Build and Test < 1 sec
java.lang.InstantiationException: [Z
	at java.lang.Class.getConstructor0(Class.java:3082)
	at java.lang.Class.newInstance(Class.java:412)
	at org.openmrs.ObsTest.generateValue(ObsTest.java:127)
	at org.openmrs.ObsTest.setFieldValue(ObsTest.java:90)
	at org.openmrs.ObsTest.createObs(ObsTest.java:77)
	at org.openmrs.ObsTest.setFormField_shouldNotMarkTheObsAsDirtyWhenTheValueHasNotBeenChanged(ObsTest.java:750)
Collapse Failed ObsTest isDirty_shouldReturnTrueWhenAnImmutableFieldIsChangedFromANonNullToANullValue History
Build and Test < 1 sec
java.lang.InstantiationException: [Z
	at java.lang.Class.getConstructor0(Class.java:3082)
	at java.lang.Class.newInstance(Class.java:412)
	at org.openmrs.ObsTest.generateValue(ObsTest.java:127)
	at org.openmrs.ObsTest.setFieldValue(ObsTest.java:90)
	at org.openmrs.ObsTest.createObs(ObsTest.java:77)
	at org.openmrs.ObsTest.isDirty_shouldReturnTrueWhenAnImmutableFieldIsChangedFromANonNullToANullValue(ObsTest.java:726)
Collapse Failed ObsTest isDirty_shouldReturnTrueWhenAnyImmutableFieldHasBeenChanged History
Build and Test < 1 sec
java.lang.InstantiationException: [Z
	at java.lang.Class.getConstructor0(Class.java:3082)
	at java.lang.Class.newInstance(Class.java:412)
	at org.openmrs.ObsTest.generateValue(ObsTest.java:127)
	at org.openmrs.ObsTest.setFieldValue(ObsTest.java:90)
	at org.openmrs.ObsTest.createObs(ObsTest.java:77)
	at org.openmrs.ObsTest.isDirty_shouldReturnTrueWhenAnyImmutableFieldHasBeenChanged(ObsTest.java:675)
Collapse Failed ObsTest isDirty_shouldReturnFalseWhenNoChangeHasBeenMade History
Build and Test < 1 sec
java.lang.InstantiationException: [Z
	at java.lang.Class.getConstructor0(Class.java:3082)
	at java.lang.Class.newInstance(Class.java:412)
	at org.openmrs.ObsTest.generateValue(ObsTest.java:127)
	at org.openmrs.ObsTest.setFieldValue(ObsTest.java:90)
	at org.openmrs.ObsTest.createObs(ObsTest.java:77)
	at org.openmrs.ObsTest.isDirty_shouldReturnFalseWhenNoChangeHasBeenMade(ObsTest.java:659)
Skipped tests 34
Status Test Failing since View job
Skipped ObsBehaviorTest shouldVoidAndReplaceOnlyEditedUnvoidedObsWhenTheyAreFlushedToTheDatabase History
Build and Test
Skipped OpenmrsProfileExcludeFilterTest shouldBeIgnoredIfOpenmrsVersionDoesNotMatch History
Build and Test
Skipped OpenmrsProfileExcludeFilterTest shouldBeIgnoredIfModuleDoesNotMatch History
Build and Test
Skipped AdministrationServiceTest setImplementationId_shouldOverwriteImplementationIdInDatabaseIfExists History
Build and Test
Skipped AdministrationServiceTest setImplementationId_shouldSetUuidOnImplementationIdGlobalProperty History
Build and Test
Skipped AdministrationServiceTest getPresentationLocales_shouldReturnAtLeastOneLocaleIfNoLocalesDefinedInDatabaseYet History
Build and Test
Skipped AdministrationServiceTest setImplementationId_shouldCreateImplementationIdInDatabase History
Build and Test
Skipped ConceptServiceTest saveConcept_shouldNotSetAuditInfoIfTheConceptIsNotEdited History
Build and Test
Skipped EncounterServiceTest getEncounters_shouldGetAllTheUniqueEncountersThatMatchTheSpecifiedParameterValues History
Build and Test
Skipped EncounterServiceTest getEncounters_shouldNotReturnVoidedEncountersIfIncludeVoidedIsSetToTrue History
Build and Test
Skipped NoteServiceTest org.openmrs.api.NoteServiceTest History
Build and Test
Skipped OpenmrsServiceTest shouldCheckThatAMethodIsNotRolledBackInCaseOfAnErrorInAnotherInvokedInsideIt History
Build and Test
Skipped OrderServiceTest saveOrder_shouldFailForRevisionOrderIfAnActiveDrugOrderForTheSameConceptAndCareSettingsExists History
Build and Test
Skipped OrderServiceTest saveOrder_shouldSaveRevisionOrderScheduledOnDateNotOverlappingWithAnActiveOrderForTheSameConceptAndCareSetting History
Build and Test
Skipped OrderServiceTest saveOrder_shouldPassForRevisionOrderIfAnActiveTestOrderForTheSameConceptAndCareSettingsExists History
Build and Test
Skipped PatientServiceTest voidPatient_shouldReturnNullWhenPatientIsNull History
Build and Test
Skipped PatientServiceTest checkPatientIdentifiers_shouldThrowErrorWhenPatientHasIdenticalIdentifiers History
Build and Test
Skipped ProviderServiceTest getCountOfProviders_shouldExcludeRetiredProviders History
Build and Test
Skipped ProviderServiceTest getCountOfProviders_shouldIncludeRetiredProvidersIfIncludeRetiredIsSetToTrue History
Build and Test
Skipped UserServiceTest changeQuestionAnswer_shouldChangeTheSecretQuestionAndAnswerForGivenUser History
Build and Test
Skipped ConceptDAOTest getConcepts_shouldReturnCorrectResultsIfAConceptNameContainsSameWordMoreThanOnce History
Build and Test
Skipped ConceptDAOTest getConcepts_shouldReturnCorrectResultsForConceptWithNamesThatContainsWordsWithMoreWeight History
Build and Test
Skipped SerializedObjectDAOTest org.openmrs.api.db.SerializedObjectDAOTest History
Build and Test
Skipped HL7ServiceTest processHL7InQueue_shouldParseOruR01MessageUsingOverriddenParserProvidedByAModule History
Build and Test
Skipped HL7ServiceTest processHL7Message_shouldParseMessageTypeSuppliedByModule History
Build and Test
Skipped ModuleActivatorTest org.openmrs.module.ModuleActivatorTest History
Build and Test
Skipped ModuleUtilIT getURL_shouldReturnAnUpdateRdfPageForModuleUrls History
Integration Test
Skipped ModuleUtilIT getURL_shouldReturnAnUpdateRdfPageForOldHttpsModuleUrls History
Integration Test
Skipped ModuleUtilIT getURL_shouldReturnAnUpdateRdfPageForOldHttpsDevUrls History
Integration Test
Skipped SchedulerServiceTest org.openmrs.scheduler.SchedulerServiceTest History
Build and Test
Skipped ConceptReferenceTermValidatorTest validate_shouldFailIfTheNameIsAnEmptyString History
Build and Test
Skipped ConceptReferenceTermValidatorTest validate_shouldFailIfTheNameIsNull History
Build and Test
Skipped ConceptReferenceTermValidatorTest validate_shouldFailIfTheNameIsAWhiteSpaceCharacter History
Build and Test
Skipped VisitValidatorTest validate_shouldFailIfAnAttributeIsBad History
Build and Test