Plan for OpenMRS Core 2.0.x

Build: #49 failed Changes by Wyclif Luyima

Stages & jobs

  1. Build and Test

  2. Deploy

  3. Release

    Requires a user to start manually

Build result summary

Details

Completed
Duration
8 minutes
Labels
None
Revisions
openmrs-core
2520c8dc1277c14df56dde00493e050b4ece1607 2520c8dc1277c14df56dde00493e050b4ece1607
openmrs-standalone
777fbe8dcab15eccf4785771e54ddff965027fbc 777fbe8dcab15eccf4785771e54ddff965027fbc
Release scripts
a9c6b4741f415820e397e9b150cf80baca7f9368 a9c6b4741f415820e397e9b150cf80baca7f9368
Total tests
3242
Fixed in
#54 (Manual run by Daniel Kayiwa)

Tests

Responsible

Code commits

openmrs-core
Author Commit Message Commit date
Wyclif Luyima Wyclif Luyima 2520c8dc1277c14df56dde00493e050b4ece1607 2520c8dc1277c14df56dde00493e050b4ece1607 Obs not voided when updated via saving an Encounter - TRUNK-50
Implemented Obs.osDirty and added ObsBehaviorTest - TRUNK-50

Fixed failing unit tests - TRUNK-50

Cleaned up code - TRUNK-50

Fixed more tests- TRUNK-50

Cleaned up code - TRUNK-50

# Conflicts:
#        api/src/test/java/org/openmrs/api/EncounterServiceTest.java

(cherry picked from commit e009dff7dbb5d912839c7f8cbec3445600b8de4e)

Tests

New test failures 5
Status Test View job Duration
Collapse Failed ObsTest setFormField_shouldMarkTheObsAsDirtyWhenTheValueHasBeenChanged History
Build and Test < 1 sec
java.lang.InstantiationException: [Z
	at java.lang.Class.getConstructor0(Class.java:3082)
	at java.lang.Class.newInstance(Class.java:412)
	at org.openmrs.ObsTest.generateValue(ObsTest.java:127)
	at org.openmrs.ObsTest.setFieldValue(ObsTest.java:90)
	at org.openmrs.ObsTest.createObs(ObsTest.java:77)
	at org.openmrs.ObsTest.setFormField_shouldMarkTheObsAsDirtyWhenTheValueHasBeenChanged(ObsTest.java:761)
Collapse Failed ObsTest setFormField_shouldNotMarkTheObsAsDirtyWhenTheValueHasNotBeenChanged History
Build and Test < 1 sec
java.lang.InstantiationException: [Z
	at java.lang.Class.getConstructor0(Class.java:3082)
	at java.lang.Class.newInstance(Class.java:412)
	at org.openmrs.ObsTest.generateValue(ObsTest.java:127)
	at org.openmrs.ObsTest.setFieldValue(ObsTest.java:90)
	at org.openmrs.ObsTest.createObs(ObsTest.java:77)
	at org.openmrs.ObsTest.setFormField_shouldNotMarkTheObsAsDirtyWhenTheValueHasNotBeenChanged(ObsTest.java:750)
Collapse Failed ObsTest isDirty_shouldReturnTrueWhenAnImmutableFieldIsChangedFromANonNullToANullValue History
Build and Test < 1 sec
java.lang.InstantiationException: [Z
	at java.lang.Class.getConstructor0(Class.java:3082)
	at java.lang.Class.newInstance(Class.java:412)
	at org.openmrs.ObsTest.generateValue(ObsTest.java:127)
	at org.openmrs.ObsTest.setFieldValue(ObsTest.java:90)
	at org.openmrs.ObsTest.createObs(ObsTest.java:77)
	at org.openmrs.ObsTest.isDirty_shouldReturnTrueWhenAnImmutableFieldIsChangedFromANonNullToANullValue(ObsTest.java:726)
Collapse Failed ObsTest isDirty_shouldReturnTrueWhenAnyImmutableFieldHasBeenChanged History
Build and Test < 1 sec
java.lang.InstantiationException: [Z
	at java.lang.Class.getConstructor0(Class.java:3082)
	at java.lang.Class.newInstance(Class.java:412)
	at org.openmrs.ObsTest.generateValue(ObsTest.java:127)
	at org.openmrs.ObsTest.setFieldValue(ObsTest.java:90)
	at org.openmrs.ObsTest.createObs(ObsTest.java:77)
	at org.openmrs.ObsTest.isDirty_shouldReturnTrueWhenAnyImmutableFieldHasBeenChanged(ObsTest.java:675)
Collapse Failed ObsTest isDirty_shouldReturnFalseWhenNoChangeHasBeenMade History
Build and Test < 1 sec
java.lang.InstantiationException: [Z
	at java.lang.Class.getConstructor0(Class.java:3082)
	at java.lang.Class.newInstance(Class.java:412)
	at org.openmrs.ObsTest.generateValue(ObsTest.java:127)
	at org.openmrs.ObsTest.setFieldValue(ObsTest.java:90)
	at org.openmrs.ObsTest.createObs(ObsTest.java:77)
	at org.openmrs.ObsTest.isDirty_shouldReturnFalseWhenNoChangeHasBeenMade(ObsTest.java:659)

Jira issues

IssueDescriptionStatus
Unknown Issue TypeTRUNK-50Could not obtain issue details from Jira