Plan for OpenMRS Core 2.0.x

Build: #195 failed

Job: Build and Test failed

Stages & jobs

  1. Build and Test

  2. Deploy

  3. Release

    Requires a user to start manually

Build log

The build generated 1,099 lines of output.The output is too long and has been truncated to the last 1,000 lines. Download or view full build log

21-Sep-2017 19:46:04 [INFO] --- maven-resources-plugin:2.4:testResources (default-testResources) @ openmrs-tools ---
21-Sep-2017 19:46:04 [INFO] Using 'UTF-8' encoding to copy filtered resources.
21-Sep-2017 19:46:04 [INFO] skip non existing resourceDirectory /home/bamboo-agent-1/bamboo-agent/xml-data/build-dir/TRUNK-OC2-JOB1/tools/src/test/resources
21-Sep-2017 19:46:04 [INFO]
21-Sep-2017 19:46:04 [INFO] --- maven-compiler-plugin:2.1:testCompile (default-testCompile) @ openmrs-tools ---
21-Sep-2017 19:46:04 [INFO] No sources to compile
21-Sep-2017 19:46:04 [INFO]
21-Sep-2017 19:46:04 [INFO] --- maven-surefire-plugin:2.18.1:test (default-test) @ openmrs-tools ---
21-Sep-2017 19:46:05 [INFO] No tests to run.
21-Sep-2017 19:46:05 [INFO]
21-Sep-2017 19:46:05 [INFO] --- maven-jar-plugin:2.3.2:jar (default-jar) @ openmrs-tools ---
21-Sep-2017 19:46:05 [INFO] Building jar: /home/bamboo-agent-1/bamboo-agent/xml-data/build-dir/TRUNK-OC2-JOB1/tools/target/openmrs-tools-2.0.6-SNAPSHOT.jar
21-Sep-2017 19:46:05 [INFO]
21-Sep-2017 19:46:05 [INFO] --- maven-jar-plugin:2.3.2:test-jar (default) @ openmrs-tools ---
21-Sep-2017 19:46:05 [WARNING] JAR will be empty - no content was marked for inclusion!
21-Sep-2017 19:46:05 [INFO] Building jar: /home/bamboo-agent-1/bamboo-agent/xml-data/build-dir/TRUNK-OC2-JOB1/tools/target/openmrs-tools-2.0.6-SNAPSHOT-tests.jar
21-Sep-2017 19:46:05 [INFO]                                                                         
21-Sep-2017 19:46:05 [INFO] ------------------------------------------------------------------------
21-Sep-2017 19:46:05 [INFO] Building openmrs-test 2.0.6-SNAPSHOT
21-Sep-2017 19:46:05 [INFO] ------------------------------------------------------------------------
21-Sep-2017 19:46:06 [INFO]
21-Sep-2017 19:46:06 [INFO] --- maven-clean-plugin:2.5:clean (default-clean) @ openmrs-test ---
21-Sep-2017 19:46:06 [INFO]
21-Sep-2017 19:46:06 [INFO] --- buildnumber-maven-plugin:1.1:create (default) @ openmrs-test ---
21-Sep-2017 19:46:06 [INFO]
21-Sep-2017 19:46:06 [INFO] --- jacoco-maven-plugin:0.7.4.201502262128:prepare-agent (prepare-agent) @ openmrs-test ---
21-Sep-2017 19:46:06 [INFO] argLine set to -javaagent:/home/bamboo-agent-1/.m2/repository/org/jacoco/org.jacoco.agent/0.7.4.201502262128/org.jacoco.agent-0.7.4.201502262128-runtime.jar=destfile=/home/bamboo-agent-1/bamboo-agent/xml-data/build-dir/TRUNK-OC2-JOB1/test/target/jacoco.exec,includes=org.openmrs.* -Duser.language=en -Duser.region=US -Xmx2g
21-Sep-2017 19:46:06 [INFO]
21-Sep-2017 19:46:06 [INFO] --- build-helper-maven-plugin:1.5:parse-version (parse-version) @ openmrs-test ---
21-Sep-2017 19:46:06 [INFO]
21-Sep-2017 19:46:06 [INFO] --- maven-jar-plugin:2.3.2:test-jar (default) @ openmrs-test ---
21-Sep-2017 19:46:06 [WARNING] JAR will be empty - no content was marked for inclusion!
21-Sep-2017 19:46:06 [INFO] Building jar: /home/bamboo-agent-1/bamboo-agent/xml-data/build-dir/TRUNK-OC2-JOB1/test/target/openmrs-test-2.0.6-SNAPSHOT-tests.jar
21-Sep-2017 19:46:06 [INFO]                                                                         
21-Sep-2017 19:46:06 [INFO] ------------------------------------------------------------------------
21-Sep-2017 19:46:06 [INFO] Building openmrs-api 2.0.6-SNAPSHOT
21-Sep-2017 19:46:06 [INFO] ------------------------------------------------------------------------
21-Sep-2017 19:46:07 [INFO]
21-Sep-2017 19:46:07 [INFO] --- maven-clean-plugin:2.5:clean (default-clean) @ openmrs-api ---
21-Sep-2017 19:46:07 [INFO]
21-Sep-2017 19:46:07 [INFO] --- buildnumber-maven-plugin:1.1:create (default) @ openmrs-api ---
21-Sep-2017 19:46:07 [INFO]
21-Sep-2017 19:46:07 [INFO] --- jacoco-maven-plugin:0.7.4.201502262128:prepare-agent (prepare-agent) @ openmrs-api ---
21-Sep-2017 19:46:07 [INFO] argLine set to -javaagent:/home/bamboo-agent-1/.m2/repository/org/jacoco/org.jacoco.agent/0.7.4.201502262128/org.jacoco.agent-0.7.4.201502262128-runtime.jar=destfile=/home/bamboo-agent-1/bamboo-agent/xml-data/build-dir/TRUNK-OC2-JOB1/api/target/jacoco.exec,includes=org.openmrs.* -Duser.language=en -Duser.region=US -Xmx2g
21-Sep-2017 19:46:07 [INFO]
21-Sep-2017 19:46:07 [INFO] --- build-helper-maven-plugin:1.5:parse-version (parse-version) @ openmrs-api ---
21-Sep-2017 19:46:07 [INFO]
21-Sep-2017 19:46:07 [INFO] --- maven-java-formatter-plugin:0.3:format (default) @ openmrs-api ---
21-Sep-2017 19:46:08 [INFO] Using 'UTF-8' encoding to format source files.
21-Sep-2017 19:46:09 [INFO] Number of files to be formatted: 941
21-Sep-2017 19:46:12 [INFO] Successfully formatted: 0 file(s)
21-Sep-2017 19:46:12 [INFO] Fail to format        : 0 file(s)
21-Sep-2017 19:46:12 [INFO] Skipped               : 941 file(s)
21-Sep-2017 19:46:12 [INFO] Approximate time taken: 4s
21-Sep-2017 19:46:12 [INFO]
21-Sep-2017 19:46:12 [INFO] --- maven-resources-plugin:2.4:resources (default-resources) @ openmrs-api ---
21-Sep-2017 19:46:12 [INFO] Using 'UTF-8' encoding to copy filtered resources.
21-Sep-2017 19:46:12 [INFO] Copying 1 resource
21-Sep-2017 19:46:12 [INFO] Copying 122 resources
21-Sep-2017 19:46:13 [INFO]
21-Sep-2017 19:46:13 [INFO] --- maven-compiler-plugin:2.1:compile (default-compile) @ openmrs-api ---
21-Sep-2017 19:46:13 [INFO] Compiling 649 source files to /home/bamboo-agent-1/bamboo-agent/xml-data/build-dir/TRUNK-OC2-JOB1/api/target/classes
21-Sep-2017 19:46:28 [WARNING] /home/bamboo-agent-1/bamboo-agent/xml-data/build-dir/TRUNK-OC2-JOB1/api/src/main/java/org/openmrs/util/MemoryLeakUtil.java:[18,23] KeepAliveCache is internal proprietary API and may be removed in a future release
21-Sep-2017 19:46:28
21-Sep-2017 19:46:28 [WARNING] /home/bamboo-agent-1/bamboo-agent/xml-data/build-dir/TRUNK-OC2-JOB1/api/src/main/java/org/openmrs/util/MemoryLeakUtil.java:[67,32] KeepAliveCache is internal proprietary API and may be removed in a future release
21-Sep-2017 19:46:28
21-Sep-2017 19:46:28 [INFO]
21-Sep-2017 19:46:28 [INFO] --- maven-resources-plugin:2.4:testResources (default-testResources) @ openmrs-api ---
21-Sep-2017 19:46:28 [INFO] Using 'UTF-8' encoding to copy filtered resources.
21-Sep-2017 19:46:28 [INFO] Copying 127 resources
21-Sep-2017 19:46:28 [INFO]
21-Sep-2017 19:46:28 [INFO] --- maven-compiler-plugin:2.1:testCompile (default-testCompile) @ openmrs-api ---
21-Sep-2017 19:46:28 [INFO] Compiling 292 source files to /home/bamboo-agent-1/bamboo-agent/xml-data/build-dir/TRUNK-OC2-JOB1/api/target/test-classes
21-Sep-2017 19:46:39 [INFO]
21-Sep-2017 19:46:39 [INFO] --- maven-surefire-plugin:2.18.1:test (default-test) @ openmrs-api ---
21-Sep-2017 19:46:39 [INFO] Surefire report directory: /home/bamboo-agent-1/bamboo-agent/xml-data/build-dir/TRUNK-OC2-JOB1/api/target/surefire-reports
21-Sep-2017 19:46:40
21-Sep-2017 19:46:40 -------------------------------------------------------
21-Sep-2017 19:46:40 T E S T S
21-Sep-2017 19:46:40 -------------------------------------------------------
21-Sep-2017 19:46:45 Running org.openmrs.SimpleDosingInstructionsTest
21-Sep-2017 19:47:07 Tests run: 10, Failures: 0, Errors: 0, Skipped: 0, Time elapsed: 21.973 sec - in org.openmrs.SimpleDosingInstructionsTest
21-Sep-2017 19:47:07 Running org.openmrs.RoleTest
21-Sep-2017 19:47:08 Tests run: 7, Failures: 0, Errors: 0, Skipped: 0, Time elapsed: 0.125 sec - in org.openmrs.RoleTest
21-Sep-2017 19:47:08 Running org.openmrs.DrugOrderTest
21-Sep-2017 19:47:09 Tests run: 22, Failures: 0, Errors: 0, Skipped: 0, Time elapsed: 0.934 sec - in org.openmrs.DrugOrderTest
21-Sep-2017 19:47:09 Running org.openmrs.PersonAddressTest
21-Sep-2017 19:47:09 Tests run: 15, Failures: 0, Errors: 0, Skipped: 0, Time elapsed: 0.386 sec - in org.openmrs.PersonAddressTest
21-Sep-2017 19:47:09 Running org.openmrs.TestOrderTest
21-Sep-2017 19:47:09 Tests run: 4, Failures: 0, Errors: 0, Skipped: 0, Time elapsed: 0.105 sec - in org.openmrs.TestOrderTest
21-Sep-2017 19:47:09 Running org.openmrs.BaseOpenmrsObjectTest
21-Sep-2017 19:47:10 Tests run: 20, Failures: 0, Errors: 0, Skipped: 0, Time elapsed: 1.24 sec - in org.openmrs.BaseOpenmrsObjectTest
21-Sep-2017 19:47:10 Running org.openmrs.module.ModuleInteroperabilityTest
21-Sep-2017 19:47:12 Tests run: 1, Failures: 0, Errors: 0, Skipped: 0, Time elapsed: 1.961 sec - in org.openmrs.module.ModuleInteroperabilityTest
21-Sep-2017 19:47:12 Running org.openmrs.module.ModuleFileParserTest
21-Sep-2017 19:47:12 Tests run: 5, Failures: 0, Errors: 0, Skipped: 0, Time elapsed: 0.16 sec - in org.openmrs.module.ModuleFileParserTest
21-Sep-2017 19:47:12 Running org.openmrs.module.ModuleUtilTest
21-Sep-2017 19:47:16 Tests run: 43, Failures: 0, Errors: 0, Skipped: 0, Time elapsed: 3.807 sec - in org.openmrs.module.ModuleUtilTest
21-Sep-2017 19:47:16 Running org.openmrs.module.ModuleActivatorTest
21-Sep-2017 19:47:16 Tests run: 1, Failures: 0, Errors: 0, Skipped: 1, Time elapsed: 0 sec - in org.openmrs.module.ModuleActivatorTest
21-Sep-2017 19:47:16 Running org.openmrs.module.VersionComparatorTest
21-Sep-2017 19:47:16 Tests run: 1, Failures: 0, Errors: 0, Skipped: 0, Time elapsed: 0.002 sec - in org.openmrs.module.VersionComparatorTest
21-Sep-2017 19:47:16 Running org.openmrs.module.ModuleClassLoaderTest
21-Sep-2017 19:47:18 Tests run: 10, Failures: 0, Errors: 0, Skipped: 0, Time elapsed: 1.86 sec - in org.openmrs.module.ModuleClassLoaderTest
21-Sep-2017 19:47:18 Running org.openmrs.serialization.SimpleXStreamSerializerTest
21-Sep-2017 19:47:18 Tests run: 5, Failures: 0, Errors: 0, Skipped: 0, Time elapsed: 0.28 sec - in org.openmrs.serialization.SimpleXStreamSerializerTest
21-Sep-2017 19:47:18 Running org.openmrs.serialization.JavaSerializationTest
21-Sep-2017 19:47:19 Tests run: 2, Failures: 0, Errors: 0, Skipped: 0, Time elapsed: 0.129 sec - in org.openmrs.serialization.JavaSerializationTest
21-Sep-2017 19:47:19 Running org.openmrs.ConceptNumericTest
21-Sep-2017 19:47:20 Tests run: 8, Failures: 0, Errors: 0, Skipped: 0, Time elapsed: 1.814 sec - in org.openmrs.ConceptNumericTest
21-Sep-2017 19:47:20 Running org.openmrs.ProviderTest
21-Sep-2017 19:47:20 Tests run: 2, Failures: 0, Errors: 0, Skipped: 0, Time elapsed: 0.064 sec - in org.openmrs.ProviderTest
21-Sep-2017 19:47:20 Running org.openmrs.OpenmrsTestsTest
21-Sep-2017 19:47:21 Tests run: 4, Failures: 0, Errors: 0, Skipped: 0, Time elapsed: 0.595 sec - in org.openmrs.OpenmrsTestsTest
21-Sep-2017 19:47:21 Running org.openmrs.PatientTest
21-Sep-2017 19:47:21 Tests run: 8, Failures: 0, Errors: 0, Skipped: 0, Time elapsed: 0.217 sec - in org.openmrs.PatientTest
21-Sep-2017 19:47:21 Running org.openmrs.DurationTest
21-Sep-2017 19:47:23 Tests run: 11, Failures: 0, Errors: 0, Skipped: 0, Time elapsed: 1.546 sec - in org.openmrs.DurationTest
21-Sep-2017 19:47:23 Running org.openmrs.ObsTest
21-Sep-2017 19:47:24 Tests run: 55, Failures: 0, Errors: 0, Skipped: 0, Time elapsed: 1.401 sec - in org.openmrs.ObsTest
21-Sep-2017 19:47:24 Running org.openmrs.EncounterTest
21-Sep-2017 19:47:30 Tests run: 56, Failures: 0, Errors: 0, Skipped: 0, Time elapsed: 5.682 sec - in org.openmrs.EncounterTest
21-Sep-2017 19:47:30 Running org.openmrs.patient.impl.VerhoeffIdentifierValidatorTest
21-Sep-2017 19:47:30 Tests run: 2, Failures: 0, Errors: 0, Skipped: 0, Time elapsed: 0.089 sec - in org.openmrs.patient.impl.VerhoeffIdentifierValidatorTest
21-Sep-2017 19:47:30 Running org.openmrs.patient.impl.LuhnIdentifierValidatorTest
21-Sep-2017 19:47:30 Tests run: 3, Failures: 0, Errors: 0, Skipped: 0, Time elapsed: 0.107 sec - in org.openmrs.patient.impl.LuhnIdentifierValidatorTest
21-Sep-2017 19:47:30 Running org.openmrs.PatientProgramTest
21-Sep-2017 19:47:30 Tests run: 2, Failures: 0, Errors: 0, Skipped: 0, Time elapsed: 0.047 sec - in org.openmrs.PatientProgramTest
21-Sep-2017 19:47:30 Running org.openmrs.logic.result.ResultTest
21-Sep-2017 19:47:31 Tests run: 17, Failures: 0, Errors: 0, Skipped: 0, Time elapsed: 0.413 sec - in org.openmrs.logic.result.ResultTest
21-Sep-2017 19:47:31 Running org.openmrs.logic.result.EmptyResultTest
21-Sep-2017 19:47:31 Tests run: 2, Failures: 0, Errors: 0, Skipped: 0, Time elapsed: 0.084 sec - in org.openmrs.logic.result.EmptyResultTest
21-Sep-2017 19:47:31 Running org.openmrs.DrugTest
21-Sep-2017 19:47:32 Tests run: 2, Failures: 0, Errors: 0, Skipped: 0, Time elapsed: 1.087 sec - in org.openmrs.DrugTest
21-Sep-2017 19:47:32 Running org.openmrs.attribute.AttributeIntegrationTest
21-Sep-2017 19:47:33 Tests run: 1, Failures: 0, Errors: 0, Skipped: 0, Time elapsed: 1.11 sec - in org.openmrs.attribute.AttributeIntegrationTest
21-Sep-2017 19:47:33 Running org.openmrs.EncounterRoleTest
21-Sep-2017 19:47:33 Tests run: 1, Failures: 0, Errors: 0, Skipped: 0, Time elapsed: 0.019 sec - in org.openmrs.EncounterRoleTest
21-Sep-2017 19:47:33 Running org.openmrs.util.HttpClientTest
21-Sep-2017 19:47:33 Tests run: 1, Failures: 0, Errors: 0, Skipped: 0, Time elapsed: 0.084 sec - in org.openmrs.util.HttpClientTest
21-Sep-2017 19:47:33 Running org.openmrs.util.LocationUtilityTest
21-Sep-2017 19:47:34 Tests run: 2, Failures: 0, Errors: 0, Skipped: 0, Time elapsed: 1.279 sec - in org.openmrs.util.LocationUtilityTest
21-Sep-2017 19:47:34 Running org.openmrs.util.DateUtilTest
21-Sep-2017 19:47:34 Tests run: 1, Failures: 0, Errors: 0, Skipped: 0, Time elapsed: 0.041 sec - in org.openmrs.util.DateUtilTest
21-Sep-2017 19:47:34 Running org.openmrs.util.ReflectTest
21-Sep-2017 19:47:35 Tests run: 18, Failures: 0, Errors: 0, Skipped: 0, Time elapsed: 0.499 sec - in org.openmrs.util.ReflectTest
21-Sep-2017 19:47:35 Running org.openmrs.util.GraphTest
21-Sep-2017 19:47:35 Tests run: 2, Failures: 0, Errors: 0, Skipped: 0, Time elapsed: 0.052 sec - in org.openmrs.util.GraphTest
21-Sep-2017 19:47:35 Running org.openmrs.util.ProviderByPersonNameComparatorTest
21-Sep-2017 19:47:35 Tests run: 6, Failures: 0, Errors: 0, Skipped: 0, Time elapsed: 0.155 sec - in org.openmrs.util.ProviderByPersonNameComparatorTest
21-Sep-2017 19:47:35 Running org.openmrs.util.JavaVersionTest
21-Sep-2017 19:47:35 SLF4J: Class path contains multiple SLF4J bindings.
21-Sep-2017 19:47:35 SLF4J: Found binding in [jar:file:/home/bamboo-agent-1/.m2/repository/org/slf4j/slf4j-log4j12/1.6.0/slf4j-log4j12-1.6.0.jar!/org/slf4j/impl/StaticLoggerBinder.class]
21-Sep-2017 19:47:35 SLF4J: Found binding in [jar:file:/home/bamboo-agent-1/.m2/repository/org/slf4j/slf4j-log4j12/1.6.0/slf4j-log4j12-1.6.0.jar!/org/slf4j/impl/StaticLoggerBinder.class]
21-Sep-2017 19:47:35 SLF4J: See http://www.slf4j.org/codes.html#multiple_bindings for an explanation.
21-Sep-2017 19:47:36 Tests run: 2, Failures: 0, Errors: 0, Skipped: 0, Time elapsed: 0.864 sec - in org.openmrs.util.JavaVersionTest
21-Sep-2017 19:47:36 Running org.openmrs.util.DatabaseUpdaterTest
21-Sep-2017 19:47:37 INFO 9/21/17 7:47 PM:liquibase: Creating database history table with name: LIQUIBASECHANGELOG
21-Sep-2017 19:47:38 INFO 9/21/17 7:47 PM:liquibase: Reading from LIQUIBASECHANGELOG
21-Sep-2017 19:47:39 Tests run: 1, Failures: 0, Errors: 0, Skipped: 0, Time elapsed: 2.73 sec - in org.openmrs.util.DatabaseUpdaterTest
21-Sep-2017 19:47:39 Running org.openmrs.util.OpenmrsUtilTest
21-Sep-2017 19:47:45 Tests run: 44, Failures: 0, Errors: 0, Skipped: 0, Time elapsed: 5.995 sec - in org.openmrs.util.OpenmrsUtilTest
21-Sep-2017 19:47:45 Running org.openmrs.util.DoubleRangeTest
21-Sep-2017 19:47:45 Tests run: 28, Failures: 0, Errors: 0, Skipped: 0, Time elapsed: 0.8 sec - in org.openmrs.util.DoubleRangeTest
21-Sep-2017 19:47:45 Running org.openmrs.util.UpgradeUtilTest
21-Sep-2017 19:47:46 Tests run: 2, Failures: 0, Errors: 0, Skipped: 0, Time elapsed: 0.807 sec - in org.openmrs.util.UpgradeUtilTest
21-Sep-2017 19:47:46 Running org.openmrs.util.HandlerUtilTest
21-Sep-2017 19:47:47 Tests run: 6, Failures: 0, Errors: 0, Skipped: 0, Time elapsed: 1.003 sec - in org.openmrs.util.HandlerUtilTest
21-Sep-2017 19:47:47 Running org.openmrs.util.OpenmrsSecurityManagerTest
21-Sep-2017 19:47:47 Tests run: 2, Failures: 0, Errors: 0, Skipped: 0, Time elapsed: 0.094 sec - in org.openmrs.util.OpenmrsSecurityManagerTest
21-Sep-2017 19:47:47 Running org.openmrs.util.ExceptionUtilTest
21-Sep-2017 19:47:47 Tests run: 1, Failures: 0, Errors: 0, Skipped: 0, Time elapsed: 0.04 sec - in org.openmrs.util.ExceptionUtilTest
21-Sep-2017 19:47:47 Running org.openmrs.util.SecurityTest
21-Sep-2017 19:47:48 Tests run: 7, Failures: 0, Errors: 0, Skipped: 0, Time elapsed: 0.276 sec - in org.openmrs.util.SecurityTest
21-Sep-2017 19:47:48 Running org.openmrs.util.HttpUrlTest
21-Sep-2017 19:47:48 Tests run: 4, Failures: 0, Errors: 0, Skipped: 0, Time elapsed: 0.11 sec - in org.openmrs.util.HttpUrlTest
21-Sep-2017 19:47:48 Running org.openmrs.util.PersonByNameComparatorTest
21-Sep-2017 19:47:48 Tests run: 4, Failures: 0, Errors: 0, Skipped: 0, Time elapsed: 0.119 sec - in org.openmrs.util.PersonByNameComparatorTest
21-Sep-2017 19:47:48 Running org.openmrs.util.UserByNameComparatorTest
21-Sep-2017 19:47:48 Tests run: 1, Failures: 0, Errors: 0, Skipped: 0, Time elapsed: 0.03 sec - in org.openmrs.util.UserByNameComparatorTest
21-Sep-2017 19:47:48 Running org.openmrs.util.LocaleUtilityTest
21-Sep-2017 19:47:50 Tests run: 21, Failures: 0, Errors: 0, Skipped: 0, Time elapsed: 2.08 sec - in org.openmrs.util.LocaleUtilityTest
21-Sep-2017 19:47:50 Running org.openmrs.util.DrugsByNameComparatorTest
21-Sep-2017 19:47:50 Tests run: 4, Failures: 0, Errors: 0, Skipped: 0, Time elapsed: 0.15 sec - in org.openmrs.util.DrugsByNameComparatorTest
21-Sep-2017 19:47:50 Running org.openmrs.ObsBehaviorTest
21-Sep-2017 19:47:51 Tests run: 3, Failures: 0, Errors: 0, Skipped: 1, Time elapsed: 0.962 sec - in org.openmrs.ObsBehaviorTest
21-Sep-2017 19:47:51 Running org.openmrs.ConceptTest
21-Sep-2017 19:47:54 Tests run: 71, Failures: 0, Errors: 0, Skipped: 0, Time elapsed: 2.45 sec - in org.openmrs.ConceptTest
21-Sep-2017 19:47:54 Running org.openmrs.validator.PatientValidatorTest
21-Sep-2017 19:47:55 Tests run: 12, Failures: 0, Errors: 0, Skipped: 0, Time elapsed: 1.912 sec - in org.openmrs.validator.PatientValidatorTest
21-Sep-2017 19:47:55 Running org.openmrs.validator.ConceptDrugValidatorTest
21-Sep-2017 19:47:56 Tests run: 3, Failures: 0, Errors: 0, Skipped: 0, Time elapsed: 0.178 sec - in org.openmrs.validator.ConceptDrugValidatorTest
21-Sep-2017 19:47:56 Running org.openmrs.validator.ImplementationIdValidatorTest
21-Sep-2017 19:47:57 Tests run: 8, Failures: 0, Errors: 0, Skipped: 0, Time elapsed: 1.462 sec - in org.openmrs.validator.ImplementationIdValidatorTest
21-Sep-2017 19:47:57 Running org.openmrs.validator.FieldTypeValidatorTest
21-Sep-2017 19:47:59 Tests run: 5, Failures: 0, Errors: 0, Skipped: 0, Time elapsed: 2.185 sec - in org.openmrs.validator.FieldTypeValidatorTest
21-Sep-2017 19:47:59 Running org.openmrs.validator.RoleValidatorTest
21-Sep-2017 19:48:01 Tests run: 6, Failures: 0, Errors: 0, Skipped: 0, Time elapsed: 1.781 sec - in org.openmrs.validator.RoleValidatorTest
21-Sep-2017 19:48:01 Running org.openmrs.validator.ConceptReferenceTermValidatorTest
21-Sep-2017 19:48:02 [Field error in object 'term' on field 'conceptReferenceTermMaps[1].termB': rejected value [weight term(WGT234)]; codes [ConceptReferenceTerm.termToTerm.alreadyMapped.term.conceptReferenceTermMaps[1].termB,ConceptReferenceTerm.termToTerm.alreadyMapped.term.conceptReferenceTermMaps.termB,ConceptReferenceTerm.termToTerm.alreadyMapped.conceptReferenceTermMaps[1].termB,ConceptReferenceTerm.termToTerm.alreadyMapped.conceptReferenceTermMaps.termB,ConceptReferenceTerm.termToTerm.alreadyMapped.termB,ConceptReferenceTerm.termToTerm.alreadyMapped.org.openmrs.ConceptReferenceTerm,ConceptReferenceTerm.termToTerm.alreadyMapped]; arguments []; default message [Cannot map a reference term multiple times to the same concept reference term]]
21-Sep-2017 19:48:03 Tests run: 18, Failures: 0, Errors: 0, Skipped: 3, Time elapsed: 2.303 sec - in org.openmrs.validator.ConceptReferenceTermValidatorTest
21-Sep-2017 19:48:03 Running org.openmrs.validator.VisitValidatorTest
21-Sep-2017 19:48:07 Tests run: 20, Failures: 0, Errors: 0, Skipped: 1, Time elapsed: 3.231 sec - in org.openmrs.validator.VisitValidatorTest
21-Sep-2017 19:48:07 Running org.openmrs.validator.ConceptSourceValidatorTest
21-Sep-2017 19:48:08 Tests run: 6, Failures: 0, Errors: 0, Skipped: 0, Time elapsed: 0.993 sec - in org.openmrs.validator.ConceptSourceValidatorTest
21-Sep-2017 19:48:08 Running org.openmrs.validator.PrivilegeValidatorTest
21-Sep-2017 19:48:09 Tests run: 5, Failures: 0, Errors: 0, Skipped: 0, Time elapsed: 0.923 sec - in org.openmrs.validator.PrivilegeValidatorTest
21-Sep-2017 19:48:09 Running org.openmrs.validator.ProviderValidatorTest
21-Sep-2017 19:48:10 Tests run: 13, Failures: 0, Errors: 0, Skipped: 0, Time elapsed: 1.545 sec - in org.openmrs.validator.ProviderValidatorTest
21-Sep-2017 19:48:10 Running org.openmrs.validator.PersonAttributeTypeValidatorTest
21-Sep-2017 19:48:11 Tests run: 7, Failures: 0, Errors: 0, Skipped: 0, Time elapsed: 1.147 sec - in org.openmrs.validator.PersonAttributeTypeValidatorTest
21-Sep-2017 19:48:11 Running org.openmrs.validator.LocationValidatorTest
21-Sep-2017 19:48:12 Tests run: 9, Failures: 0, Errors: 0, Skipped: 0, Time elapsed: 1.074 sec - in org.openmrs.validator.LocationValidatorTest
21-Sep-2017 19:48:12 Running org.openmrs.validator.RequireNameValidatorTest
21-Sep-2017 19:48:12 Tests run: 2, Failures: 0, Errors: 0, Skipped: 0, Time elapsed: 0.073 sec - in org.openmrs.validator.RequireNameValidatorTest
21-Sep-2017 19:48:12 Running org.openmrs.validator.VisitAttributeTypeValidatorTest
21-Sep-2017 19:48:14 Tests run: 2, Failures: 0, Errors: 0, Skipped: 0, Time elapsed: 1.216 sec - in org.openmrs.validator.VisitAttributeTypeValidatorTest
21-Sep-2017 19:48:14 Running org.openmrs.validator.FormValidatorTest
21-Sep-2017 19:48:16 Tests run: 8, Failures: 0, Errors: 0, Skipped: 0, Time elapsed: 2.716 sec - in org.openmrs.validator.FormValidatorTest
21-Sep-2017 19:48:16 Running org.openmrs.validator.EncounterRoleValidatorTest
21-Sep-2017 19:48:18 Tests run: 5, Failures: 0, Errors: 0, Skipped: 0, Time elapsed: 1.483 sec - in org.openmrs.validator.EncounterRoleValidatorTest
21-Sep-2017 19:48:18 Running org.openmrs.validator.FieldValidatorTest
21-Sep-2017 19:48:20 Tests run: 8, Failures: 0, Errors: 0, Skipped: 0, Time elapsed: 1.73 sec - in org.openmrs.validator.FieldValidatorTest
21-Sep-2017 19:48:20 Running org.openmrs.validator.AlertValidatorTest
21-Sep-2017 19:48:21 Tests run: 4, Failures: 0, Errors: 0, Skipped: 0, Time elapsed: 1.897 sec - in org.openmrs.validator.AlertValidatorTest
21-Sep-2017 19:48:21 Running org.openmrs.validator.ProviderAttributeTypeValidatorTest
21-Sep-2017 19:48:23 Tests run: 2, Failures: 0, Errors: 0, Skipped: 0, Time elapsed: 1.108 sec - in org.openmrs.validator.ProviderAttributeTypeValidatorTest
21-Sep-2017 19:48:23 Running org.openmrs.validator.PatientProgramValidatorTest
21-Sep-2017 19:48:25 Tests run: 22, Failures: 0, Errors: 0, Skipped: 0, Time elapsed: 2.135 sec - in org.openmrs.validator.PatientProgramValidatorTest
21-Sep-2017 19:48:25 Running org.openmrs.validator.RelationshipTypeValidatorTest
21-Sep-2017 19:48:26 Tests run: 7, Failures: 0, Errors: 0, Skipped: 0, Time elapsed: 1.222 sec - in org.openmrs.validator.RelationshipTypeValidatorTest
21-Sep-2017 19:48:26 Running org.openmrs.validator.OrderTypeValidatorTest
21-Sep-2017 19:48:28 Tests run: 14, Failures: 0, Errors: 0, Skipped: 0, Time elapsed: 1.792 sec - in org.openmrs.validator.OrderTypeValidatorTest
21-Sep-2017 19:48:28 Running org.openmrs.validator.UserValidatorTest
21-Sep-2017 19:48:31 Tests run: 21, Failures: 0, Errors: 0, Skipped: 0, Time elapsed: 3.698 sec - in org.openmrs.validator.UserValidatorTest
21-Sep-2017 19:48:31 Running org.openmrs.validator.PersonValidatorTest
21-Sep-2017 19:48:33 Tests run: 8, Failures: 0, Errors: 0, Skipped: 0, Time elapsed: 1.324 sec - in org.openmrs.validator.PersonValidatorTest
21-Sep-2017 19:48:33 Running org.openmrs.validator.EncounterTypeValidatorTest
21-Sep-2017 19:48:34 Tests run: 7, Failures: 0, Errors: 0, Skipped: 0, Time elapsed: 1.548 sec - in org.openmrs.validator.EncounterTypeValidatorTest
21-Sep-2017 19:48:34 Running org.openmrs.validator.DrugValidatorTest
21-Sep-2017 19:48:36 Tests run: 9, Failures: 0, Errors: 0, Skipped: 0, Time elapsed: 1.344 sec - in org.openmrs.validator.DrugValidatorTest
21-Sep-2017 19:48:36 Running org.openmrs.validator.HL7SourceValidatorTest
21-Sep-2017 19:48:36 Tests run: 2, Failures: 0, Errors: 0, Skipped: 0, Time elapsed: 0.835 sec - in org.openmrs.validator.HL7SourceValidatorTest
21-Sep-2017 19:48:36 Running org.openmrs.validator.EncounterValidatorTest
21-Sep-2017 19:48:38 Tests run: 10, Failures: 0, Errors: 0, Skipped: 0, Time elapsed: 1.317 sec - in org.openmrs.validator.EncounterValidatorTest
21-Sep-2017 19:48:38 Running org.openmrs.validator.ConceptNameTagValidatorTest
21-Sep-2017 19:48:39 Tests run: 7, Failures: 0, Errors: 0, Skipped: 0, Time elapsed: 1.285 sec - in org.openmrs.validator.ConceptNameTagValidatorTest
21-Sep-2017 19:48:39 Running org.openmrs.validator.ConceptMapTypeValidatorTest
21-Sep-2017 19:48:41 Tests run: 8, Failures: 0, Errors: 0, Skipped: 0, Time elapsed: 1.57 sec - in org.openmrs.validator.ConceptMapTypeValidatorTest
21-Sep-2017 19:48:41 Running org.openmrs.validator.TestOrderValidatorTest
21-Sep-2017 19:48:42 Tests run: 2, Failures: 0, Errors: 0, Skipped: 0, Time elapsed: 1.733 sec - in org.openmrs.validator.TestOrderValidatorTest
21-Sep-2017 19:48:42 Running org.openmrs.validator.ConceptDatatypeValidatorTest
21-Sep-2017 19:48:44 Tests run: 5, Failures: 0, Errors: 0, Skipped: 0, Time elapsed: 1.189 sec - in org.openmrs.validator.ConceptDatatypeValidatorTest
21-Sep-2017 19:48:44 Running org.openmrs.validator.ObsValidatorTest
21-Sep-2017 19:48:46 Tests run: 21, Failures: 0, Errors: 0, Skipped: 0, Time elapsed: 2.076 sec - in org.openmrs.validator.ObsValidatorTest
21-Sep-2017 19:48:46 Running org.openmrs.validator.LocationAttributeTypeValidatorTest
21-Sep-2017 19:48:47 Tests run: 6, Failures: 0, Errors: 0, Skipped: 0, Time elapsed: 1.092 sec - in org.openmrs.validator.LocationAttributeTypeValidatorTest
21-Sep-2017 19:48:47 Running org.openmrs.validator.ValidateUtilTest
21-Sep-2017 19:48:49 Tests run: 8, Failures: 0, Errors: 0, Skipped: 0, Time elapsed: 1.945 sec - in org.openmrs.validator.ValidateUtilTest
21-Sep-2017 19:48:49 Running org.openmrs.validator.PersonAddressValidatorTest
21-Sep-2017 19:48:50 Tests run: 10, Failures: 0, Errors: 0, Skipped: 0, Time elapsed: 1.595 sec - in org.openmrs.validator.PersonAddressValidatorTest
21-Sep-2017 19:48:50 Running org.openmrs.validator.SchedulerFormValidatorTest
21-Sep-2017 19:48:52 Tests run: 10, Failures: 0, Errors: 0, Skipped: 0, Time elapsed: 1.722 sec - in org.openmrs.validator.SchedulerFormValidatorTest
21-Sep-2017 19:48:52 Running org.openmrs.validator.DrugOrderValidatorTest
21-Sep-2017 19:48:56 Tests run: 36, Failures: 0, Errors: 0, Skipped: 0, Time elapsed: 4.044 sec - in org.openmrs.validator.DrugOrderValidatorTest
21-Sep-2017 19:48:56 Running org.openmrs.validator.PersonNameValidatorTest
21-Sep-2017 19:49:00 Tests run: 50, Failures: 0, Errors: 0, Skipped: 0, Time elapsed: 3.713 sec - in org.openmrs.validator.PersonNameValidatorTest
21-Sep-2017 19:49:00 Running org.openmrs.validator.ProgramValidatorTest
21-Sep-2017 19:49:01 Tests run: 8, Failures: 0, Errors: 0, Skipped: 0, Time elapsed: 1.225 sec - in org.openmrs.validator.ProgramValidatorTest
21-Sep-2017 19:49:01 Running org.openmrs.validator.OrderFrequencyValidatorTest
21-Sep-2017 19:49:02 Tests run: 9, Failures: 0, Errors: 0, Skipped: 0, Time elapsed: 1.263 sec - in org.openmrs.validator.OrderFrequencyValidatorTest
21-Sep-2017 19:49:02 Running org.openmrs.validator.ConceptAttributeTypeValidatorTest
21-Sep-2017 19:49:03 Tests run: 6, Failures: 0, Errors: 0, Skipped: 0, Time elapsed: 1.069 sec - in org.openmrs.validator.ConceptAttributeTypeValidatorTest
21-Sep-2017 19:49:03 Running org.openmrs.validator.ConceptClassValidatorTest
21-Sep-2017 19:49:04 Tests run: 6, Failures: 0, Errors: 0, Skipped: 0, Time elapsed: 1.068 sec - in org.openmrs.validator.ConceptClassValidatorTest
21-Sep-2017 19:49:04 Running org.openmrs.validator.PersonMergeLogValidatorTest
21-Sep-2017 19:49:05 Tests run: 6, Failures: 0, Errors: 0, Skipped: 0, Time elapsed: 0.933 sec - in org.openmrs.validator.PersonMergeLogValidatorTest
21-Sep-2017 19:49:05 Running org.openmrs.validator.PatientIdentifierTypeValidatorTest
21-Sep-2017 19:49:06 Tests run: 9, Failures: 0, Errors: 0, Skipped: 0, Time elapsed: 1.161 sec - in org.openmrs.validator.PatientIdentifierTypeValidatorTest
21-Sep-2017 19:49:06 Running org.openmrs.validator.AllergyValidatorTest
21-Sep-2017 19:49:08 Tests run: 9, Failures: 0, Errors: 0, Skipped: 0, Time elapsed: 1.727 sec - in org.openmrs.validator.AllergyValidatorTest
21-Sep-2017 19:49:08 Running org.openmrs.validator.RelationshipValidatorTest
21-Sep-2017 19:49:10 Tests run: 7, Failures: 0, Errors: 0, Skipped: 0, Time elapsed: 1.408 sec - in org.openmrs.validator.RelationshipValidatorTest
21-Sep-2017 19:49:10 Running org.openmrs.validator.PatientIdentifierValidatorTest
21-Sep-2017 19:49:11 Tests run: 20, Failures: 0, Errors: 0, Skipped: 0, Time elapsed: 1.768 sec - in org.openmrs.validator.PatientIdentifierValidatorTest
21-Sep-2017 19:49:11 Running org.openmrs.validator.OrderValidatorTest
21-Sep-2017 19:49:13 Tests run: 22, Failures: 0, Errors: 0, Skipped: 0, Time elapsed: 2.06 sec - in org.openmrs.validator.OrderValidatorTest
21-Sep-2017 19:49:13 Running org.openmrs.validator.VisitTypeValidatorTest
21-Sep-2017 19:49:14 Tests run: 2, Failures: 0, Errors: 0, Skipped: 0, Time elapsed: 0.758 sec - in org.openmrs.validator.VisitTypeValidatorTest
21-Sep-2017 19:49:14 Running org.openmrs.validator.ConceptValidatorTest
21-Sep-2017 19:49:17 Tests run: 30, Failures: 0, Errors: 0, Skipped: 0, Time elapsed: 3.093 sec - in org.openmrs.validator.ConceptValidatorTest
21-Sep-2017 19:49:17 Running org.openmrs.validator.StateConversionValidatorTest
21-Sep-2017 19:49:18 Tests run: 4, Failures: 0, Errors: 0, Skipped: 0, Time elapsed: 0.961 sec - in org.openmrs.validator.StateConversionValidatorTest
21-Sep-2017 19:49:18 Running org.openmrs.validator.BaseAttributeTypeValidatorTest
21-Sep-2017 19:49:23 Tests run: 9, Failures: 0, Errors: 0, Skipped: 0, Time elapsed: 5.142 sec - in org.openmrs.validator.BaseAttributeTypeValidatorTest
21-Sep-2017 19:49:23 Running org.openmrs.validator.LocationTagValidatorTest
21-Sep-2017 19:49:24 Tests run: 2, Failures: 0, Errors: 0, Skipped: 0, Time elapsed: 0.709 sec - in org.openmrs.validator.LocationTagValidatorTest
21-Sep-2017 19:49:24 Running org.openmrs.api.UserServiceTest
21-Sep-2017 19:49:36 Tests run: 85, Failures: 0, Errors: 0, Skipped: 1, Time elapsed: 12.266 sec - in org.openmrs.api.UserServiceTest
21-Sep-2017 19:49:36 Running org.openmrs.api.db.SerializedObjectDAOTest
21-Sep-2017 19:49:36 Tests run: 1, Failures: 0, Errors: 0, Skipped: 1, Time elapsed: 0 sec - in org.openmrs.api.db.SerializedObjectDAOTest
21-Sep-2017 19:49:36 Running org.openmrs.api.db.ConceptDAOTest
21-Sep-2017 19:49:38 Tests run: 13, Failures: 0, Errors: 0, Skipped: 2, Time elapsed: 2.098 sec - in org.openmrs.api.db.ConceptDAOTest
21-Sep-2017 19:49:38 Running org.openmrs.api.db.EncounterDAOTest
21-Sep-2017 19:49:40 Tests run: 4, Failures: 0, Errors: 0, Skipped: 0, Time elapsed: 1.314 sec - in org.openmrs.api.db.EncounterDAOTest
21-Sep-2017 19:49:40 Running org.openmrs.api.db.hibernate.ImmutableEntityInterceptorTest
21-Sep-2017 19:49:42 Tests run: 4, Failures: 0, Errors: 0, Skipped: 0, Time elapsed: 2.615 sec - in org.openmrs.api.db.hibernate.ImmutableEntityInterceptorTest
21-Sep-2017 19:49:42 Running org.openmrs.api.db.hibernate.ProviderDAOTest
21-Sep-2017 19:49:43 Tests run: 3, Failures: 0, Errors: 0, Skipped: 0, Time elapsed: 1.028 sec - in org.openmrs.api.db.hibernate.ProviderDAOTest
21-Sep-2017 19:49:43 Running org.openmrs.api.db.hibernate.HibernatePersonDAOTest
21-Sep-2017 19:49:47 Tests run: 41, Failures: 0, Errors: 0, Skipped: 0, Time elapsed: 3.984 sec - in org.openmrs.api.db.hibernate.HibernatePersonDAOTest
21-Sep-2017 19:49:47 Running org.openmrs.api.db.hibernate.HibernateLocationDAOTest
21-Sep-2017 19:49:49 Tests run: 3, Failures: 0, Errors: 0, Skipped: 0, Time elapsed: 1.113 sec - in org.openmrs.api.db.hibernate.HibernateLocationDAOTest
21-Sep-2017 19:49:49 Running org.openmrs.api.db.hibernate.PatientSearchCriteriaTest
21-Sep-2017 19:49:51 Tests run: 18, Failures: 0, Errors: 0, Skipped: 0, Time elapsed: 2.41 sec - in org.openmrs.api.db.hibernate.PatientSearchCriteriaTest
21-Sep-2017 19:49:51 Running org.openmrs.api.db.hibernate.DropMillisecondsHibernateInterceptorTest
21-Sep-2017 19:49:52 Tests run: 3, Failures: 0, Errors: 0, Skipped: 0, Time elapsed: 1.184 sec - in org.openmrs.api.db.hibernate.DropMillisecondsHibernateInterceptorTest
21-Sep-2017 19:49:52 Running org.openmrs.api.db.hibernate.PersonAttributeHelperTest
21-Sep-2017 19:49:53 Tests run: 5, Failures: 0, Errors: 0, Skipped: 0, Time elapsed: 1.343 sec - in org.openmrs.api.db.hibernate.PersonAttributeHelperTest
21-Sep-2017 19:49:53 Running org.openmrs.api.db.hibernate.HibernateOrderDAOTest
21-Sep-2017 19:49:55 Tests run: 1, Failures: 0, Errors: 0, Skipped: 0, Time elapsed: 1.047 sec - in org.openmrs.api.db.hibernate.HibernateOrderDAOTest
21-Sep-2017 19:49:55 Running org.openmrs.api.db.hibernate.AuditableInterceptorTest
21-Sep-2017 19:49:56 Tests run: 15, Failures: 0, Errors: 0, Skipped: 0, Time elapsed: 1.853 sec - in org.openmrs.api.db.hibernate.AuditableInterceptorTest
21-Sep-2017 19:49:56 Running org.openmrs.api.db.hibernate.HibernateConceptDAOTest
21-Sep-2017 19:50:01 Tests run: 11, Failures: 0, Errors: 0, Skipped: 0, Time elapsed: 4.706 sec - in org.openmrs.api.db.hibernate.HibernateConceptDAOTest
21-Sep-2017 19:50:01 Running org.openmrs.api.db.hibernate.HibernateObsDAOTest
21-Sep-2017 19:50:02 Tests run: 1, Failures: 0, Errors: 0, Skipped: 0, Time elapsed: 0.684 sec - in org.openmrs.api.db.hibernate.HibernateObsDAOTest
21-Sep-2017 19:50:02 Running org.openmrs.api.db.hibernate.HibernateProviderDAOTest
21-Sep-2017 19:50:03 Tests run: 3, Failures: 0, Errors: 0, Skipped: 0, Time elapsed: 0.779 sec - in org.openmrs.api.db.hibernate.HibernateProviderDAOTest
21-Sep-2017 19:50:03 Running org.openmrs.api.db.ProgramWorkflowDAOTest
21-Sep-2017 19:50:03 Tests run: 4, Failures: 0, Errors: 0, Skipped: 0, Time elapsed: 0.912 sec - in org.openmrs.api.db.ProgramWorkflowDAOTest
21-Sep-2017 19:50:03 Running org.openmrs.api.db.ContextDAOTest
21-Sep-2017 19:50:04 ERROR - HibernateContextDAO.authenticate(184) |2017-09-21 19:50:04,428| Unable to convert the global property security.allowedFailedLoginsBeforeLockoutto a valid integer. Using default value of 7
21-Sep-2017 19:50:04 ERROR - HibernateContextDAO.authenticate(184) |2017-09-21 19:50:04,503| Unable to convert the global property security.allowedFailedLoginsBeforeLockoutto a valid integer. Using default value of 7
21-Sep-2017 19:50:04 ERROR - HibernateContextDAO.authenticate(184) |2017-09-21 19:50:04,507| Unable to convert the global property security.allowedFailedLoginsBeforeLockoutto a valid integer. Using default value of 7
21-Sep-2017 19:50:04 ERROR - HibernateContextDAO.authenticate(184) |2017-09-21 19:50:04,509| Unable to convert the global property security.allowedFailedLoginsBeforeLockoutto a valid integer. Using default value of 7
21-Sep-2017 19:50:04 ERROR - HibernateContextDAO.authenticate(184) |2017-09-21 19:50:04,511| Unable to convert the global property security.allowedFailedLoginsBeforeLockoutto a valid integer. Using default value of 7
21-Sep-2017 19:50:04 ERROR - HibernateContextDAO.authenticate(184) |2017-09-21 19:50:04,514| Unable to convert the global property security.allowedFailedLoginsBeforeLockoutto a valid integer. Using default value of 7
21-Sep-2017 19:50:04 ERROR - HibernateContextDAO.authenticate(184) |2017-09-21 19:50:04,516| Unable to convert the global property security.allowedFailedLoginsBeforeLockoutto a valid integer. Using default value of 7
21-Sep-2017 19:50:04 ERROR - HibernateContextDAO.authenticate(184) |2017-09-21 19:50:04,520| Unable to convert the global property security.allowedFailedLoginsBeforeLockoutto a valid integer. Using default value of 7
21-Sep-2017 19:50:04 ERROR - HibernateContextDAO.authenticate(184) |2017-09-21 19:50:04,523| Unable to convert the global property security.allowedFailedLoginsBeforeLockoutto a valid integer. Using default value of 7
21-Sep-2017 19:50:04 ERROR - HibernateContextDAO.authenticate(184) |2017-09-21 19:50:04,525| Unable to convert the global property security.allowedFailedLoginsBeforeLockoutto a valid integer. Using default value of 7
21-Sep-2017 19:50:04 ERROR - HibernateContextDAO.authenticate(184) |2017-09-21 19:50:04,597| Unable to convert the global property security.allowedFailedLoginsBeforeLockoutto a valid integer. Using default value of 7
21-Sep-2017 19:50:04 ERROR - HibernateContextDAO.authenticate(184) |2017-09-21 19:50:04,667| Unable to convert the global property security.allowedFailedLoginsBeforeLockoutto a valid integer. Using default value of 7
21-Sep-2017 19:50:05 ERROR - HibernateContextDAO.authenticate(184) |2017-09-21 19:50:05,002| Unable to convert the global property security.allowedFailedLoginsBeforeLockoutto a valid integer. Using default value of 7
21-Sep-2017 19:50:05 ERROR - HibernateContextDAO.authenticate(184) |2017-09-21 19:50:05,004| Unable to convert the global property security.allowedFailedLoginsBeforeLockoutto a valid integer. Using default value of 7
21-Sep-2017 19:50:05 ERROR - HibernateContextDAO.authenticate(184) |2017-09-21 19:50:05,006| Unable to convert the global property security.allowedFailedLoginsBeforeLockoutto a valid integer. Using default value of 7
21-Sep-2017 19:50:05 ERROR - HibernateContextDAO.authenticate(184) |2017-09-21 19:50:05,008| Unable to convert the global property security.allowedFailedLoginsBeforeLockoutto a valid integer. Using default value of 7
21-Sep-2017 19:50:05 ERROR - HibernateContextDAO.authenticate(184) |2017-09-21 19:50:05,009| Unable to convert the global property security.allowedFailedLoginsBeforeLockoutto a valid integer. Using default value of 7
21-Sep-2017 19:50:05 ERROR - HibernateContextDAO.authenticate(184) |2017-09-21 19:50:05,012| Unable to convert the global property security.allowedFailedLoginsBeforeLockoutto a valid integer. Using default value of 7
21-Sep-2017 19:50:05 ERROR - HibernateContextDAO.authenticate(184) |2017-09-21 19:50:05,013| Unable to convert the global property security.allowedFailedLoginsBeforeLockoutto a valid integer. Using default value of 7
21-Sep-2017 19:50:05 ERROR - HibernateContextDAO.authenticate(184) |2017-09-21 19:50:05,083| Unable to convert the global property security.allowedFailedLoginsBeforeLockoutto a valid integer. Using default value of 7
21-Sep-2017 19:50:05 ERROR - HibernateContextDAO.authenticate(184) |2017-09-21 19:50:05,149| Unable to convert the global property security.allowedFailedLoginsBeforeLockoutto a valid integer. Using default value of 7
21-Sep-2017 19:50:05 Tests run: 21, Failures: 0, Errors: 0, Skipped: 0, Time elapsed: 1.971 sec - in org.openmrs.api.db.ContextDAOTest
21-Sep-2017 19:50:05 Running org.openmrs.api.db.PersonDAOTest
21-Sep-2017 19:50:06 Tests run: 3, Failures: 0, Errors: 0, Skipped: 0, Time elapsed: 0.692 sec - in org.openmrs.api.db.PersonDAOTest
21-Sep-2017 19:50:06 Running org.openmrs.api.db.VisitDAOTest
21-Sep-2017 19:50:07 Tests run: 3, Failures: 0, Errors: 0, Skipped: 0, Time elapsed: 0.754 sec - in org.openmrs.api.db.VisitDAOTest
21-Sep-2017 19:50:07 Running org.openmrs.api.db.PatientDAOTest
21-Sep-2017 19:50:13 WARN - HibernatePatientDAO.getDuplicatePatientsSQLString(556) |2017-09-21 19:50:13,615| Unidentified attribute: abcDef
21-Sep-2017 19:50:24 WARN - HibernatePatientDAO.getDuplicatePatientsSQLString(556) |2017-09-21 19:50:24,796| Unidentified attribute: abcDef
21-Sep-2017 19:50:25 Tests run: 141, Failures: 0, Errors: 0, Skipped: 0, Time elapsed: 17.961 sec - in org.openmrs.api.db.PatientDAOTest
21-Sep-2017 19:50:25 Running org.openmrs.api.db.UserDAOTest
21-Sep-2017 19:50:26 Tests run: 8, Failures: 0, Errors: 0, Skipped: 0, Time elapsed: 1.162 sec - in org.openmrs.api.db.UserDAOTest
21-Sep-2017 19:50:26 Running org.openmrs.api.OrderSetServiceTest
21-Sep-2017 19:50:28 Tests run: 12, Failures: 0, Errors: 0, Skipped: 0, Time elapsed: 1.748 sec - in org.openmrs.api.OrderSetServiceTest
21-Sep-2017 19:50:28 Running org.openmrs.api.PatientServiceTest
21-Sep-2017 19:50:48 Tests run: 163, Failures: 0, Errors: 0, Skipped: 2, Time elapsed: 19.774 sec - in org.openmrs.api.PatientServiceTest
21-Sep-2017 19:50:48 Running org.openmrs.api.impl.ConceptServiceImplTest
21-Sep-2017 19:50:49 Tests run: 8, Failures: 0, Errors: 0, Skipped: 0, Time elapsed: 1.278 sec - in org.openmrs.api.impl.ConceptServiceImplTest
21-Sep-2017 19:50:49 Running org.openmrs.api.impl.SerializationServiceImplTest
21-Sep-2017 19:50:49 Tests run: 1, Failures: 0, Errors: 0, Skipped: 0, Time elapsed: 0.058 sec - in org.openmrs.api.impl.SerializationServiceImplTest
21-Sep-2017 19:50:49 Running org.openmrs.api.ObsServiceTest
21-Sep-2017 19:50:55 ERROR - ImageHandler.getObs(79) |2017-09-21 19:50:55,066| Trying to read file: /home/bamboo-agent-1/bamboo-agent/.agent_tmp/TRUNK-OC2-JOB1/appdir-for-unit-tests-3465677414951185399/complex_obs/openmrs_logo_small.gif
21-Sep-2017 19:50:55 javax.imageio.IIOException: Can't read input file!
21-Sep-2017 19:50:55         at javax.imageio.ImageIO.read(ImageIO.java:1301)
21-Sep-2017 19:50:55         at org.openmrs.obs.handler.ImageHandler.getObs(ImageHandler.java:76)
21-Sep-2017 19:50:55         at org.openmrs.api.impl.ObsServiceImpl.getComplexObs(ObsServiceImpl.java:480)
21-Sep-2017 19:50:55         at sun.reflect.NativeMethodAccessorImpl.invoke0(Native Method)
21-Sep-2017 19:50:55         at sun.reflect.NativeMethodAccessorImpl.invoke(NativeMethodAccessorImpl.java:62)
21-Sep-2017 19:50:55         at sun.reflect.DelegatingMethodAccessorImpl.invoke(DelegatingMethodAccessorImpl.java:43)
21-Sep-2017 19:50:55         at java.lang.reflect.Method.invoke(Method.java:498)
21-Sep-2017 19:50:55         at org.springframework.aop.support.AopUtils.invokeJoinpointUsingReflection(AopUtils.java:317)
21-Sep-2017 19:50:55         at org.springframework.aop.framework.ReflectiveMethodInvocation.invokeJoinpoint(ReflectiveMethodInvocation.java:190)
21-Sep-2017 19:50:55         at org.springframework.aop.framework.ReflectiveMethodInvocation.proceed(ReflectiveMethodInvocation.java:157)
21-Sep-2017 19:50:55         at org.springframework.transaction.interceptor.TransactionInterceptor$1.proceedWithInvocation(TransactionInterceptor.java:99)
21-Sep-2017 19:50:55         at org.springframework.transaction.interceptor.TransactionAspectSupport.invokeWithinTransaction(TransactionAspectSupport.java:281)
21-Sep-2017 19:50:55         at org.springframework.transaction.interceptor.TransactionInterceptor.invoke(TransactionInterceptor.java:96)
21-Sep-2017 19:50:55         at org.springframework.aop.framework.ReflectiveMethodInvocation.proceed(ReflectiveMethodInvocation.java:179)
21-Sep-2017 19:50:55         at org.springframework.aop.framework.JdkDynamicAopProxy.invoke(JdkDynamicAopProxy.java:207)
21-Sep-2017 19:50:55         at com.sun.proxy.$Proxy73.getComplexObs(Unknown Source)
21-Sep-2017 19:50:55         at sun.reflect.NativeMethodAccessorImpl.invoke0(Native Method)
21-Sep-2017 19:50:55         at sun.reflect.NativeMethodAccessorImpl.invoke(NativeMethodAccessorImpl.java:62)
21-Sep-2017 19:50:55         at sun.reflect.DelegatingMethodAccessorImpl.invoke(DelegatingMethodAccessorImpl.java:43)
21-Sep-2017 19:50:55         at java.lang.reflect.Method.invoke(Method.java:498)
21-Sep-2017 19:50:55         at org.springframework.aop.support.AopUtils.invokeJoinpointUsingReflection(AopUtils.java:317)
21-Sep-2017 19:50:55         at org.springframework.aop.framework.ReflectiveMethodInvocation.invokeJoinpoint(ReflectiveMethodInvocation.java:190)
21-Sep-2017 19:50:55         at org.springframework.aop.framework.ReflectiveMethodInvocation.proceed(ReflectiveMethodInvocation.java:157)
21-Sep-2017 19:50:55         at org.openmrs.aop.LoggingAdvice.invoke(LoggingAdvice.java:121)
21-Sep-2017 19:50:55         at org.springframework.aop.framework.ReflectiveMethodInvocation.proceed(ReflectiveMethodInvocation.java:179)
21-Sep-2017 19:50:55         at org.springframework.aop.framework.adapter.MethodBeforeAdviceInterceptor.invoke(MethodBeforeAdviceInterceptor.java:52)
21-Sep-2017 19:50:55         at org.springframework.aop.framework.ReflectiveMethodInvocation.proceed(ReflectiveMethodInvocation.java:179)
21-Sep-2017 19:50:55         at org.springframework.aop.framework.adapter.MethodBeforeAdviceInterceptor.invoke(MethodBeforeAdviceInterceptor.java:52)
21-Sep-2017 19:50:55         at org.springframework.aop.framework.ReflectiveMethodInvocation.proceed(ReflectiveMethodInvocation.java:179)
21-Sep-2017 19:50:55         at org.springframework.aop.framework.JdkDynamicAopProxy.invoke(JdkDynamicAopProxy.java:207)
21-Sep-2017 19:50:55         at com.sun.proxy.$Proxy74.getComplexObs(Unknown Source)
21-Sep-2017 19:50:55         at org.openmrs.api.ObsServiceTest.purgeObs_shouldDeleteTheGivenObsFromTheDatabase(ObsServiceTest.java:1353)
21-Sep-2017 19:50:55         at sun.reflect.NativeMethodAccessorImpl.invoke0(Native Method)
21-Sep-2017 19:50:55         at sun.reflect.NativeMethodAccessorImpl.invoke(NativeMethodAccessorImpl.java:62)
21-Sep-2017 19:50:55         at sun.reflect.DelegatingMethodAccessorImpl.invoke(DelegatingMethodAccessorImpl.java:43)
21-Sep-2017 19:50:55         at java.lang.reflect.Method.invoke(Method.java:498)
21-Sep-2017 19:50:55         at org.junit.runners.model.FrameworkMethod$1.runReflectiveCall(FrameworkMethod.java:47)
21-Sep-2017 19:50:55         at org.junit.internal.runners.model.ReflectiveCallable.run(ReflectiveCallable.java:12)
21-Sep-2017 19:50:55         at org.junit.runners.model.FrameworkMethod.invokeExplosively(FrameworkMethod.java:44)
21-Sep-2017 19:50:55         at org.junit.internal.runners.statements.InvokeMethod.evaluate(InvokeMethod.java:17)
21-Sep-2017 19:50:55         at org.junit.internal.runners.statements.RunBefores.evaluate(RunBefores.java:26)
21-Sep-2017 19:50:55         at org.springframework.test.context.junit4.statements.RunBeforeTestMethodCallbacks.evaluate(RunBeforeTestMethodCallbacks.java:73)
21-Sep-2017 19:50:55         at org.junit.internal.runners.statements.RunAfters.evaluate(RunAfters.java:27)
21-Sep-2017 19:50:55         at org.springframework.test.context.junit4.statements.RunAfterTestMethodCallbacks.evaluate(RunAfterTestMethodCallbacks.java:82)
21-Sep-2017 19:50:55         at org.junit.rules.ExpectedException$ExpectedExceptionStatement.evaluate(ExpectedException.java:168)
21-Sep-2017 19:50:55         at org.junit.rules.RunRules.evaluate(RunRules.java:20)
21-Sep-2017 19:50:55         at org.springframework.test.context.junit4.statements.SpringRepeat.evaluate(SpringRepeat.java:73)
21-Sep-2017 19:50:55         at org.junit.runners.ParentRunner.runLeaf(ParentRunner.java:271)
21-Sep-2017 19:50:55         at org.springframework.test.context.junit4.SpringJUnit4ClassRunner.runChild(SpringJUnit4ClassRunner.java:217)
21-Sep-2017 19:50:55         at org.springframework.test.context.junit4.SpringJUnit4ClassRunner.runChild(SpringJUnit4ClassRunner.java:83)
21-Sep-2017 19:50:55         at org.junit.runners.ParentRunner$3.run(ParentRunner.java:238)
21-Sep-2017 19:50:55         at org.junit.runners.ParentRunner$1.schedule(ParentRunner.java:63)
21-Sep-2017 19:50:55         at org.junit.runners.ParentRunner.runChildren(ParentRunner.java:236)
21-Sep-2017 19:50:55         at org.junit.runners.ParentRunner.access$000(ParentRunner.java:53)
21-Sep-2017 19:50:55         at org.junit.runners.ParentRunner$2.evaluate(ParentRunner.java:229)
21-Sep-2017 19:50:55         at org.springframework.test.context.junit4.statements.RunBeforeTestClassCallbacks.evaluate(RunBeforeTestClassCallbacks.java:61)
21-Sep-2017 19:50:55         at org.junit.internal.runners.statements.RunAfters.evaluate(RunAfters.java:27)
21-Sep-2017 19:50:55         at org.springframework.test.context.junit4.statements.RunAfterTestClassCallbacks.evaluate(RunAfterTestClassCallbacks.java:68)
21-Sep-2017 19:50:55         at org.junit.runners.ParentRunner.run(ParentRunner.java:309)
21-Sep-2017 19:50:55         at org.springframework.test.context.junit4.SpringJUnit4ClassRunner.run(SpringJUnit4ClassRunner.java:163)
21-Sep-2017 19:50:55         at org.apache.maven.surefire.junit4.JUnit4Provider.execute(JUnit4Provider.java:283)
21-Sep-2017 19:50:55         at org.apache.maven.surefire.junit4.JUnit4Provider.executeWithRerun(JUnit4Provider.java:173)
21-Sep-2017 19:50:55         at org.apache.maven.surefire.junit4.JUnit4Provider.executeTestSet(JUnit4Provider.java:153)
21-Sep-2017 19:50:55         at org.apache.maven.surefire.junit4.JUnit4Provider.invoke(JUnit4Provider.java:128)
21-Sep-2017 19:50:55         at org.apache.maven.surefire.booter.ForkedBooter.invokeProviderInSameClassLoader(ForkedBooter.java:203)
21-Sep-2017 19:50:55         at org.apache.maven.surefire.booter.ForkedBooter.runSuitesInProcess(ForkedBooter.java:155)
21-Sep-2017 19:50:55         at org.apache.maven.surefire.booter.ForkedBooter.main(ForkedBooter.java:103)
21-Sep-2017 19:50:55 ERROR - ImageHandler.getObs(96) |2017-09-21 19:50:55,075| Image /home/bamboo-agent-1/bamboo-agent/.agent_tmp/TRUNK-OC2-JOB1/appdir-for-unit-tests-3465677414951185399/complex_obs/openmrs_logo_small.gif was not found
21-Sep-2017 19:50:55 java.io.FileNotFoundException: /home/bamboo-agent-1/bamboo-agent/.agent_tmp/TRUNK-OC2-JOB1/appdir-for-unit-tests-3465677414951185399/complex_obs/openmrs_logo_small.gif (No such file or directory)
21-Sep-2017 19:50:55         at java.io.RandomAccessFile.open0(Native Method)
21-Sep-2017 19:50:55         at java.io.RandomAccessFile.open(RandomAccessFile.java:316)
21-Sep-2017 19:50:55         at java.io.RandomAccessFile.<init>(RandomAccessFile.java:243)
21-Sep-2017 19:50:55         at javax.imageio.stream.FileImageInputStream.<init>(FileImageInputStream.java:73)
21-Sep-2017 19:50:55         at org.openmrs.obs.handler.ImageHandler.getObs(ImageHandler.java:86)
21-Sep-2017 19:50:55         at org.openmrs.api.impl.ObsServiceImpl.getComplexObs(ObsServiceImpl.java:480)
21-Sep-2017 19:50:55         at sun.reflect.NativeMethodAccessorImpl.invoke0(Native Method)
21-Sep-2017 19:50:55         at sun.reflect.NativeMethodAccessorImpl.invoke(NativeMethodAccessorImpl.java:62)
21-Sep-2017 19:50:55         at sun.reflect.DelegatingMethodAccessorImpl.invoke(DelegatingMethodAccessorImpl.java:43)
21-Sep-2017 19:50:55         at java.lang.reflect.Method.invoke(Method.java:498)
21-Sep-2017 19:50:55         at org.springframework.aop.support.AopUtils.invokeJoinpointUsingReflection(AopUtils.java:317)
21-Sep-2017 19:50:55         at org.springframework.aop.framework.ReflectiveMethodInvocation.invokeJoinpoint(ReflectiveMethodInvocation.java:190)
21-Sep-2017 19:50:55         at org.springframework.aop.framework.ReflectiveMethodInvocation.proceed(ReflectiveMethodInvocation.java:157)
21-Sep-2017 19:50:55         at org.springframework.transaction.interceptor.TransactionInterceptor$1.proceedWithInvocation(TransactionInterceptor.java:99)
21-Sep-2017 19:50:55         at org.springframework.transaction.interceptor.TransactionAspectSupport.invokeWithinTransaction(TransactionAspectSupport.java:281)
21-Sep-2017 19:50:55         at org.springframework.transaction.interceptor.TransactionInterceptor.invoke(TransactionInterceptor.java:96)
21-Sep-2017 19:50:55         at org.springframework.aop.framework.ReflectiveMethodInvocation.proceed(ReflectiveMethodInvocation.java:179)
21-Sep-2017 19:50:55         at org.springframework.aop.framework.JdkDynamicAopProxy.invoke(JdkDynamicAopProxy.java:207)
21-Sep-2017 19:50:55         at com.sun.proxy.$Proxy73.getComplexObs(Unknown Source)
21-Sep-2017 19:50:55         at sun.reflect.NativeMethodAccessorImpl.invoke0(Native Method)
21-Sep-2017 19:50:55         at sun.reflect.NativeMethodAccessorImpl.invoke(NativeMethodAccessorImpl.java:62)
21-Sep-2017 19:50:55         at sun.reflect.DelegatingMethodAccessorImpl.invoke(DelegatingMethodAccessorImpl.java:43)
21-Sep-2017 19:50:55         at java.lang.reflect.Method.invoke(Method.java:498)
21-Sep-2017 19:50:55         at org.springframework.aop.support.AopUtils.invokeJoinpointUsingReflection(AopUtils.java:317)
21-Sep-2017 19:50:55         at org.springframework.aop.framework.ReflectiveMethodInvocation.invokeJoinpoint(ReflectiveMethodInvocation.java:190)
21-Sep-2017 19:50:55         at org.springframework.aop.framework.ReflectiveMethodInvocation.proceed(ReflectiveMethodInvocation.java:157)
21-Sep-2017 19:50:55         at org.openmrs.aop.LoggingAdvice.invoke(LoggingAdvice.java:121)
21-Sep-2017 19:50:55         at org.springframework.aop.framework.ReflectiveMethodInvocation.proceed(ReflectiveMethodInvocation.java:179)
21-Sep-2017 19:50:55         at org.springframework.aop.framework.adapter.MethodBeforeAdviceInterceptor.invoke(MethodBeforeAdviceInterceptor.java:52)
21-Sep-2017 19:50:55         at org.springframework.aop.framework.ReflectiveMethodInvocation.proceed(ReflectiveMethodInvocation.java:179)
21-Sep-2017 19:50:55         at org.springframework.aop.framework.adapter.MethodBeforeAdviceInterceptor.invoke(MethodBeforeAdviceInterceptor.java:52)
21-Sep-2017 19:50:55         at org.springframework.aop.framework.ReflectiveMethodInvocation.proceed(ReflectiveMethodInvocation.java:179)
21-Sep-2017 19:50:55         at org.springframework.aop.framework.JdkDynamicAopProxy.invoke(JdkDynamicAopProxy.java:207)
21-Sep-2017 19:50:55         at com.sun.proxy.$Proxy74.getComplexObs(Unknown Source)
21-Sep-2017 19:50:55         at org.openmrs.api.ObsServiceTest.purgeObs_shouldDeleteTheGivenObsFromTheDatabase(ObsServiceTest.java:1353)
21-Sep-2017 19:50:55         at sun.reflect.NativeMethodAccessorImpl.invoke0(Native Method)
21-Sep-2017 19:50:55         at sun.reflect.NativeMethodAccessorImpl.invoke(NativeMethodAccessorImpl.java:62)
21-Sep-2017 19:50:55         at sun.reflect.DelegatingMethodAccessorImpl.invoke(DelegatingMethodAccessorImpl.java:43)
21-Sep-2017 19:50:55         at java.lang.reflect.Method.invoke(Method.java:498)
21-Sep-2017 19:50:55         at org.junit.runners.model.FrameworkMethod$1.runReflectiveCall(FrameworkMethod.java:47)
21-Sep-2017 19:50:55         at org.junit.internal.runners.model.ReflectiveCallable.run(ReflectiveCallable.java:12)
21-Sep-2017 19:50:55         at org.junit.runners.model.FrameworkMethod.invokeExplosively(FrameworkMethod.java:44)
21-Sep-2017 19:50:55         at org.junit.internal.runners.statements.InvokeMethod.evaluate(InvokeMethod.java:17)
21-Sep-2017 19:50:55         at org.junit.internal.runners.statements.RunBefores.evaluate(RunBefores.java:26)
21-Sep-2017 19:50:55         at org.springframework.test.context.junit4.statements.RunBeforeTestMethodCallbacks.evaluate(RunBeforeTestMethodCallbacks.java:73)
21-Sep-2017 19:50:55         at org.junit.internal.runners.statements.RunAfters.evaluate(RunAfters.java:27)
21-Sep-2017 19:50:55         at org.springframework.test.context.junit4.statements.RunAfterTestMethodCallbacks.evaluate(RunAfterTestMethodCallbacks.java:82)
21-Sep-2017 19:50:55         at org.junit.rules.ExpectedException$ExpectedExceptionStatement.evaluate(ExpectedException.java:168)
21-Sep-2017 19:50:55         at org.junit.rules.RunRules.evaluate(RunRules.java:20)
21-Sep-2017 19:50:55         at org.springframework.test.context.junit4.statements.SpringRepeat.evaluate(SpringRepeat.java:73)
21-Sep-2017 19:50:55         at org.junit.runners.ParentRunner.runLeaf(ParentRunner.java:271)
21-Sep-2017 19:50:55         at org.springframework.test.context.junit4.SpringJUnit4ClassRunner.runChild(SpringJUnit4ClassRunner.java:217)
21-Sep-2017 19:50:55         at org.springframework.test.context.junit4.SpringJUnit4ClassRunner.runChild(SpringJUnit4ClassRunner.java:83)
21-Sep-2017 19:50:55         at org.junit.runners.ParentRunner$3.run(ParentRunner.java:238)
21-Sep-2017 19:50:55         at org.junit.runners.ParentRunner$1.schedule(ParentRunner.java:63)
21-Sep-2017 19:50:55         at org.junit.runners.ParentRunner.runChildren(ParentRunner.java:236)
21-Sep-2017 19:50:55         at org.junit.runners.ParentRunner.access$000(ParentRunner.java:53)
21-Sep-2017 19:50:55         at org.junit.runners.ParentRunner$2.evaluate(ParentRunner.java:229)
21-Sep-2017 19:50:55         at org.springframework.test.context.junit4.statements.RunBeforeTestClassCallbacks.evaluate(RunBeforeTestClassCallbacks.java:61)
21-Sep-2017 19:50:55         at org.junit.internal.runners.statements.RunAfters.evaluate(RunAfters.java:27)
21-Sep-2017 19:50:55         at org.springframework.test.context.junit4.statements.RunAfterTestClassCallbacks.evaluate(RunAfterTestClassCallbacks.java:68)
21-Sep-2017 19:50:55         at org.junit.runners.ParentRunner.run(ParentRunner.java:309)
21-Sep-2017 19:50:55         at org.springframework.test.context.junit4.SpringJUnit4ClassRunner.run(SpringJUnit4ClassRunner.java:163)
21-Sep-2017 19:50:55         at org.apache.maven.surefire.junit4.JUnit4Provider.execute(JUnit4Provider.java:283)
21-Sep-2017 19:50:55         at org.apache.maven.surefire.junit4.JUnit4Provider.executeWithRerun(JUnit4Provider.java:173)
21-Sep-2017 19:50:55         at org.apache.maven.surefire.junit4.JUnit4Provider.executeTestSet(JUnit4Provider.java:153)
21-Sep-2017 19:50:55         at org.apache.maven.surefire.junit4.JUnit4Provider.invoke(JUnit4Provider.java:128)
21-Sep-2017 19:50:55         at org.apache.maven.surefire.booter.ForkedBooter.invokeProviderInSameClassLoader(ForkedBooter.java:203)
21-Sep-2017 19:50:55         at org.apache.maven.surefire.booter.ForkedBooter.runSuitesInProcess(ForkedBooter.java:155)
21-Sep-2017 19:50:55         at org.apache.maven.surefire.booter.ForkedBooter.main(ForkedBooter.java:103)
21-Sep-2017 19:50:56 Tests run: 75, Failures: 0, Errors: 0, Skipped: 0, Time elapsed: 6.748 sec - in org.openmrs.api.ObsServiceTest
21-Sep-2017 19:50:56 Running org.openmrs.api.ProviderServiceTest
21-Sep-2017 19:51:00 Tests run: 40, Failures: 0, Errors: 0, Skipped: 2, Time elapsed: 4.124 sec - in org.openmrs.api.ProviderServiceTest
21-Sep-2017 19:51:00 Running org.openmrs.api.CohortServiceTest
21-Sep-2017 19:51:03 Tests run: 24, Failures: 0, Errors: 0, Skipped: 0, Time elapsed: 2.85 sec - in org.openmrs.api.CohortServiceTest
21-Sep-2017 19:51:03 Running org.openmrs.api.ProgramWorkflowServiceTest
21-Sep-2017 19:51:06 Tests run: 25, Failures: 0, Errors: 0, Skipped: 0, Time elapsed: 2.967 sec - in org.openmrs.api.ProgramWorkflowServiceTest
21-Sep-2017 19:51:06 Running org.openmrs.api.OrderServiceTest
21-Sep-2017 19:51:20 Tests run: 169, Failures: 0, Errors: 0, Skipped: 3, Time elapsed: 14.837 sec - in org.openmrs.api.OrderServiceTest
21-Sep-2017 19:51:20 Running org.openmrs.api.handler.OpenmrsMetadataSaveHandlerTest
21-Sep-2017 19:51:21 Tests run: 2, Failures: 0, Errors: 0, Skipped: 0, Time elapsed: 0.112 sec - in org.openmrs.api.handler.OpenmrsMetadataSaveHandlerTest
21-Sep-2017 19:51:21 Running org.openmrs.api.handler.OpenmrsObjectSaveHandlerTest
21-Sep-2017 19:51:21 Tests run: 5, Failures: 0, Errors: 0, Skipped: 0, Time elapsed: 0.332 sec - in org.openmrs.api.handler.OpenmrsObjectSaveHandlerTest
21-Sep-2017 19:51:21 Running org.openmrs.api.handler.RequiredReasonVoidSaveHandlerTest
21-Sep-2017 19:51:22 Tests run: 5, Failures: 0, Errors: 0, Skipped: 0, Time elapsed: 1.442 sec - in org.openmrs.api.handler.RequiredReasonVoidSaveHandlerTest
21-Sep-2017 19:51:22 Running org.openmrs.api.handler.BaseUnretireHandlerTest
21-Sep-2017 19:51:23 Tests run: 6, Failures: 0, Errors: 0, Skipped: 0, Time elapsed: 0.343 sec - in org.openmrs.api.handler.BaseUnretireHandlerTest
21-Sep-2017 19:51:23 Running org.openmrs.api.handler.BaseUnvoidHandlerTest
21-Sep-2017 19:51:23 Tests run: 6, Failures: 0, Errors: 0, Skipped: 0, Time elapsed: 0.388 sec - in org.openmrs.api.handler.BaseUnvoidHandlerTest
21-Sep-2017 19:51:23 Running org.openmrs.api.handler.ConceptNameSaveHandlerTest
21-Sep-2017 19:51:25 Tests run: 4, Failures: 0, Errors: 0, Skipped: 0, Time elapsed: 1.977 sec - in org.openmrs.api.handler.ConceptNameSaveHandlerTest
21-Sep-2017 19:51:25 Running org.openmrs.api.handler.BaseVoidHandlerTest
21-Sep-2017 19:51:26 Tests run: 8, Failures: 0, Errors: 0, Skipped: 0, Time elapsed: 0.475 sec - in org.openmrs.api.handler.BaseVoidHandlerTest
21-Sep-2017 19:51:26 Running org.openmrs.api.handler.ExistingOrNewVisitAssignmentHandlerTest
21-Sep-2017 19:51:27 Tests run: 5, Failures: 0, Errors: 0, Skipped: 0, Time elapsed: 1.614 sec - in org.openmrs.api.handler.ExistingOrNewVisitAssignmentHandlerTest
21-Sep-2017 19:51:27 Running org.openmrs.api.handler.PatientDataUnvoidHandlerTest
21-Sep-2017 19:51:30 Tests run: 2, Failures: 0, Errors: 0, Skipped: 0, Time elapsed: 2.937 sec - in org.openmrs.api.handler.PatientDataUnvoidHandlerTest
21-Sep-2017 19:51:30 Running org.openmrs.api.handler.PersonVoidHandlerTest
21-Sep-2017 19:51:32 Tests run: 8, Failures: 0, Errors: 0, Skipped: 0, Time elapsed: 1.518 sec - in org.openmrs.api.handler.PersonVoidHandlerTest
21-Sep-2017 19:51:32 Running org.openmrs.api.handler.PersonUnvoidHandlerTest
21-Sep-2017 19:51:32 Tests run: 6, Failures: 0, Errors: 0, Skipped: 0, Time elapsed: 0.352 sec - in org.openmrs.api.handler.PersonUnvoidHandlerTest
21-Sep-2017 19:51:32 Running org.openmrs.api.handler.BaseRetireHandlerTest
21-Sep-2017 19:51:32 Tests run: 8, Failures: 0, Errors: 0, Skipped: 0, Time elapsed: 0.487 sec - in org.openmrs.api.handler.BaseRetireHandlerTest
21-Sep-2017 19:51:32 Running org.openmrs.api.handler.PatientDataVoidHandlerTest
21-Sep-2017 19:51:33 Tests run: 1, Failures: 0, Errors: 0, Skipped: 0, Time elapsed: 0.876 sec - in org.openmrs.api.handler.PatientDataVoidHandlerTest
21-Sep-2017 19:51:33 Running org.openmrs.api.handler.RequireVoidReasonVoidHandlerTest
21-Sep-2017 19:51:34 Tests run: 5, Failures: 0, Errors: 0, Skipped: 0, Time elapsed: 1.159 sec - in org.openmrs.api.handler.RequireVoidReasonVoidHandlerTest
21-Sep-2017 19:51:34 Running org.openmrs.api.handler.ExistingVisitAssignmentHandlerTest
21-Sep-2017 19:51:36 Tests run: 3, Failures: 0, Errors: 0, Skipped: 0, Time elapsed: 1.639 sec - in org.openmrs.api.handler.ExistingVisitAssignmentHandlerTest
21-Sep-2017 19:51:36 Running org.openmrs.api.FormServiceTest
21-Sep-2017 19:51:40 Tests run: 40, Failures: 0, Errors: 0, Skipped: 0, Time elapsed: 3.916 sec - in org.openmrs.api.FormServiceTest
21-Sep-2017 19:51:40 Running org.openmrs.api.PatientServiceAllergyTest
21-Sep-2017 19:51:43 Tests run: 16, Failures: 0, Errors: 0, Skipped: 0, Time elapsed: 3.39 sec - in org.openmrs.api.PatientServiceAllergyTest
21-Sep-2017 19:51:43 Running org.openmrs.api.VisitServiceTest
21-Sep-2017 19:51:48 ERROR - AbstractBatchImpl.clearBatch(183) |2017-09-21 19:51:48,393| HHH000352: Unable to release batch statement...
21-Sep-2017 19:51:49 Tests run: 60, Failures: 0, Errors: 0, Skipped: 0, Time elapsed: 5.62 sec - in org.openmrs.api.VisitServiceTest
21-Sep-2017 19:51:49 Running org.openmrs.api.NoteServiceTest
21-Sep-2017 19:51:49 Tests run: 1, Failures: 0, Errors: 0, Skipped: 1, Time elapsed: 0 sec - in org.openmrs.api.NoteServiceTest
21-Sep-2017 19:51:49 Running org.openmrs.api.AdministrationServiceTest
21-Sep-2017 19:51:54 Tests run: 53, Failures: 0, Errors: 0, Skipped: 4, Time elapsed: 4.787 sec - in org.openmrs.api.AdministrationServiceTest
21-Sep-2017 19:51:54 Running org.openmrs.api.context.ContextTest
21-Sep-2017 19:51:56 Tests run: 16, Failures: 0, Errors: 0, Skipped: 0, Time elapsed: 2.056 sec - in org.openmrs.api.context.ContextTest
21-Sep-2017 19:51:56 Running org.openmrs.api.context.ContextWithModuleTest
21-Sep-2017 19:51:57 Tests run: 1, Failures: 0, Errors: 0, Skipped: 0, Time elapsed: 0.934 sec - in org.openmrs.api.context.ContextWithModuleTest
21-Sep-2017 19:51:57 Running org.openmrs.api.context.DaemonTest
21-Sep-2017 19:51:59 Tests run: 7, Failures: 0, Errors: 0, Skipped: 0, Time elapsed: 1.776 sec - in org.openmrs.api.context.DaemonTest
21-Sep-2017 19:51:59 Running org.openmrs.api.OpenmrsServiceTest
21-Sep-2017 19:51:59 Tests run: 1, Failures: 0, Errors: 0, Skipped: 1, Time elapsed: 0.003 sec - in org.openmrs.api.OpenmrsServiceTest
21-Sep-2017 19:51:59 Running org.openmrs.api.LocationServiceTest
21-Sep-2017 19:52:06 Tests run: 70, Failures: 0, Errors: 0, Skipped: 0, Time elapsed: 7.626 sec - in org.openmrs.api.LocationServiceTest
21-Sep-2017 19:52:06 Running org.openmrs.api.ProgramWorkflowServiceUnitTest
21-Sep-2017 19:52:06 Tests run: 3, Failures: 0, Errors: 0, Skipped: 0, Time elapsed: 0.228 sec - in org.openmrs.api.ProgramWorkflowServiceUnitTest
21-Sep-2017 19:52:06 Running org.openmrs.api.DatatypeServiceTest
21-Sep-2017 19:52:08 Tests run: 2, Failures: 0, Errors: 0, Skipped: 0, Time elapsed: 1.11 sec - in org.openmrs.api.DatatypeServiceTest
21-Sep-2017 19:52:08 Running org.openmrs.api.ConceptServiceTest
21-Sep-2017 19:54:23 Tests run: 236, Failures: 0, Errors: 0, Skipped: 1, Time elapsed: 135.872 sec - in org.openmrs.api.ConceptServiceTest
21-Sep-2017 19:54:23 Running org.openmrs.api.EncounterServiceTest
21-Sep-2017 19:54:26 ERROR - ImageHandler.getObs(79) |2017-09-21 19:54:26,573| Trying to read file: /home/bamboo-agent-1/bamboo-agent/.agent_tmp/TRUNK-OC2-JOB1/appdir-for-unit-tests-2443382190340229166/complex_obs/file1.jpg
21-Sep-2017 19:54:26 javax.imageio.IIOException: Can't read input file!
21-Sep-2017 19:54:26         at javax.imageio.ImageIO.read(ImageIO.java:1301)
21-Sep-2017 19:54:26         at org.openmrs.obs.handler.ImageHandler.getObs(ImageHandler.java:76)
21-Sep-2017 19:54:26         at org.openmrs.api.impl.ObsServiceImpl.getObs(ObsServiceImpl.java:254)
21-Sep-2017 19:54:26         at sun.reflect.GeneratedMethodAccessor669.invoke(Unknown Source)
21-Sep-2017 19:54:26         at sun.reflect.DelegatingMethodAccessorImpl.invoke(DelegatingMethodAccessorImpl.java:43)
21-Sep-2017 19:54:26         at java.lang.reflect.Method.invoke(Method.java:498)
21-Sep-2017 19:54:26         at org.springframework.aop.support.AopUtils.invokeJoinpointUsingReflection(AopUtils.java:317)
21-Sep-2017 19:54:26         at org.springframework.aop.framework.ReflectiveMethodInvocation.invokeJoinpoint(ReflectiveMethodInvocation.java:190)
21-Sep-2017 19:54:26         at org.springframework.aop.framework.ReflectiveMethodInvocation.proceed(ReflectiveMethodInvocation.java:157)
21-Sep-2017 19:54:26         at org.springframework.transaction.interceptor.TransactionInterceptor$1.proceedWithInvocation(TransactionInterceptor.java:99)
21-Sep-2017 19:54:26         at org.springframework.transaction.interceptor.TransactionAspectSupport.invokeWithinTransaction(TransactionAspectSupport.java:281)
21-Sep-2017 19:54:26         at org.springframework.transaction.interceptor.TransactionInterceptor.invoke(TransactionInterceptor.java:96)
21-Sep-2017 19:54:26         at org.springframework.aop.framework.ReflectiveMethodInvocation.proceed(ReflectiveMethodInvocation.java:179)
21-Sep-2017 19:54:26         at org.springframework.aop.framework.JdkDynamicAopProxy.invoke(JdkDynamicAopProxy.java:207)
21-Sep-2017 19:54:26         at com.sun.proxy.$Proxy73.getObs(Unknown Source)
21-Sep-2017 19:54:26         at sun.reflect.GeneratedMethodAccessor669.invoke(Unknown Source)
21-Sep-2017 19:54:26         at sun.reflect.DelegatingMethodAccessorImpl.invoke(DelegatingMethodAccessorImpl.java:43)
21-Sep-2017 19:54:26         at java.lang.reflect.Method.invoke(Method.java:498)
21-Sep-2017 19:54:26         at org.springframework.aop.support.AopUtils.invokeJoinpointUsingReflection(AopUtils.java:317)
21-Sep-2017 19:54:26         at org.springframework.aop.framework.ReflectiveMethodInvocation.invokeJoinpoint(ReflectiveMethodInvocation.java:190)
21-Sep-2017 19:54:26         at org.springframework.aop.framework.ReflectiveMethodInvocation.proceed(ReflectiveMethodInvocation.java:157)
21-Sep-2017 19:54:26         at org.openmrs.aop.LoggingAdvice.invoke(LoggingAdvice.java:121)
21-Sep-2017 19:54:26         at org.springframework.aop.framework.ReflectiveMethodInvocation.proceed(ReflectiveMethodInvocation.java:179)
21-Sep-2017 19:54:26         at org.springframework.aop.framework.adapter.MethodBeforeAdviceInterceptor.invoke(MethodBeforeAdviceInterceptor.java:52)
21-Sep-2017 19:54:26         at org.springframework.aop.framework.ReflectiveMethodInvocation.proceed(ReflectiveMethodInvocation.java:179)
21-Sep-2017 19:54:26         at org.springframework.aop.framework.adapter.MethodBeforeAdviceInterceptor.invoke(MethodBeforeAdviceInterceptor.java:52)
21-Sep-2017 19:54:26         at org.springframework.aop.framework.ReflectiveMethodInvocation.proceed(ReflectiveMethodInvocation.java:179)
21-Sep-2017 19:54:26         at org.springframework.aop.framework.JdkDynamicAopProxy.invoke(JdkDynamicAopProxy.java:207)
21-Sep-2017 19:54:26         at com.sun.proxy.$Proxy74.getObs(Unknown Source)
21-Sep-2017 19:54:26         at org.openmrs.api.impl.EncounterServiceImpl.saveEncounter(EncounterServiceImpl.java:214)
21-Sep-2017 19:54:26         at sun.reflect.GeneratedMethodAccessor1066.invoke(Unknown Source)
21-Sep-2017 19:54:26         at sun.reflect.DelegatingMethodAccessorImpl.invoke(DelegatingMethodAccessorImpl.java:43)
21-Sep-2017 19:54:26         at java.lang.reflect.Method.invoke(Method.java:498)
21-Sep-2017 19:54:26         at org.springframework.aop.support.AopUtils.invokeJoinpointUsingReflection(AopUtils.java:317)
21-Sep-2017 19:54:26         at org.springframework.aop.framework.ReflectiveMethodInvocation.invokeJoinpoint(ReflectiveMethodInvocation.java:190)
21-Sep-2017 19:54:26         at org.springframework.aop.framework.ReflectiveMethodInvocation.proceed(ReflectiveMethodInvocation.java:157)
21-Sep-2017 19:54:26         at org.springframework.transaction.interceptor.TransactionInterceptor$1.proceedWithInvocation(TransactionInterceptor.java:99)
21-Sep-2017 19:54:26         at org.springframework.transaction.interceptor.TransactionAspectSupport.invokeWithinTransaction(TransactionAspectSupport.java:281)
21-Sep-2017 19:54:26         at org.springframework.transaction.interceptor.TransactionInterceptor.invoke(TransactionInterceptor.java:96)
21-Sep-2017 19:54:26         at org.springframework.aop.framework.ReflectiveMethodInvocation.proceed(ReflectiveMethodInvocation.java:179)
21-Sep-2017 19:54:26         at org.springframework.aop.framework.JdkDynamicAopProxy.invoke(JdkDynamicAopProxy.java:207)
21-Sep-2017 19:54:26         at com.sun.proxy.$Proxy75.saveEncounter(Unknown Source)
21-Sep-2017 19:54:26         at sun.reflect.GeneratedMethodAccessor1066.invoke(Unknown Source)
21-Sep-2017 19:54:26         at sun.reflect.DelegatingMethodAccessorImpl.invoke(DelegatingMethodAccessorImpl.java:43)
21-Sep-2017 19:54:26         at java.lang.reflect.Method.invoke(Method.java:498)
21-Sep-2017 19:54:26         at org.springframework.aop.support.AopUtils.invokeJoinpointUsingReflection(AopUtils.java:317)
21-Sep-2017 19:54:26         at org.springframework.aop.framework.ReflectiveMethodInvocation.invokeJoinpoint(ReflectiveMethodInvocation.java:190)
21-Sep-2017 19:54:26         at org.springframework.aop.framework.ReflectiveMethodInvocation.proceed(ReflectiveMethodInvocation.java:157)
21-Sep-2017 19:54:26         at org.openmrs.aop.LoggingAdvice.invoke(LoggingAdvice.java:121)
21-Sep-2017 19:54:26         at org.springframework.aop.framework.ReflectiveMethodInvocation.proceed(ReflectiveMethodInvocation.java:179)
21-Sep-2017 19:54:26         at org.springframework.aop.framework.adapter.MethodBeforeAdviceInterceptor.invoke(MethodBeforeAdviceInterceptor.java:52)
21-Sep-2017 19:54:26         at org.springframework.aop.framework.ReflectiveMethodInvocation.proceed(ReflectiveMethodInvocation.java:179)
21-Sep-2017 19:54:26         at org.springframework.aop.framework.adapter.MethodBeforeAdviceInterceptor.invoke(MethodBeforeAdviceInterceptor.java:52)
21-Sep-2017 19:54:26         at org.springframework.aop.framework.ReflectiveMethodInvocation.proceed(ReflectiveMethodInvocation.java:179)
21-Sep-2017 19:54:26         at org.springframework.aop.framework.JdkDynamicAopProxy.invoke(JdkDynamicAopProxy.java:207)
21-Sep-2017 19:54:26         at com.sun.proxy.$Proxy76.saveEncounter(Unknown Source)
21-Sep-2017 19:54:26         at org.openmrs.api.EncounterServiceTest.saveEncounter_shouldSaveEncounterWithComplexObs(EncounterServiceTest.java:385)
21-Sep-2017 19:54:26         at sun.reflect.NativeMethodAccessorImpl.invoke0(Native Method)
21-Sep-2017 19:54:26         at sun.reflect.NativeMethodAccessorImpl.invoke(NativeMethodAccessorImpl.java:62)
21-Sep-2017 19:54:26         at sun.reflect.DelegatingMethodAccessorImpl.invoke(DelegatingMethodAccessorImpl.java:43)
21-Sep-2017 19:54:26         at java.lang.reflect.Method.invoke(Method.java:498)
21-Sep-2017 19:54:26         at org.junit.runners.model.FrameworkMethod$1.runReflectiveCall(FrameworkMethod.java:47)
21-Sep-2017 19:54:26         at org.junit.internal.runners.model.ReflectiveCallable.run(ReflectiveCallable.java:12)
21-Sep-2017 19:54:26         at org.junit.runners.model.FrameworkMethod.invokeExplosively(FrameworkMethod.java:44)
21-Sep-2017 19:54:26         at org.junit.internal.runners.statements.InvokeMethod.evaluate(InvokeMethod.java:17)
21-Sep-2017 19:54:26         at org.junit.internal.runners.statements.RunBefores.evaluate(RunBefores.java:26)
21-Sep-2017 19:54:26         at org.springframework.test.context.junit4.statements.RunBeforeTestMethodCallbacks.evaluate(RunBeforeTestMethodCallbacks.java:73)
21-Sep-2017 19:54:26         at org.junit.internal.runners.statements.RunAfters.evaluate(RunAfters.java:27)
21-Sep-2017 19:54:26         at org.springframework.test.context.junit4.statements.RunAfterTestMethodCallbacks.evaluate(RunAfterTestMethodCallbacks.java:82)
21-Sep-2017 19:54:26         at org.springframework.test.context.junit4.statements.SpringRepeat.evaluate(SpringRepeat.java:73)
21-Sep-2017 19:54:26         at org.junit.runners.ParentRunner.runLeaf(ParentRunner.java:271)
21-Sep-2017 19:54:26         at org.springframework.test.context.junit4.SpringJUnit4ClassRunner.runChild(SpringJUnit4ClassRunner.java:217)
21-Sep-2017 19:54:26         at org.springframework.test.context.junit4.SpringJUnit4ClassRunner.runChild(SpringJUnit4ClassRunner.java:83)
21-Sep-2017 19:54:26         at org.junit.runners.ParentRunner$3.run(ParentRunner.java:238)
21-Sep-2017 19:54:26         at org.junit.runners.ParentRunner$1.schedule(ParentRunner.java:63)
21-Sep-2017 19:54:26         at org.junit.runners.ParentRunner.runChildren(ParentRunner.java:236)
21-Sep-2017 19:54:26         at org.junit.runners.ParentRunner.access$000(ParentRunner.java:53)
21-Sep-2017 19:54:26         at org.junit.runners.ParentRunner$2.evaluate(ParentRunner.java:229)
21-Sep-2017 19:54:26         at org.springframework.test.context.junit4.statements.RunBeforeTestClassCallbacks.evaluate(RunBeforeTestClassCallbacks.java:61)
21-Sep-2017 19:54:26         at org.junit.internal.runners.statements.RunAfters.evaluate(RunAfters.java:27)
21-Sep-2017 19:54:26         at org.springframework.test.context.junit4.statements.RunAfterTestClassCallbacks.evaluate(RunAfterTestClassCallbacks.java:68)
21-Sep-2017 19:54:26         at org.junit.runners.ParentRunner.run(ParentRunner.java:309)
21-Sep-2017 19:54:26         at org.springframework.test.context.junit4.SpringJUnit4ClassRunner.run(SpringJUnit4ClassRunner.java:163)
21-Sep-2017 19:54:26         at org.apache.maven.surefire.junit4.JUnit4Provider.execute(JUnit4Provider.java:283)
21-Sep-2017 19:54:26         at org.apache.maven.surefire.junit4.JUnit4Provider.executeWithRerun(JUnit4Provider.java:173)
21-Sep-2017 19:54:26         at org.apache.maven.surefire.junit4.JUnit4Provider.executeTestSet(JUnit4Provider.java:153)
21-Sep-2017 19:54:26         at org.apache.maven.surefire.junit4.JUnit4Provider.invoke(JUnit4Provider.java:128)
21-Sep-2017 19:54:26         at org.apache.maven.surefire.booter.ForkedBooter.invokeProviderInSameClassLoader(ForkedBooter.java:203)
21-Sep-2017 19:54:26         at org.apache.maven.surefire.booter.ForkedBooter.runSuitesInProcess(ForkedBooter.java:155)
21-Sep-2017 19:54:26         at org.apache.maven.surefire.booter.ForkedBooter.main(ForkedBooter.java:103)
21-Sep-2017 19:54:26 ERROR - ImageHandler.getObs(96) |2017-09-21 19:54:26,578| Image /home/bamboo-agent-1/bamboo-agent/.agent_tmp/TRUNK-OC2-JOB1/appdir-for-unit-tests-2443382190340229166/complex_obs/file1.jpg was not found
21-Sep-2017 19:54:26 java.io.FileNotFoundException: /home/bamboo-agent-1/bamboo-agent/.agent_tmp/TRUNK-OC2-JOB1/appdir-for-unit-tests-2443382190340229166/complex_obs/file1.jpg (No such file or directory)
21-Sep-2017 19:54:26         at java.io.RandomAccessFile.open0(Native Method)
21-Sep-2017 19:54:26         at java.io.RandomAccessFile.open(RandomAccessFile.java:316)
21-Sep-2017 19:54:26         at java.io.RandomAccessFile.<init>(RandomAccessFile.java:243)
21-Sep-2017 19:54:26         at javax.imageio.stream.FileImageInputStream.<init>(FileImageInputStream.java:73)
21-Sep-2017 19:54:26         at org.openmrs.obs.handler.ImageHandler.getObs(ImageHandler.java:86)
21-Sep-2017 19:54:26         at org.openmrs.api.impl.ObsServiceImpl.getObs(ObsServiceImpl.java:254)
21-Sep-2017 19:54:26         at sun.reflect.GeneratedMethodAccessor669.invoke(Unknown Source)
21-Sep-2017 19:54:26         at sun.reflect.DelegatingMethodAccessorImpl.invoke(DelegatingMethodAccessorImpl.java:43)
21-Sep-2017 19:54:26         at java.lang.reflect.Method.invoke(Method.java:498)
21-Sep-2017 19:54:26         at org.springframework.aop.support.AopUtils.invokeJoinpointUsingReflection(AopUtils.java:317)
21-Sep-2017 19:54:26         at org.springframework.aop.framework.ReflectiveMethodInvocation.invokeJoinpoint(ReflectiveMethodInvocation.java:190)
21-Sep-2017 19:54:26         at org.springframework.aop.framework.ReflectiveMethodInvocation.proceed(ReflectiveMethodInvocation.java:157)
21-Sep-2017 19:54:26         at org.springframework.transaction.interceptor.TransactionInterceptor$1.proceedWithInvocation(TransactionInterceptor.java:99)
21-Sep-2017 19:54:26         at org.springframework.transaction.interceptor.TransactionAspectSupport.invokeWithinTransaction(TransactionAspectSupport.java:281)
21-Sep-2017 19:54:26         at org.springframework.transaction.interceptor.TransactionInterceptor.invoke(TransactionInterceptor.java:96)
21-Sep-2017 19:54:26         at org.springframework.aop.framework.ReflectiveMethodInvocation.proceed(ReflectiveMethodInvocation.java:179)
21-Sep-2017 19:54:26         at org.springframework.aop.framework.JdkDynamicAopProxy.invoke(JdkDynamicAopProxy.java:207)
21-Sep-2017 19:54:26         at com.sun.proxy.$Proxy73.getObs(Unknown Source)
21-Sep-2017 19:54:26         at sun.reflect.GeneratedMethodAccessor669.invoke(Unknown Source)
21-Sep-2017 19:54:26         at sun.reflect.DelegatingMethodAccessorImpl.invoke(DelegatingMethodAccessorImpl.java:43)
21-Sep-2017 19:54:26         at java.lang.reflect.Method.invoke(Method.java:498)
21-Sep-2017 19:54:26         at org.springframework.aop.support.AopUtils.invokeJoinpointUsingReflection(AopUtils.java:317)
21-Sep-2017 19:54:26         at org.springframework.aop.framework.ReflectiveMethodInvocation.invokeJoinpoint(ReflectiveMethodInvocation.java:190)
21-Sep-2017 19:54:26         at org.springframework.aop.framework.ReflectiveMethodInvocation.proceed(ReflectiveMethodInvocation.java:157)
21-Sep-2017 19:54:26         at org.openmrs.aop.LoggingAdvice.invoke(LoggingAdvice.java:121)
21-Sep-2017 19:54:26         at org.springframework.aop.framework.ReflectiveMethodInvocation.proceed(ReflectiveMethodInvocation.java:179)
21-Sep-2017 19:54:26         at org.springframework.aop.framework.adapter.MethodBeforeAdviceInterceptor.invoke(MethodBeforeAdviceInterceptor.java:52)
21-Sep-2017 19:54:26         at org.springframework.aop.framework.ReflectiveMethodInvocation.proceed(ReflectiveMethodInvocation.java:179)
21-Sep-2017 19:54:26         at org.springframework.aop.framework.adapter.MethodBeforeAdviceInterceptor.invoke(MethodBeforeAdviceInterceptor.java:52)
21-Sep-2017 19:54:26         at org.springframework.aop.framework.ReflectiveMethodInvocation.proceed(ReflectiveMethodInvocation.java:179)
21-Sep-2017 19:54:26         at org.springframework.aop.framework.JdkDynamicAopProxy.invoke(JdkDynamicAopProxy.java:207)
21-Sep-2017 19:54:26         at com.sun.proxy.$Proxy74.getObs(Unknown Source)
21-Sep-2017 19:54:26         at org.openmrs.api.impl.EncounterServiceImpl.saveEncounter(EncounterServiceImpl.java:214)
21-Sep-2017 19:54:26         at sun.reflect.GeneratedMethodAccessor1066.invoke(Unknown Source)
21-Sep-2017 19:54:26         at sun.reflect.DelegatingMethodAccessorImpl.invoke(DelegatingMethodAccessorImpl.java:43)
21-Sep-2017 19:54:26         at java.lang.reflect.Method.invoke(Method.java:498)
21-Sep-2017 19:54:26         at org.springframework.aop.support.AopUtils.invokeJoinpointUsingReflection(AopUtils.java:317)
21-Sep-2017 19:54:26         at org.springframework.aop.framework.ReflectiveMethodInvocation.invokeJoinpoint(ReflectiveMethodInvocation.java:190)
21-Sep-2017 19:54:26         at org.springframework.aop.framework.ReflectiveMethodInvocation.proceed(ReflectiveMethodInvocation.java:157)
21-Sep-2017 19:54:26         at org.springframework.transaction.interceptor.TransactionInterceptor$1.proceedWithInvocation(TransactionInterceptor.java:99)
21-Sep-2017 19:54:26         at org.springframework.transaction.interceptor.TransactionAspectSupport.invokeWithinTransaction(TransactionAspectSupport.java:281)
21-Sep-2017 19:54:26         at org.springframework.transaction.interceptor.TransactionInterceptor.invoke(TransactionInterceptor.java:96)
21-Sep-2017 19:54:26         at org.springframework.aop.framework.ReflectiveMethodInvocation.proceed(ReflectiveMethodInvocation.java:179)
21-Sep-2017 19:54:26         at org.springframework.aop.framework.JdkDynamicAopProxy.invoke(JdkDynamicAopProxy.java:207)
21-Sep-2017 19:54:26         at com.sun.proxy.$Proxy75.saveEncounter(Unknown Source)
21-Sep-2017 19:54:26         at sun.reflect.GeneratedMethodAccessor1066.invoke(Unknown Source)
21-Sep-2017 19:54:26         at sun.reflect.DelegatingMethodAccessorImpl.invoke(DelegatingMethodAccessorImpl.java:43)
21-Sep-2017 19:54:26         at java.lang.reflect.Method.invoke(Method.java:498)
21-Sep-2017 19:54:26         at org.springframework.aop.support.AopUtils.invokeJoinpointUsingReflection(AopUtils.java:317)
21-Sep-2017 19:54:26         at org.springframework.aop.framework.ReflectiveMethodInvocation.invokeJoinpoint(ReflectiveMethodInvocation.java:190)
21-Sep-2017 19:54:26         at org.springframework.aop.framework.ReflectiveMethodInvocation.proceed(ReflectiveMethodInvocation.java:157)
21-Sep-2017 19:54:26         at org.openmrs.aop.LoggingAdvice.invoke(LoggingAdvice.java:121)
21-Sep-2017 19:54:26         at org.springframework.aop.framework.ReflectiveMethodInvocation.proceed(ReflectiveMethodInvocation.java:179)
21-Sep-2017 19:54:26         at org.springframework.aop.framework.adapter.MethodBeforeAdviceInterceptor.invoke(MethodBeforeAdviceInterceptor.java:52)
21-Sep-2017 19:54:26         at org.springframework.aop.framework.ReflectiveMethodInvocation.proceed(ReflectiveMethodInvocation.java:179)
21-Sep-2017 19:54:26         at org.springframework.aop.framework.adapter.MethodBeforeAdviceInterceptor.invoke(MethodBeforeAdviceInterceptor.java:52)
21-Sep-2017 19:54:26         at org.springframework.aop.framework.ReflectiveMethodInvocation.proceed(ReflectiveMethodInvocation.java:179)
21-Sep-2017 19:54:26         at org.springframework.aop.framework.JdkDynamicAopProxy.invoke(JdkDynamicAopProxy.java:207)
21-Sep-2017 19:54:26         at com.sun.proxy.$Proxy76.saveEncounter(Unknown Source)
21-Sep-2017 19:54:26         at org.openmrs.api.EncounterServiceTest.saveEncounter_shouldSaveEncounterWithComplexObs(EncounterServiceTest.java:385)
21-Sep-2017 19:54:26         at sun.reflect.NativeMethodAccessorImpl.invoke0(Native Method)
21-Sep-2017 19:54:26         at sun.reflect.NativeMethodAccessorImpl.invoke(NativeMethodAccessorImpl.java:62)
21-Sep-2017 19:54:26         at sun.reflect.DelegatingMethodAccessorImpl.invoke(DelegatingMethodAccessorImpl.java:43)
21-Sep-2017 19:54:26         at java.lang.reflect.Method.invoke(Method.java:498)
21-Sep-2017 19:54:26         at org.junit.runners.model.FrameworkMethod$1.runReflectiveCall(FrameworkMethod.java:47)
21-Sep-2017 19:54:26         at org.junit.internal.runners.model.ReflectiveCallable.run(ReflectiveCallable.java:12)
21-Sep-2017 19:54:26         at org.junit.runners.model.FrameworkMethod.invokeExplosively(FrameworkMethod.java:44)
21-Sep-2017 19:54:26         at org.junit.internal.runners.statements.InvokeMethod.evaluate(InvokeMethod.java:17)
21-Sep-2017 19:54:26         at org.junit.internal.runners.statements.RunBefores.evaluate(RunBefores.java:26)
21-Sep-2017 19:54:26         at org.springframework.test.context.junit4.statements.RunBeforeTestMethodCallbacks.evaluate(RunBeforeTestMethodCallbacks.java:73)
21-Sep-2017 19:54:26         at org.junit.internal.runners.statements.RunAfters.evaluate(RunAfters.java:27)
21-Sep-2017 19:54:26         at org.springframework.test.context.junit4.statements.RunAfterTestMethodCallbacks.evaluate(RunAfterTestMethodCallbacks.java:82)
21-Sep-2017 19:54:26         at org.springframework.test.context.junit4.statements.SpringRepeat.evaluate(SpringRepeat.java:73)
21-Sep-2017 19:54:26         at org.junit.runners.ParentRunner.runLeaf(ParentRunner.java:271)
21-Sep-2017 19:54:26         at org.springframework.test.context.junit4.SpringJUnit4ClassRunner.runChild(SpringJUnit4ClassRunner.java:217)
21-Sep-2017 19:54:26         at org.springframework.test.context.junit4.SpringJUnit4ClassRunner.runChild(SpringJUnit4ClassRunner.java:83)
21-Sep-2017 19:54:26         at org.junit.runners.ParentRunner$3.run(ParentRunner.java:238)
21-Sep-2017 19:54:26         at org.junit.runners.ParentRunner$1.schedule(ParentRunner.java:63)
21-Sep-2017 19:54:26         at org.junit.runners.ParentRunner.runChildren(ParentRunner.java:236)
21-Sep-2017 19:54:26         at org.junit.runners.ParentRunner.access$000(ParentRunner.java:53)
21-Sep-2017 19:54:26         at org.junit.runners.ParentRunner$2.evaluate(ParentRunner.java:229)
21-Sep-2017 19:54:26         at org.springframework.test.context.junit4.statements.RunBeforeTestClassCallbacks.evaluate(RunBeforeTestClassCallbacks.java:61)
21-Sep-2017 19:54:26         at org.junit.internal.runners.statements.RunAfters.evaluate(RunAfters.java:27)
21-Sep-2017 19:54:26         at org.springframework.test.context.junit4.statements.RunAfterTestClassCallbacks.evaluate(RunAfterTestClassCallbacks.java:68)
21-Sep-2017 19:54:26         at org.junit.runners.ParentRunner.run(ParentRunner.java:309)
21-Sep-2017 19:54:26         at org.springframework.test.context.junit4.SpringJUnit4ClassRunner.run(SpringJUnit4ClassRunner.java:163)
21-Sep-2017 19:54:26         at org.apache.maven.surefire.junit4.JUnit4Provider.execute(JUnit4Provider.java:283)
21-Sep-2017 19:54:26         at org.apache.maven.surefire.junit4.JUnit4Provider.executeWithRerun(JUnit4Provider.java:173)
21-Sep-2017 19:54:26         at org.apache.maven.surefire.junit4.JUnit4Provider.executeTestSet(JUnit4Provider.java:153)
21-Sep-2017 19:54:26         at org.apache.maven.surefire.junit4.JUnit4Provider.invoke(JUnit4Provider.java:128)
21-Sep-2017 19:54:26         at org.apache.maven.surefire.booter.ForkedBooter.invokeProviderInSameClassLoader(ForkedBooter.java:203)
21-Sep-2017 19:54:26         at org.apache.maven.surefire.booter.ForkedBooter.runSuitesInProcess(ForkedBooter.java:155)
21-Sep-2017 19:54:26         at org.apache.maven.surefire.booter.ForkedBooter.main(ForkedBooter.java:103)
21-Sep-2017 19:54:42 Tests run: 141, Failures: 0, Errors: 0, Skipped: 2, Time elapsed: 18.323 sec - in org.openmrs.api.EncounterServiceTest
21-Sep-2017 19:54:42 Running org.openmrs.api.PersonServiceTest
21-Sep-2017 19:54:52 Tests run: 119, Failures: 0, Errors: 0, Skipped: 0, Time elapsed: 10.558 sec - in org.openmrs.api.PersonServiceTest
21-Sep-2017 19:54:52 Running org.openmrs.OrderTest
21-Sep-2017 19:54:57 Tests run: 56, Failures: 0, Errors: 0, Skipped: 0, Time elapsed: 4.897 sec - in org.openmrs.OrderTest
21-Sep-2017 19:54:57 Running org.openmrs.hl7.HL7UtilTest
21-Sep-2017 19:54:58 Tests run: 5, Failures: 0, Errors: 0, Skipped: 0, Time elapsed: 0.331 sec - in org.openmrs.hl7.HL7UtilTest
21-Sep-2017 19:54:58 Running org.openmrs.hl7.handler.ORUR01HandlerTest
21-Sep-2017 19:55:03 Tests run: 37, Failures: 0, Errors: 0, Skipped: 0, Time elapsed: 5.748 sec - in org.openmrs.hl7.handler.ORUR01HandlerTest
21-Sep-2017 19:55:03 Running org.openmrs.hl7.HL7ServiceTest
21-Sep-2017 19:55:05 ERROR - HL7ServiceImpl.setFatalError(742) |2017-09-21 19:55:05,432| ca.uhn.hl7v2.HL7Exception: HL7 encoding not supported
21-Sep-2017 19:55:07 Tests run: 26, Failures: 0, Errors: 0, Skipped: 2, Time elapsed: 3.562 sec - in org.openmrs.hl7.HL7ServiceTest
21-Sep-2017 19:55:07 Running org.openmrs.BaseCustomizableMetadataTest
21-Sep-2017 19:55:08 Tests run: 2, Failures: 0, Errors: 0, Skipped: 0, Time elapsed: 0.84 sec - in org.openmrs.BaseCustomizableMetadataTest
21-Sep-2017 19:55:08 Running org.openmrs.propertyeditor.PrivilegeEditorTest
21-Sep-2017 19:55:09 Tests run: 2, Failures: 0, Errors: 0, Skipped: 0, Time elapsed: 0.889 sec - in org.openmrs.propertyeditor.PrivilegeEditorTest
21-Sep-2017 19:55:09 Running org.openmrs.propertyeditor.ConceptEditorTest
21-Sep-2017 19:55:09 Tests run: 2, Failures: 0, Errors: 0, Skipped: 0, Time elapsed: 0.779 sec - in org.openmrs.propertyeditor.ConceptEditorTest
21-Sep-2017 19:55:09 Running org.openmrs.propertyeditor.ConceptDatatypeEditorTest
21-Sep-2017 19:55:10 Tests run: 2, Failures: 0, Errors: 0, Skipped: 0, Time elapsed: 0.733 sec - in org.openmrs.propertyeditor.ConceptDatatypeEditorTest
21-Sep-2017 19:55:10 Running org.openmrs.propertyeditor.DrugEditorTest
21-Sep-2017 19:55:12 Tests run: 2, Failures: 0, Errors: 0, Skipped: 0, Time elapsed: 1.908 sec - in org.openmrs.propertyeditor.DrugEditorTest
21-Sep-2017 19:55:12 Running org.openmrs.propertyeditor.ConceptAnswersEditorTest
21-Sep-2017 19:55:13 Tests run: 1, Failures: 0, Errors: 0, Skipped: 0, Time elapsed: 0.877 sec - in org.openmrs.propertyeditor.ConceptAnswersEditorTest
21-Sep-2017 19:55:13 Running org.openmrs.propertyeditor.PersonAttributeEditorTest
21-Sep-2017 19:55:14 Tests run: 2, Failures: 0, Errors: 0, Skipped: 0, Time elapsed: 1.107 sec - in org.openmrs.propertyeditor.PersonAttributeEditorTest
21-Sep-2017 19:55:14 Running org.openmrs.propertyeditor.ConceptSourceEditorTest
21-Sep-2017 19:55:15 Tests run: 2, Failures: 0, Errors: 0, Skipped: 0, Time elapsed: 1.155 sec - in org.openmrs.propertyeditor.ConceptSourceEditorTest
21-Sep-2017 19:55:15 Running org.openmrs.propertyeditor.FormEditorTest
21-Sep-2017 19:55:16 Tests run: 2, Failures: 0, Errors: 0, Skipped: 0, Time elapsed: 1.116 sec - in org.openmrs.propertyeditor.FormEditorTest
21-Sep-2017 19:55:16 Running org.openmrs.propertyeditor.OrderEditorTest
21-Sep-2017 19:55:19 Tests run: 2, Failures: 0, Errors: 0, Skipped: 0, Time elapsed: 2.579 sec - in org.openmrs.propertyeditor.OrderEditorTest
21-Sep-2017 19:55:19 Running org.openmrs.propertyeditor.LocationTagEditorTest
21-Sep-2017 19:55:20 Tests run: 2, Failures: 0, Errors: 0, Skipped: 0, Time elapsed: 1.014 sec - in org.openmrs.propertyeditor.LocationTagEditorTest
21-Sep-2017 19:55:20 Running org.openmrs.propertyeditor.DateOrDatetimeEditorTest
21-Sep-2017 19:55:20 Tests run: 6, Failures: 0, Errors: 0, Skipped: 0, Time elapsed: 0.446 sec - in org.openmrs.propertyeditor.DateOrDatetimeEditorTest
21-Sep-2017 19:55:20 Running org.openmrs.propertyeditor.ProviderEditorTest
21-Sep-2017 19:55:21 Tests run: 2, Failures: 0, Errors: 0, Skipped: 0, Time elapsed: 1.049 sec - in org.openmrs.propertyeditor.ProviderEditorTest
21-Sep-2017 19:55:21 Running org.openmrs.propertyeditor.VisitTypeEditorTest
21-Sep-2017 19:55:23 Tests run: 2, Failures: 0, Errors: 0, Skipped: 0, Time elapsed: 1.067 sec - in org.openmrs.propertyeditor.VisitTypeEditorTest
21-Sep-2017 19:55:23 Running org.openmrs.propertyeditor.ConceptAnswerEditorTest
21-Sep-2017 19:55:24 Tests run: 2, Failures: 0, Errors: 0, Skipped: 0, Time elapsed: 1.729 sec - in org.openmrs.propertyeditor.ConceptAnswerEditorTest
21-Sep-2017 19:55:24 Running org.openmrs.propertyeditor.PersonEditorTest
21-Sep-2017 19:55:25 Tests run: 2, Failures: 0, Errors: 0, Skipped: 0, Time elapsed: 1.092 sec - in org.openmrs.propertyeditor.PersonEditorTest
21-Sep-2017 19:55:25 Running org.openmrs.propertyeditor.ConceptClassEditorTest
21-Sep-2017 19:55:26 Tests run: 2, Failures: 0, Errors: 0, Skipped: 0, Time elapsed: 1.14 sec - in org.openmrs.propertyeditor.ConceptClassEditorTest
21-Sep-2017 19:55:26 Running org.openmrs.propertyeditor.ProgramEditorTest
21-Sep-2017 19:55:28 Tests run: 4, Failures: 0, Errors: 0, Skipped: 0, Time elapsed: 1.211 sec - in org.openmrs.propertyeditor.ProgramEditorTest
21-Sep-2017 19:55:28 Running org.openmrs.propertyeditor.PatientIdentifierTypeEditorTest
21-Sep-2017 19:55:29 Tests run: 2, Failures: 0, Errors: 0, Skipped: 0, Time elapsed: 0.997 sec - in org.openmrs.propertyeditor.PatientIdentifierTypeEditorTest
21-Sep-2017 19:55:29 Running org.openmrs.propertyeditor.WorkflowCollectionEditorTest
21-Sep-2017 19:55:30 Tests run: 1, Failures: 0, Errors: 0, Skipped: 0, Time elapsed: 1.257 sec - in org.openmrs.propertyeditor.WorkflowCollectionEditorTest
21-Sep-2017 19:55:30 Running org.openmrs.propertyeditor.PersonAttributeTypeEditorTest
21-Sep-2017 19:55:31 Tests run: 2, Failures: 0, Errors: 0, Skipped: 0, Time elapsed: 1.033 sec - in org.openmrs.propertyeditor.PersonAttributeTypeEditorTest
21-Sep-2017 19:55:31 Running org.openmrs.propertyeditor.ConceptNameEditorTest
21-Sep-2017 19:55:32 Tests run: 2, Failures: 0, Errors: 0, Skipped: 0, Time elapsed: 0.91 sec - in org.openmrs.propertyeditor.ConceptNameEditorTest
21-Sep-2017 19:55:32 Running org.openmrs.propertyeditor.PatientEditorTest
21-Sep-2017 19:55:33 Tests run: 2, Failures: 0, Errors: 0, Skipped: 0, Time elapsed: 1.238 sec - in org.openmrs.propertyeditor.PatientEditorTest
21-Sep-2017 19:55:33 Running org.openmrs.propertyeditor.CohortEditorTest
21-Sep-2017 19:55:34 Tests run: 2, Failures: 0, Errors: 0, Skipped: 0, Time elapsed: 0.982 sec - in org.openmrs.propertyeditor.CohortEditorTest
21-Sep-2017 19:55:34 Running org.openmrs.propertyeditor.LocationEditorTest
21-Sep-2017 19:55:35 Tests run: 2, Failures: 0, Errors: 0, Skipped: 0, Time elapsed: 0.914 sec - in org.openmrs.propertyeditor.LocationEditorTest
21-Sep-2017 19:55:35 Running org.openmrs.propertyeditor.ProgramWorkflowEditorTest
21-Sep-2017 19:55:37 Tests run: 1, Failures: 0, Errors: 0, Skipped: 0, Time elapsed: 1.644 sec - in org.openmrs.propertyeditor.ProgramWorkflowEditorTest
21-Sep-2017 19:55:37 Running org.openmrs.propertyeditor.RoleEditorTest
21-Sep-2017 19:55:38 Tests run: 2, Failures: 0, Errors: 0, Skipped: 0, Time elapsed: 0.999 sec - in org.openmrs.propertyeditor.RoleEditorTest
21-Sep-2017 19:55:38 Running org.openmrs.propertyeditor.ConceptNumericEditorTest
21-Sep-2017 19:55:40 Tests run: 2, Failures: 0, Errors: 0, Skipped: 0, Time elapsed: 2.022 sec - in org.openmrs.propertyeditor.ConceptNumericEditorTest
21-Sep-2017 19:55:40 Running org.openmrs.propertyeditor.EncounterTypeEditorTest
21-Sep-2017 19:55:41 Tests run: 2, Failures: 0, Errors: 0, Skipped: 0, Time elapsed: 1.072 sec - in org.openmrs.propertyeditor.EncounterTypeEditorTest
21-Sep-2017 19:55:41 Running org.openmrs.propertyeditor.VisitEditorTest
21-Sep-2017 19:55:42 Tests run: 2, Failures: 0, Errors: 0, Skipped: 0, Time elapsed: 1.079 sec - in org.openmrs.propertyeditor.VisitEditorTest
21-Sep-2017 19:55:42 Running org.openmrs.propertyeditor.ProgramWorkflowStateEditorTest
21-Sep-2017 19:55:43 Tests run: 1, Failures: 0, Errors: 0, Skipped: 0, Time elapsed: 0.993 sec - in org.openmrs.propertyeditor.ProgramWorkflowStateEditorTest
21-Sep-2017 19:55:43 Running org.openmrs.propertyeditor.EncounterEditorTest
21-Sep-2017 19:55:44 Tests run: 2, Failures: 0, Errors: 0, Skipped: 0, Time elapsed: 1.093 sec - in org.openmrs.propertyeditor.EncounterEditorTest
21-Sep-2017 19:55:44 Running org.openmrs.propertyeditor.UserEditorTest
21-Sep-2017 19:55:45 Tests run: 2, Failures: 0, Errors: 0, Skipped: 0, Time elapsed: 1.51 sec - in org.openmrs.propertyeditor.UserEditorTest
21-Sep-2017 19:55:45 Running org.openmrs.scheduler.SchedulerUtilTest
21-Sep-2017 19:55:46 Tests run: 1, Failures: 0, Errors: 0, Skipped: 0, Time elapsed: 0.079 sec - in org.openmrs.scheduler.SchedulerUtilTest
21-Sep-2017 19:55:46 Running org.openmrs.scheduler.timer.TimerSchedulerServiceImplTest
21-Sep-2017 19:55:47 Tests run: 1, Failures: 0, Errors: 0, Skipped: 0, Time elapsed: 1.152 sec - in org.openmrs.scheduler.timer.TimerSchedulerServiceImplTest
21-Sep-2017 19:55:47 Running org.openmrs.scheduler.SchedulerServiceTest
21-Sep-2017 19:55:47 Tests run: 1, Failures: 0, Errors: 0, Skipped: 1, Time elapsed: 0 sec - in org.openmrs.scheduler.SchedulerServiceTest
21-Sep-2017 19:55:47 Running org.openmrs.annotation.StartModuleAnnotationReuseTest
21-Sep-2017 19:55:48 Tests run: 1, Failures: 0, Errors: 0, Skipped: 0, Time elapsed: 1.353 sec - in org.openmrs.annotation.StartModuleAnnotationReuseTest
21-Sep-2017 19:55:48 Running org.openmrs.annotation.OpenmrsProfileIncludeFilterTest
21-Sep-2017 19:55:50 Tests run: 2, Failures: 0, Errors: 0, Skipped: 0, Time elapsed: 1.51 sec - in org.openmrs.annotation.OpenmrsProfileIncludeFilterTest
21-Sep-2017 19:55:50 Running org.openmrs.annotation.OpenmrsProfileExcludeFilterWithModulesTest
21-Sep-2017 19:55:51 Tests run: 1, Failures: 0, Errors: 0, Skipped: 0, Time elapsed: 1.479 sec - in org.openmrs.annotation.OpenmrsProfileExcludeFilterWithModulesTest
21-Sep-2017 19:55:51 Running org.openmrs.annotation.OpenmrsProfileExcludeFilterTest
21-Sep-2017 19:55:53 Tests run: 8, Failures: 0, Errors: 1, Skipped: 2, Time elapsed: 1.696 sec <<< FAILURE! - in org.openmrs.annotation.OpenmrsProfileExcludeFilterTest
21-Sep-2017 19:55:53 match_shouldIncludeBeanIfModuleMissing(org.openmrs.annotation.OpenmrsProfileExcludeFilterTest)  Time elapsed: 0.061 sec  <<< ERROR!
21-Sep-2017 19:55:53 org.springframework.beans.factory.NoSuchBeanDefinitionException: No qualifying bean of type [org.openmrs.annotation.OpenmrsProfileWithoutTest1Module] is defined
21-Sep-2017 19:55:53         at org.springframework.beans.factory.support.DefaultListableBeanFactory.getBean(DefaultListableBeanFactory.java:371)
21-Sep-2017 19:55:53         at org.springframework.beans.factory.support.DefaultListableBeanFactory.getBean(DefaultListableBeanFactory.java:331)
21-Sep-2017 19:55:53         at org.springframework.context.support.AbstractApplicationContext.getBean(AbstractApplicationContext.java:968)
21-Sep-2017 19:55:53         at org.openmrs.annotation.OpenmrsProfileExcludeFilterTest.match_shouldIncludeBeanIfModuleMissing(OpenmrsProfileExcludeFilterTest.java:87)
21-Sep-2017 19:55:53
21-Sep-2017 19:55:53 Running org.openmrs.EncounterProviderTest
21-Sep-2017 19:55:53 Tests run: 1, Failures: 0, Errors: 0, Skipped: 0, Time elapsed: 0.079 sec - in org.openmrs.EncounterProviderTest
21-Sep-2017 19:55:53 Running org.openmrs.order.OrderUtilTest
21-Sep-2017 19:55:54 Tests run: 15, Failures: 0, Errors: 0, Skipped: 0, Time elapsed: 1.158 sec - in org.openmrs.order.OrderUtilTest
21-Sep-2017 19:55:54 Running org.openmrs.OpenmrsTestAnnotationsTest
21-Sep-2017 19:55:55 Tests run: 2, Failures: 0, Errors: 0, Skipped: 0, Time elapsed: 1.352 sec - in org.openmrs.OpenmrsTestAnnotationsTest
21-Sep-2017 19:55:55 Running org.openmrs.UserTest
21-Sep-2017 19:55:56 Tests run: 9, Failures: 0, Errors: 0, Skipped: 0, Time elapsed: 0.742 sec - in org.openmrs.UserTest
21-Sep-2017 19:55:56 Running org.openmrs.LocationTest
21-Sep-2017 19:55:56 Tests run: 3, Failures: 0, Errors: 0, Skipped: 0, Time elapsed: 0.243 sec - in org.openmrs.LocationTest
21-Sep-2017 19:55:56 Running org.openmrs.EncounterTypeTest
21-Sep-2017 19:55:56 Tests run: 1, Failures: 0, Errors: 0, Skipped: 0, Time elapsed: 0.079 sec - in org.openmrs.EncounterTypeTest
21-Sep-2017 19:55:56 Running org.openmrs.AllergenTest
21-Sep-2017 19:55:58 Tests run: 6, Failures: 0, Errors: 0, Skipped: 0, Time elapsed: 1.603 sec - in org.openmrs.AllergenTest
21-Sep-2017 19:55:58 Running org.openmrs.FormTest
21-Sep-2017 19:55:58 Tests run: 1, Failures: 0, Errors: 0, Skipped: 0, Time elapsed: 0.091 sec - in org.openmrs.FormTest
21-Sep-2017 19:55:58 Running org.openmrs.ConceptComponentTest
21-Sep-2017 19:56:00 Tests run: 1, Failures: 0, Errors: 0, Skipped: 0, Time elapsed: 2.153 sec - in org.openmrs.ConceptComponentTest
21-Sep-2017 19:56:00 Running org.openmrs.notification.MessageTest
21-Sep-2017 19:56:01 Tests run: 4, Failures: 0, Errors: 0, Skipped: 0, Time elapsed: 0.316 sec - in org.openmrs.notification.MessageTest
21-Sep-2017 19:56:01 Running org.openmrs.notification.db.hibernate.HibernateAlertDAOTest
21-Sep-2017 19:56:01 Tests run: 1, Failures: 0, Errors: 0, Skipped: 0, Time elapsed: 0.671 sec - in org.openmrs.notification.db.hibernate.HibernateAlertDAOTest
21-Sep-2017 19:56:01 Running org.openmrs.notification.AlertServiceTest
21-Sep-2017 19:56:02 Tests run: 3, Failures: 0, Errors: 0, Skipped: 0, Time elapsed: 0.859 sec - in org.openmrs.notification.AlertServiceTest
21-Sep-2017 19:56:02 Running org.openmrs.layout.name.NameTemplateTest
21-Sep-2017 19:56:02 Tests run: 2, Failures: 0, Errors: 0, Skipped: 0, Time elapsed: 0.169 sec - in org.openmrs.layout.name.NameTemplateTest
21-Sep-2017 19:56:02 Running org.openmrs.OrderTypeTest
21-Sep-2017 19:56:03 Tests run: 3, Failures: 0, Errors: 0, Skipped: 0, Time elapsed: 0.33 sec - in org.openmrs.OrderTypeTest
21-Sep-2017 19:56:03 Running org.openmrs.OrderEntryIntegrationTest
21-Sep-2017 19:56:05 Tests run: 15, Failures: 0, Errors: 0, Skipped: 0, Time elapsed: 2.501 sec - in org.openmrs.OrderEntryIntegrationTest
21-Sep-2017 19:56:05 Running org.openmrs.ConceptReferenceTermTest
21-Sep-2017 19:56:05 Tests run: 3, Failures: 0, Errors: 0, Skipped: 0, Time elapsed: 0.255 sec - in org.openmrs.ConceptReferenceTermTest
21-Sep-2017 19:56:05 Running org.openmrs.comparator.PatientIdentifierTypeDefaultComparatorTest
21-Sep-2017 19:56:05 Tests run: 1, Failures: 0, Errors: 0, Skipped: 0, Time elapsed: 0.077 sec - in org.openmrs.comparator.PatientIdentifierTypeDefaultComparatorTest
21-Sep-2017 19:56:05 Running org.openmrs.PatientStateTest
21-Sep-2017 19:56:06 Tests run: 13, Failures: 0, Errors: 0, Skipped: 0, Time elapsed: 1.044 sec - in org.openmrs.PatientStateTest
21-Sep-2017 19:56:06 Running org.openmrs.PersonNameTest
21-Sep-2017 19:56:08 Tests run: 19, Failures: 0, Errors: 0, Skipped: 0, Time elapsed: 1.594 sec - in org.openmrs.PersonNameTest
21-Sep-2017 19:56:08 Running org.openmrs.messagesource.impl.DefaultMessageSourceServiceImplTest
21-Sep-2017 19:56:08 Tests run: 1, Failures: 0, Errors: 0, Skipped: 0, Time elapsed: 0.085 sec - in org.openmrs.messagesource.impl.DefaultMessageSourceServiceImplTest
21-Sep-2017 19:56:08 Running org.openmrs.messagesource.impl.CachedMessageSourceTest
21-Sep-2017 19:56:08 Tests run: 2, Failures: 0, Errors: 0, Skipped: 0, Time elapsed: 0.244 sec - in org.openmrs.messagesource.impl.CachedMessageSourceTest
21-Sep-2017 19:56:08 Running org.openmrs.messagesource.PresentationMessageMapTest
21-Sep-2017 19:56:09 Tests run: 2, Failures: 0, Errors: 0, Skipped: 0, Time elapsed: 0.172 sec - in org.openmrs.messagesource.PresentationMessageMapTest
21-Sep-2017 19:56:09 Running org.openmrs.messagesource.MessageSourceServiceTest
21-Sep-2017 19:56:09 Tests run: 1, Failures: 0, Errors: 0, Skipped: 0, Time elapsed: 0.846 sec - in org.openmrs.messagesource.MessageSourceServiceTest
21-Sep-2017 19:56:09 Running org.openmrs.customdatatype.datatype.BaseOpenmrsDatatypeTest
21-Sep-2017 19:56:10 Tests run: 1, Failures: 0, Errors: 0, Skipped: 0, Time elapsed: 0.091 sec - in org.openmrs.customdatatype.datatype.BaseOpenmrsDatatypeTest
21-Sep-2017 19:56:10 Running org.openmrs.customdatatype.datatype.DateDatatypeTest
21-Sep-2017 19:56:10 Tests run: 2, Failures: 0, Errors: 0, Skipped: 0, Time elapsed: 0.159 sec - in org.openmrs.customdatatype.datatype.DateDatatypeTest
21-Sep-2017 19:56:10 Running org.openmrs.customdatatype.datatype.BaseMetadataDatatypeTest
21-Sep-2017 19:56:10 Tests run: 1, Failures: 0, Errors: 0, Skipped: 0, Time elapsed: 0.079 sec - in org.openmrs.customdatatype.datatype.BaseMetadataDatatypeTest
21-Sep-2017 19:56:10 Running org.openmrs.customdatatype.datatype.RegexValidatedTextTest
21-Sep-2017 19:56:10 Tests run: 3, Failures: 0, Errors: 0, Skipped: 0, Time elapsed: 0.237 sec - in org.openmrs.customdatatype.datatype.RegexValidatedTextTest
21-Sep-2017 19:56:10 Running org.openmrs.customdatatype.CustomDatatypeUtilTest
21-Sep-2017 19:56:11 Tests run: 1, Failures: 0, Errors: 0, Skipped: 0, Time elapsed: 0.939 sec - in org.openmrs.customdatatype.CustomDatatypeUtilTest
21-Sep-2017 19:56:11 Running org.openmrs.PersonAttributeTest
21-Sep-2017 19:56:12 Tests run: 6, Failures: 0, Errors: 0, Skipped: 0, Time elapsed: 1.047 sec - in org.openmrs.PersonAttributeTest
21-Sep-2017 19:56:12 Running org.openmrs.PersonTest
21-Sep-2017 19:56:15 Tests run: 27, Failures: 0, Errors: 0, Skipped: 0, Time elapsed: 3.025 sec - in org.openmrs.PersonTest
21-Sep-2017 19:56:15 Running org.openmrs.aop.RequiredDataAdviceTest
21-Sep-2017 19:56:18 Tests run: 26, Failures: 0, Errors: 0, Skipped: 0, Time elapsed: 3.323 sec - in org.openmrs.aop.RequiredDataAdviceTest
21-Sep-2017 19:56:18 Running org.openmrs.aop.AuthorizationAdviceTest
21-Sep-2017 19:56:19 Tests run: 1, Failures: 0, Errors: 0, Skipped: 0, Time elapsed: 0.805 sec - in org.openmrs.aop.AuthorizationAdviceTest
21-Sep-2017 19:56:19 Running org.openmrs.AllergiesTest
21-Sep-2017 19:56:23 Tests run: 26, Failures: 0, Errors: 0, Skipped: 0, Time elapsed: 3.43 sec - in org.openmrs.AllergiesTest
21-Sep-2017 19:56:23
21-Sep-2017 19:56:23 Results :
21-Sep-2017 19:56:23
21-Sep-2017 19:56:23 Tests in error:
21-Sep-2017 19:56:23   OpenmrsProfileExcludeFilterTest.match_shouldIncludeBeanIfModuleMissing:87 » NoSuchBeanDefinition
21-Sep-2017 19:56:23
21-Sep-2017 19:56:23 Tests run: 3264, Failures: 0, Errors: 1, Skipped: 31
21-Sep-2017 19:56:23
21-Sep-2017 19:56:23 [INFO] ------------------------------------------------------------------------
21-Sep-2017 19:56:23 [INFO] Reactor Summary:
21-Sep-2017 19:56:23 [INFO]
21-Sep-2017 19:56:23 [INFO] OpenMRS ............................................ SUCCESS [  8.169 s]
21-Sep-2017 19:56:23 [INFO] openmrs-tools ...................................... SUCCESS [  3.293 s]
21-Sep-2017 19:56:23 [INFO] openmrs-test ....................................... SUCCESS [  0.554 s]
21-Sep-2017 19:56:23 [INFO] openmrs-api ........................................ FAILURE [10:17 min]
21-Sep-2017 19:56:23 [INFO] openmrs-web ........................................ SKIPPED
21-Sep-2017 19:56:23 [INFO] openmrs-webapp ..................................... SKIPPED
21-Sep-2017 19:56:23 [INFO] ------------------------------------------------------------------------
21-Sep-2017 19:56:23 [INFO] BUILD FAILURE
21-Sep-2017 19:56:23 [INFO] ------------------------------------------------------------------------
21-Sep-2017 19:56:23 [INFO] Total time: 10:30 min
21-Sep-2017 19:56:23 [INFO] Finished at: 2017-09-21T19:56:23+00:00
21-Sep-2017 19:56:23 [INFO] Final Memory: 55M/438M
21-Sep-2017 19:56:23 [INFO] ------------------------------------------------------------------------
21-Sep-2017 19:56:23 [ERROR] Failed to execute goal org.apache.maven.plugins:maven-surefire-plugin:2.18.1:test (default-test) on project openmrs-api: There are test failures.
21-Sep-2017 19:56:23 [ERROR]
21-Sep-2017 19:56:23 [ERROR] Please refer to /home/bamboo-agent-1/bamboo-agent/xml-data/build-dir/TRUNK-OC2-JOB1/api/target/surefire-reports for the individual test results.
21-Sep-2017 19:56:23 [ERROR] -> [Help 1]
21-Sep-2017 19:56:23 [ERROR]
21-Sep-2017 19:56:23 [ERROR] To see the full stack trace of the errors, re-run Maven with the -e switch.
21-Sep-2017 19:56:23 [ERROR] Re-run Maven using the -X switch to enable full debug logging.
21-Sep-2017 19:56:23 [ERROR]
21-Sep-2017 19:56:23 [ERROR] For more information about the errors and possible solutions, please read the following articles:
21-Sep-2017 19:56:23 [ERROR] [Help 1] http://cwiki.apache.org/confluence/display/MAVEN/MojoFailureException
21-Sep-2017 19:56:23 [ERROR]
21-Sep-2017 19:56:23 [ERROR] After correcting the problems, you can resume the build with the command
21-Sep-2017 19:56:23 [ERROR]   mvn <goals> -rf :openmrs-api
21-Sep-2017 19:56:23 Failing task since return code of [/usr/share/apache-maven-3.2.3/bin/mvn --batch-mode -Djava.io.tmpdir=/home/bamboo-agent-1/bamboo-agent/.agent_tmp/TRUNK-OC2-JOB1 clean package -Psonar] was 1 while expected 0
21-Sep-2017 19:56:23 Parsing test results under /home/bamboo-agent-1/bamboo-agent/xml-data/build-dir/TRUNK-OC2-JOB1...
21-Sep-2017 19:56:24 Finished task 'Build' with result: Failed
21-Sep-2017 19:56:24 Running post build plugin 'Docker Container Cleanup'
21-Sep-2017 19:56:24 Running post build plugin 'NCover Results Collector'
21-Sep-2017 19:56:24 Running post build plugin 'Clover Results Collector'
21-Sep-2017 19:56:24 Running post build plugin 'npm Cache Cleanup'
21-Sep-2017 19:56:24 Running post build plugin 'Artifact Copier'
21-Sep-2017 19:56:24 Publishing an artifact: openmrs-war
21-Sep-2017 19:56:24 Unable to publish artifact [openmrs-war]: the source directory /home/bamboo-agent-1/bamboo-agent/xml-data/build-dir/TRUNK-OC2-JOB1/webapp/target does not exist.
21-Sep-2017 19:56:24 The artifact hasn't been successfully published after 770.4 μs
21-Sep-2017 19:56:24 Publishing an artifact: openmrs-api
21-Sep-2017 19:56:24 Unable to publish artifact [openmrs-api]: the source directory /home/bamboo-agent-1/bamboo-agent/xml-data/build-dir/TRUNK-OC2-JOB1/webapp/target/openmrs/WEB-INF/lib does not exist.
21-Sep-2017 19:56:24 The artifact hasn't been successfully published after 120.4 μs
21-Sep-2017 19:56:24 Publishing an artifact: sonar-issues
21-Sep-2017 19:56:24 Unable to publish artifact [sonar-issues]: the source directory /home/bamboo-agent-1/bamboo-agent/xml-data/build-dir/TRUNK-OC2-JOB1/target/sonar/issues-report does not exist.
21-Sep-2017 19:56:24 The artifact hasn't been successfully published after 177.0 μs
21-Sep-2017 19:56:24 Finalising the build...
21-Sep-2017 19:56:24 Stopping timer.
21-Sep-2017 19:56:24 Build TRUNK-OC2-JOB1-195 completed.
21-Sep-2017 19:56:24 Running on server: post build plugin 'NCover Results Collector'
21-Sep-2017 19:56:24 Running on server: post build plugin 'Build Hanging Detection Configuration'
21-Sep-2017 19:56:24 Running on server: post build plugin 'Clover Delta Calculator'
21-Sep-2017 19:56:24 Running on server: post build plugin 'Maven Dependencies Postprocessor'
21-Sep-2017 19:56:24 All post build plugins have finished
21-Sep-2017 19:56:24 Generating build results summary...
21-Sep-2017 19:56:26 Saving build results to disk...
21-Sep-2017 19:56:26 Logging substituted variables...
21-Sep-2017 19:56:26 Indexing build results...
21-Sep-2017 19:56:26 Finished building TRUNK-OC2-JOB1-195.