Plan for OpenMRS Core 2.0.x

Build: #196 failed

Job: Build and Test failed

Stages & jobs

  1. Build and Test

  2. Deploy

  3. Release

    Requires a user to start manually

Build log

The build generated 1,098 lines of output.The output is too long and has been truncated to the last 1,000 lines. Download or view full build log

21-Sep-2017 20:19:28 [INFO] skip non existing resourceDirectory /home/bamboo-agent-1/bamboo-agent/xml-data/build-dir/TRUNK-OC2-JOB1/tools/src/test/resources
21-Sep-2017 20:19:28 [INFO]
21-Sep-2017 20:19:28 [INFO] --- maven-compiler-plugin:2.1:testCompile (default-testCompile) @ openmrs-tools ---
21-Sep-2017 20:19:28 [INFO] No sources to compile
21-Sep-2017 20:19:28 [INFO]
21-Sep-2017 20:19:28 [INFO] --- maven-surefire-plugin:2.18.1:test (default-test) @ openmrs-tools ---
21-Sep-2017 20:19:28 [INFO] No tests to run.
21-Sep-2017 20:19:28 [INFO]
21-Sep-2017 20:19:28 [INFO] --- maven-jar-plugin:2.3.2:jar (default-jar) @ openmrs-tools ---
21-Sep-2017 20:19:28 [INFO] Building jar: /home/bamboo-agent-1/bamboo-agent/xml-data/build-dir/TRUNK-OC2-JOB1/tools/target/openmrs-tools-2.0.6-SNAPSHOT.jar
21-Sep-2017 20:19:28 [INFO]
21-Sep-2017 20:19:28 [INFO] --- maven-jar-plugin:2.3.2:test-jar (default) @ openmrs-tools ---
21-Sep-2017 20:19:28 [WARNING] JAR will be empty - no content was marked for inclusion!
21-Sep-2017 20:19:28 [INFO] Building jar: /home/bamboo-agent-1/bamboo-agent/xml-data/build-dir/TRUNK-OC2-JOB1/tools/target/openmrs-tools-2.0.6-SNAPSHOT-tests.jar
21-Sep-2017 20:19:28 [INFO]                                                                         
21-Sep-2017 20:19:28 [INFO] ------------------------------------------------------------------------
21-Sep-2017 20:19:28 [INFO] Building openmrs-test 2.0.6-SNAPSHOT
21-Sep-2017 20:19:28 [INFO] ------------------------------------------------------------------------
21-Sep-2017 20:19:29 [INFO]
21-Sep-2017 20:19:29 [INFO] --- maven-clean-plugin:2.5:clean (default-clean) @ openmrs-test ---
21-Sep-2017 20:19:29 [INFO] Deleting /home/bamboo-agent-1/bamboo-agent/xml-data/build-dir/TRUNK-OC2-JOB1/test/target
21-Sep-2017 20:19:29 [INFO]
21-Sep-2017 20:19:29 [INFO] --- buildnumber-maven-plugin:1.1:create (default) @ openmrs-test ---
21-Sep-2017 20:19:29 [INFO]
21-Sep-2017 20:19:29 [INFO] --- jacoco-maven-plugin:0.7.4.201502262128:prepare-agent (prepare-agent) @ openmrs-test ---
21-Sep-2017 20:19:29 [INFO] argLine set to -javaagent:/home/bamboo-agent-1/.m2/repository/org/jacoco/org.jacoco.agent/0.7.4.201502262128/org.jacoco.agent-0.7.4.201502262128-runtime.jar=destfile=/home/bamboo-agent-1/bamboo-agent/xml-data/build-dir/TRUNK-OC2-JOB1/test/target/jacoco.exec,includes=org.openmrs.* -Duser.language=en -Duser.region=US -Xmx2g
21-Sep-2017 20:19:29 [INFO]
21-Sep-2017 20:19:29 [INFO] --- build-helper-maven-plugin:1.5:parse-version (parse-version) @ openmrs-test ---
21-Sep-2017 20:19:29 [INFO]
21-Sep-2017 20:19:29 [INFO] --- maven-jar-plugin:2.3.2:test-jar (default) @ openmrs-test ---
21-Sep-2017 20:19:29 [WARNING] JAR will be empty - no content was marked for inclusion!
21-Sep-2017 20:19:29 [INFO] Building jar: /home/bamboo-agent-1/bamboo-agent/xml-data/build-dir/TRUNK-OC2-JOB1/test/target/openmrs-test-2.0.6-SNAPSHOT-tests.jar
21-Sep-2017 20:19:29 [INFO]                                                                         
21-Sep-2017 20:19:29 [INFO] ------------------------------------------------------------------------
21-Sep-2017 20:19:29 [INFO] Building openmrs-api 2.0.6-SNAPSHOT
21-Sep-2017 20:19:29 [INFO] ------------------------------------------------------------------------
21-Sep-2017 20:19:29 [INFO]
21-Sep-2017 20:19:29 [INFO] --- maven-clean-plugin:2.5:clean (default-clean) @ openmrs-api ---
21-Sep-2017 20:19:29 [INFO] Deleting /home/bamboo-agent-1/bamboo-agent/xml-data/build-dir/TRUNK-OC2-JOB1/api/target
21-Sep-2017 20:19:29 [INFO]
21-Sep-2017 20:19:29 [INFO] --- buildnumber-maven-plugin:1.1:create (default) @ openmrs-api ---
21-Sep-2017 20:19:29 [INFO]
21-Sep-2017 20:19:29 [INFO] --- jacoco-maven-plugin:0.7.4.201502262128:prepare-agent (prepare-agent) @ openmrs-api ---
21-Sep-2017 20:19:29 [INFO] argLine set to -javaagent:/home/bamboo-agent-1/.m2/repository/org/jacoco/org.jacoco.agent/0.7.4.201502262128/org.jacoco.agent-0.7.4.201502262128-runtime.jar=destfile=/home/bamboo-agent-1/bamboo-agent/xml-data/build-dir/TRUNK-OC2-JOB1/api/target/jacoco.exec,includes=org.openmrs.* -Duser.language=en -Duser.region=US -Xmx2g
21-Sep-2017 20:19:29 [INFO]
21-Sep-2017 20:19:29 [INFO] --- build-helper-maven-plugin:1.5:parse-version (parse-version) @ openmrs-api ---
21-Sep-2017 20:19:29 [INFO]
21-Sep-2017 20:19:29 [INFO] --- maven-java-formatter-plugin:0.3:format (default) @ openmrs-api ---
21-Sep-2017 20:19:30 [INFO] Using 'UTF-8' encoding to format source files.
21-Sep-2017 20:19:30 [INFO] Number of files to be formatted: 941
21-Sep-2017 20:19:35 [INFO] Successfully formatted: 0 file(s)
21-Sep-2017 20:19:35 [INFO] Fail to format        : 0 file(s)
21-Sep-2017 20:19:35 [INFO] Skipped               : 941 file(s)
21-Sep-2017 20:19:35 [INFO] Approximate time taken: 5s
21-Sep-2017 20:19:35 [INFO]
21-Sep-2017 20:19:35 [INFO] --- maven-resources-plugin:2.4:resources (default-resources) @ openmrs-api ---
21-Sep-2017 20:19:35 [INFO] Using 'UTF-8' encoding to copy filtered resources.
21-Sep-2017 20:19:35 [INFO] Copying 1 resource
21-Sep-2017 20:19:35 [INFO] Copying 122 resources
21-Sep-2017 20:19:35 [INFO]
21-Sep-2017 20:19:35 [INFO] --- maven-compiler-plugin:2.1:compile (default-compile) @ openmrs-api ---
21-Sep-2017 20:19:35 [INFO] Compiling 649 source files to /home/bamboo-agent-1/bamboo-agent/xml-data/build-dir/TRUNK-OC2-JOB1/api/target/classes
21-Sep-2017 20:19:53 [WARNING] /home/bamboo-agent-1/bamboo-agent/xml-data/build-dir/TRUNK-OC2-JOB1/api/src/main/java/org/openmrs/util/MemoryLeakUtil.java:[18,23] KeepAliveCache is internal proprietary API and may be removed in a future release
21-Sep-2017 20:19:53
21-Sep-2017 20:19:53 [WARNING] /home/bamboo-agent-1/bamboo-agent/xml-data/build-dir/TRUNK-OC2-JOB1/api/src/main/java/org/openmrs/util/MemoryLeakUtil.java:[67,32] KeepAliveCache is internal proprietary API and may be removed in a future release
21-Sep-2017 20:19:53
21-Sep-2017 20:19:53 [INFO]
21-Sep-2017 20:19:53 [INFO] --- maven-resources-plugin:2.4:testResources (default-testResources) @ openmrs-api ---
21-Sep-2017 20:19:53 [INFO] Using 'UTF-8' encoding to copy filtered resources.
21-Sep-2017 20:19:53 [INFO] Copying 127 resources
21-Sep-2017 20:19:53 [INFO]
21-Sep-2017 20:19:53 [INFO] --- maven-compiler-plugin:2.1:testCompile (default-testCompile) @ openmrs-api ---
21-Sep-2017 20:19:53 [INFO] Compiling 292 source files to /home/bamboo-agent-1/bamboo-agent/xml-data/build-dir/TRUNK-OC2-JOB1/api/target/test-classes
21-Sep-2017 20:20:10 [INFO]
21-Sep-2017 20:20:10 [INFO] --- maven-surefire-plugin:2.18.1:test (default-test) @ openmrs-api ---
21-Sep-2017 20:20:10 [INFO] Surefire report directory: /home/bamboo-agent-1/bamboo-agent/xml-data/build-dir/TRUNK-OC2-JOB1/api/target/surefire-reports
21-Sep-2017 20:20:10
21-Sep-2017 20:20:10 -------------------------------------------------------
21-Sep-2017 20:20:10 T E S T S
21-Sep-2017 20:20:10 -------------------------------------------------------
21-Sep-2017 20:20:17 Running org.openmrs.SimpleDosingInstructionsTest
21-Sep-2017 20:20:43 Tests run: 10, Failures: 0, Errors: 0, Skipped: 0, Time elapsed: 25.116 sec - in org.openmrs.SimpleDosingInstructionsTest
21-Sep-2017 20:20:43 Running org.openmrs.RoleTest
21-Sep-2017 20:20:43 Tests run: 7, Failures: 0, Errors: 0, Skipped: 0, Time elapsed: 0.186 sec - in org.openmrs.RoleTest
21-Sep-2017 20:20:43 Running org.openmrs.DrugOrderTest
21-Sep-2017 20:20:44 Tests run: 22, Failures: 0, Errors: 0, Skipped: 0, Time elapsed: 1.644 sec - in org.openmrs.DrugOrderTest
21-Sep-2017 20:20:44 Running org.openmrs.PersonAddressTest
21-Sep-2017 20:20:45 Tests run: 15, Failures: 0, Errors: 0, Skipped: 0, Time elapsed: 0.379 sec - in org.openmrs.PersonAddressTest
21-Sep-2017 20:20:45 Running org.openmrs.TestOrderTest
21-Sep-2017 20:20:45 Tests run: 4, Failures: 0, Errors: 0, Skipped: 0, Time elapsed: 0.101 sec - in org.openmrs.TestOrderTest
21-Sep-2017 20:20:45 Running org.openmrs.BaseOpenmrsObjectTest
21-Sep-2017 20:20:46 Tests run: 20, Failures: 0, Errors: 0, Skipped: 0, Time elapsed: 1.5 sec - in org.openmrs.BaseOpenmrsObjectTest
21-Sep-2017 20:20:46 Running org.openmrs.module.ModuleInteroperabilityTest
21-Sep-2017 20:20:49 Tests run: 1, Failures: 0, Errors: 0, Skipped: 0, Time elapsed: 2.773 sec - in org.openmrs.module.ModuleInteroperabilityTest
21-Sep-2017 20:20:49 Running org.openmrs.module.ModuleFileParserTest
21-Sep-2017 20:20:49 Tests run: 5, Failures: 0, Errors: 0, Skipped: 0, Time elapsed: 0.213 sec - in org.openmrs.module.ModuleFileParserTest
21-Sep-2017 20:20:49 Running org.openmrs.module.ModuleUtilTest
21-Sep-2017 20:20:54 Tests run: 43, Failures: 0, Errors: 0, Skipped: 0, Time elapsed: 4.064 sec - in org.openmrs.module.ModuleUtilTest
21-Sep-2017 20:20:54 Running org.openmrs.module.ModuleActivatorTest
21-Sep-2017 20:20:54 Tests run: 1, Failures: 0, Errors: 0, Skipped: 1, Time elapsed: 0.005 sec - in org.openmrs.module.ModuleActivatorTest
21-Sep-2017 20:20:54 Running org.openmrs.module.VersionComparatorTest
21-Sep-2017 20:20:54 Tests run: 1, Failures: 0, Errors: 0, Skipped: 0, Time elapsed: 0.028 sec - in org.openmrs.module.VersionComparatorTest
21-Sep-2017 20:20:54 Running org.openmrs.module.ModuleClassLoaderTest
21-Sep-2017 20:20:55 Tests run: 10, Failures: 0, Errors: 0, Skipped: 0, Time elapsed: 1.512 sec - in org.openmrs.module.ModuleClassLoaderTest
21-Sep-2017 20:20:55 Running org.openmrs.serialization.SimpleXStreamSerializerTest
21-Sep-2017 20:20:55 Tests run: 5, Failures: 0, Errors: 0, Skipped: 0, Time elapsed: 0.307 sec - in org.openmrs.serialization.SimpleXStreamSerializerTest
21-Sep-2017 20:20:55 Running org.openmrs.serialization.JavaSerializationTest
21-Sep-2017 20:20:55 Tests run: 2, Failures: 0, Errors: 0, Skipped: 0, Time elapsed: 0.098 sec - in org.openmrs.serialization.JavaSerializationTest
21-Sep-2017 20:20:55 Running org.openmrs.ConceptNumericTest
21-Sep-2017 20:20:58 Tests run: 8, Failures: 0, Errors: 0, Skipped: 0, Time elapsed: 2.095 sec - in org.openmrs.ConceptNumericTest
21-Sep-2017 20:20:58 Running org.openmrs.ProviderTest
21-Sep-2017 20:20:58 Tests run: 2, Failures: 0, Errors: 0, Skipped: 0, Time elapsed: 0.082 sec - in org.openmrs.ProviderTest
21-Sep-2017 20:20:58 Running org.openmrs.OpenmrsTestsTest
21-Sep-2017 20:20:58 Tests run: 4, Failures: 0, Errors: 0, Skipped: 0, Time elapsed: 0.626 sec - in org.openmrs.OpenmrsTestsTest
21-Sep-2017 20:20:58 Running org.openmrs.PatientTest
21-Sep-2017 20:20:59 Tests run: 8, Failures: 0, Errors: 0, Skipped: 0, Time elapsed: 0.294 sec - in org.openmrs.PatientTest
21-Sep-2017 20:20:59 Running org.openmrs.DurationTest
21-Sep-2017 20:21:00 Tests run: 11, Failures: 0, Errors: 0, Skipped: 0, Time elapsed: 1.47 sec - in org.openmrs.DurationTest
21-Sep-2017 20:21:00 Running org.openmrs.ObsTest
21-Sep-2017 20:21:01 Tests run: 55, Failures: 0, Errors: 0, Skipped: 0, Time elapsed: 1.418 sec - in org.openmrs.ObsTest
21-Sep-2017 20:21:01 Running org.openmrs.EncounterTest
21-Sep-2017 20:21:07 Tests run: 56, Failures: 0, Errors: 0, Skipped: 0, Time elapsed: 5.822 sec - in org.openmrs.EncounterTest
21-Sep-2017 20:21:07 Running org.openmrs.patient.impl.VerhoeffIdentifierValidatorTest
21-Sep-2017 20:21:07 Tests run: 2, Failures: 0, Errors: 0, Skipped: 0, Time elapsed: 0.063 sec - in org.openmrs.patient.impl.VerhoeffIdentifierValidatorTest
21-Sep-2017 20:21:07 Running org.openmrs.patient.impl.LuhnIdentifierValidatorTest
21-Sep-2017 20:21:07 Tests run: 3, Failures: 0, Errors: 0, Skipped: 0, Time elapsed: 0.118 sec - in org.openmrs.patient.impl.LuhnIdentifierValidatorTest
21-Sep-2017 20:21:07 Running org.openmrs.PatientProgramTest
21-Sep-2017 20:21:08 Tests run: 2, Failures: 0, Errors: 0, Skipped: 0, Time elapsed: 0.082 sec - in org.openmrs.PatientProgramTest
21-Sep-2017 20:21:08 Running org.openmrs.logic.result.ResultTest
21-Sep-2017 20:21:08 Tests run: 17, Failures: 0, Errors: 0, Skipped: 0, Time elapsed: 0.467 sec - in org.openmrs.logic.result.ResultTest
21-Sep-2017 20:21:08 Running org.openmrs.logic.result.EmptyResultTest
21-Sep-2017 20:21:08 Tests run: 2, Failures: 0, Errors: 0, Skipped: 0, Time elapsed: 0.049 sec - in org.openmrs.logic.result.EmptyResultTest
21-Sep-2017 20:21:08 Running org.openmrs.DrugTest
21-Sep-2017 20:21:09 Tests run: 2, Failures: 0, Errors: 0, Skipped: 0, Time elapsed: 1.042 sec - in org.openmrs.DrugTest
21-Sep-2017 20:21:09 Running org.openmrs.attribute.AttributeIntegrationTest
21-Sep-2017 20:21:10 Tests run: 1, Failures: 0, Errors: 0, Skipped: 0, Time elapsed: 0.969 sec - in org.openmrs.attribute.AttributeIntegrationTest
21-Sep-2017 20:21:10 Running org.openmrs.EncounterRoleTest
21-Sep-2017 20:21:10 Tests run: 1, Failures: 0, Errors: 0, Skipped: 0, Time elapsed: 0.025 sec - in org.openmrs.EncounterRoleTest
21-Sep-2017 20:21:10 Running org.openmrs.util.HttpClientTest
21-Sep-2017 20:21:10 Tests run: 1, Failures: 0, Errors: 0, Skipped: 0, Time elapsed: 0.104 sec - in org.openmrs.util.HttpClientTest
21-Sep-2017 20:21:10 Running org.openmrs.util.LocationUtilityTest
21-Sep-2017 20:21:12 Tests run: 2, Failures: 0, Errors: 0, Skipped: 0, Time elapsed: 1.76 sec - in org.openmrs.util.LocationUtilityTest
21-Sep-2017 20:21:12 Running org.openmrs.util.DateUtilTest
21-Sep-2017 20:21:12 Tests run: 1, Failures: 0, Errors: 0, Skipped: 0, Time elapsed: 0.028 sec - in org.openmrs.util.DateUtilTest
21-Sep-2017 20:21:12 Running org.openmrs.util.ReflectTest
21-Sep-2017 20:21:13 Tests run: 18, Failures: 0, Errors: 0, Skipped: 0, Time elapsed: 0.481 sec - in org.openmrs.util.ReflectTest
21-Sep-2017 20:21:13 Running org.openmrs.util.GraphTest
21-Sep-2017 20:21:13 Tests run: 2, Failures: 0, Errors: 0, Skipped: 0, Time elapsed: 0.051 sec - in org.openmrs.util.GraphTest
21-Sep-2017 20:21:13 Running org.openmrs.util.ProviderByPersonNameComparatorTest
21-Sep-2017 20:21:13 Tests run: 6, Failures: 0, Errors: 0, Skipped: 0, Time elapsed: 0.166 sec - in org.openmrs.util.ProviderByPersonNameComparatorTest
21-Sep-2017 20:21:13 Running org.openmrs.util.JavaVersionTest
21-Sep-2017 20:21:13 SLF4J: Class path contains multiple SLF4J bindings.
21-Sep-2017 20:21:13 SLF4J: Found binding in [jar:file:/home/bamboo-agent-1/.m2/repository/org/slf4j/slf4j-log4j12/1.6.0/slf4j-log4j12-1.6.0.jar!/org/slf4j/impl/StaticLoggerBinder.class]
21-Sep-2017 20:21:13 SLF4J: Found binding in [jar:file:/home/bamboo-agent-1/.m2/repository/org/slf4j/slf4j-log4j12/1.6.0/slf4j-log4j12-1.6.0.jar!/org/slf4j/impl/StaticLoggerBinder.class]
21-Sep-2017 20:21:13 SLF4J: See http://www.slf4j.org/codes.html#multiple_bindings for an explanation.
21-Sep-2017 20:21:14 Tests run: 2, Failures: 0, Errors: 0, Skipped: 0, Time elapsed: 0.888 sec - in org.openmrs.util.JavaVersionTest
21-Sep-2017 20:21:14 Running org.openmrs.util.DatabaseUpdaterTest
21-Sep-2017 20:21:15 INFO 9/21/17 8:21 PM:liquibase: Creating database history table with name: LIQUIBASECHANGELOG
21-Sep-2017 20:21:16 INFO 9/21/17 8:21 PM:liquibase: Reading from LIQUIBASECHANGELOG
21-Sep-2017 20:21:17 Tests run: 1, Failures: 0, Errors: 0, Skipped: 0, Time elapsed: 3.183 sec - in org.openmrs.util.DatabaseUpdaterTest
21-Sep-2017 20:21:17 Running org.openmrs.util.OpenmrsUtilTest
21-Sep-2017 20:21:22 Tests run: 44, Failures: 0, Errors: 0, Skipped: 0, Time elapsed: 5.227 sec - in org.openmrs.util.OpenmrsUtilTest
21-Sep-2017 20:21:22 Running org.openmrs.util.DoubleRangeTest
21-Sep-2017 20:21:23 Tests run: 28, Failures: 0, Errors: 0, Skipped: 0, Time elapsed: 0.93 sec - in org.openmrs.util.DoubleRangeTest
21-Sep-2017 20:21:23 Running org.openmrs.util.UpgradeUtilTest
21-Sep-2017 20:21:25 Tests run: 2, Failures: 0, Errors: 0, Skipped: 0, Time elapsed: 2.047 sec - in org.openmrs.util.UpgradeUtilTest
21-Sep-2017 20:21:25 Running org.openmrs.util.HandlerUtilTest
21-Sep-2017 20:21:26 Tests run: 6, Failures: 0, Errors: 0, Skipped: 0, Time elapsed: 1.215 sec - in org.openmrs.util.HandlerUtilTest
21-Sep-2017 20:21:26 Running org.openmrs.util.OpenmrsSecurityManagerTest
21-Sep-2017 20:21:26 Tests run: 2, Failures: 0, Errors: 0, Skipped: 0, Time elapsed: 0.061 sec - in org.openmrs.util.OpenmrsSecurityManagerTest
21-Sep-2017 20:21:26 Running org.openmrs.util.ExceptionUtilTest
21-Sep-2017 20:21:26 Tests run: 1, Failures: 0, Errors: 0, Skipped: 0, Time elapsed: 0.042 sec - in org.openmrs.util.ExceptionUtilTest
21-Sep-2017 20:21:26 Running org.openmrs.util.SecurityTest
21-Sep-2017 20:21:27 Tests run: 7, Failures: 0, Errors: 0, Skipped: 0, Time elapsed: 0.328 sec - in org.openmrs.util.SecurityTest
21-Sep-2017 20:21:27 Running org.openmrs.util.HttpUrlTest
21-Sep-2017 20:21:27 Tests run: 4, Failures: 0, Errors: 0, Skipped: 0, Time elapsed: 0.111 sec - in org.openmrs.util.HttpUrlTest
21-Sep-2017 20:21:27 Running org.openmrs.util.PersonByNameComparatorTest
21-Sep-2017 20:21:27 Tests run: 4, Failures: 0, Errors: 0, Skipped: 0, Time elapsed: 0.105 sec - in org.openmrs.util.PersonByNameComparatorTest
21-Sep-2017 20:21:27 Running org.openmrs.util.UserByNameComparatorTest
21-Sep-2017 20:21:27 Tests run: 1, Failures: 0, Errors: 0, Skipped: 0, Time elapsed: 0.028 sec - in org.openmrs.util.UserByNameComparatorTest
21-Sep-2017 20:21:27 Running org.openmrs.util.LocaleUtilityTest
21-Sep-2017 20:21:30 Tests run: 21, Failures: 0, Errors: 0, Skipped: 0, Time elapsed: 2.594 sec - in org.openmrs.util.LocaleUtilityTest
21-Sep-2017 20:21:30 Running org.openmrs.util.DrugsByNameComparatorTest
21-Sep-2017 20:21:30 Tests run: 4, Failures: 0, Errors: 0, Skipped: 0, Time elapsed: 0.155 sec - in org.openmrs.util.DrugsByNameComparatorTest
21-Sep-2017 20:21:30 Running org.openmrs.ObsBehaviorTest
21-Sep-2017 20:21:31 Tests run: 3, Failures: 0, Errors: 0, Skipped: 1, Time elapsed: 1.317 sec - in org.openmrs.ObsBehaviorTest
21-Sep-2017 20:21:31 Running org.openmrs.ConceptTest
21-Sep-2017 20:21:33 Tests run: 71, Failures: 0, Errors: 0, Skipped: 0, Time elapsed: 2.242 sec - in org.openmrs.ConceptTest
21-Sep-2017 20:21:33 Running org.openmrs.validator.PatientValidatorTest
21-Sep-2017 20:21:35 Tests run: 12, Failures: 0, Errors: 0, Skipped: 0, Time elapsed: 1.935 sec - in org.openmrs.validator.PatientValidatorTest
21-Sep-2017 20:21:35 Running org.openmrs.validator.ConceptDrugValidatorTest
21-Sep-2017 20:21:35 Tests run: 3, Failures: 0, Errors: 0, Skipped: 0, Time elapsed: 0.091 sec - in org.openmrs.validator.ConceptDrugValidatorTest
21-Sep-2017 20:21:35 Running org.openmrs.validator.ImplementationIdValidatorTest
21-Sep-2017 20:21:37 Tests run: 8, Failures: 0, Errors: 0, Skipped: 0, Time elapsed: 1.39 sec - in org.openmrs.validator.ImplementationIdValidatorTest
21-Sep-2017 20:21:37 Running org.openmrs.validator.FieldTypeValidatorTest
21-Sep-2017 20:21:38 Tests run: 5, Failures: 0, Errors: 0, Skipped: 0, Time elapsed: 1.283 sec - in org.openmrs.validator.FieldTypeValidatorTest
21-Sep-2017 20:21:38 Running org.openmrs.validator.RoleValidatorTest
21-Sep-2017 20:21:39 Tests run: 6, Failures: 0, Errors: 0, Skipped: 0, Time elapsed: 1.232 sec - in org.openmrs.validator.RoleValidatorTest
21-Sep-2017 20:21:39 Running org.openmrs.validator.ConceptReferenceTermValidatorTest
21-Sep-2017 20:21:40 [Field error in object 'term' on field 'conceptReferenceTermMaps[1].termB': rejected value [weight term(WGT234)]; codes [ConceptReferenceTerm.termToTerm.alreadyMapped.term.conceptReferenceTermMaps[1].termB,ConceptReferenceTerm.termToTerm.alreadyMapped.term.conceptReferenceTermMaps.termB,ConceptReferenceTerm.termToTerm.alreadyMapped.conceptReferenceTermMaps[1].termB,ConceptReferenceTerm.termToTerm.alreadyMapped.conceptReferenceTermMaps.termB,ConceptReferenceTerm.termToTerm.alreadyMapped.termB,ConceptReferenceTerm.termToTerm.alreadyMapped.org.openmrs.ConceptReferenceTerm,ConceptReferenceTerm.termToTerm.alreadyMapped]; arguments []; default message [Cannot map a reference term multiple times to the same concept reference term]]
21-Sep-2017 20:21:42 Tests run: 18, Failures: 0, Errors: 0, Skipped: 3, Time elapsed: 2.426 sec - in org.openmrs.validator.ConceptReferenceTermValidatorTest
21-Sep-2017 20:21:42 Running org.openmrs.validator.VisitValidatorTest
21-Sep-2017 20:21:44 Tests run: 20, Failures: 0, Errors: 0, Skipped: 1, Time elapsed: 2.702 sec - in org.openmrs.validator.VisitValidatorTest
21-Sep-2017 20:21:44 Running org.openmrs.validator.ConceptSourceValidatorTest
21-Sep-2017 20:21:45 Tests run: 6, Failures: 0, Errors: 0, Skipped: 0, Time elapsed: 1.087 sec - in org.openmrs.validator.ConceptSourceValidatorTest
21-Sep-2017 20:21:45 Running org.openmrs.validator.PrivilegeValidatorTest
21-Sep-2017 20:21:47 Tests run: 5, Failures: 0, Errors: 0, Skipped: 0, Time elapsed: 1.908 sec - in org.openmrs.validator.PrivilegeValidatorTest
21-Sep-2017 20:21:47 Running org.openmrs.validator.ProviderValidatorTest
21-Sep-2017 20:21:49 Tests run: 13, Failures: 0, Errors: 0, Skipped: 0, Time elapsed: 1.403 sec - in org.openmrs.validator.ProviderValidatorTest
21-Sep-2017 20:21:49 Running org.openmrs.validator.PersonAttributeTypeValidatorTest
21-Sep-2017 20:21:50 Tests run: 7, Failures: 0, Errors: 0, Skipped: 0, Time elapsed: 0.99 sec - in org.openmrs.validator.PersonAttributeTypeValidatorTest
21-Sep-2017 20:21:50 Running org.openmrs.validator.LocationValidatorTest
21-Sep-2017 20:21:51 Tests run: 9, Failures: 0, Errors: 0, Skipped: 0, Time elapsed: 1.024 sec - in org.openmrs.validator.LocationValidatorTest
21-Sep-2017 20:21:51 Running org.openmrs.validator.RequireNameValidatorTest
21-Sep-2017 20:21:51 Tests run: 2, Failures: 0, Errors: 0, Skipped: 0, Time elapsed: 0.074 sec - in org.openmrs.validator.RequireNameValidatorTest
21-Sep-2017 20:21:51 Running org.openmrs.validator.VisitAttributeTypeValidatorTest
21-Sep-2017 20:21:52 Tests run: 2, Failures: 0, Errors: 0, Skipped: 0, Time elapsed: 0.777 sec - in org.openmrs.validator.VisitAttributeTypeValidatorTest
21-Sep-2017 20:21:52 Running org.openmrs.validator.FormValidatorTest
21-Sep-2017 20:21:53 Tests run: 8, Failures: 0, Errors: 0, Skipped: 0, Time elapsed: 1.121 sec - in org.openmrs.validator.FormValidatorTest
21-Sep-2017 20:21:53 Running org.openmrs.validator.EncounterRoleValidatorTest
21-Sep-2017 20:21:54 Tests run: 5, Failures: 0, Errors: 0, Skipped: 0, Time elapsed: 1.19 sec - in org.openmrs.validator.EncounterRoleValidatorTest
21-Sep-2017 20:21:54 Running org.openmrs.validator.FieldValidatorTest
21-Sep-2017 20:21:55 Tests run: 8, Failures: 0, Errors: 0, Skipped: 0, Time elapsed: 1.302 sec - in org.openmrs.validator.FieldValidatorTest
21-Sep-2017 20:21:55 Running org.openmrs.validator.AlertValidatorTest
21-Sep-2017 20:21:56 Tests run: 4, Failures: 0, Errors: 0, Skipped: 0, Time elapsed: 1.168 sec - in org.openmrs.validator.AlertValidatorTest
21-Sep-2017 20:21:56 Running org.openmrs.validator.ProviderAttributeTypeValidatorTest
21-Sep-2017 20:21:57 Tests run: 2, Failures: 0, Errors: 0, Skipped: 0, Time elapsed: 0.934 sec - in org.openmrs.validator.ProviderAttributeTypeValidatorTest
21-Sep-2017 20:21:57 Running org.openmrs.validator.PatientProgramValidatorTest
21-Sep-2017 20:22:00 Tests run: 22, Failures: 0, Errors: 0, Skipped: 0, Time elapsed: 2.332 sec - in org.openmrs.validator.PatientProgramValidatorTest
21-Sep-2017 20:22:00 Running org.openmrs.validator.RelationshipTypeValidatorTest
21-Sep-2017 20:22:01 Tests run: 7, Failures: 0, Errors: 0, Skipped: 0, Time elapsed: 1.19 sec - in org.openmrs.validator.RelationshipTypeValidatorTest
21-Sep-2017 20:22:01 Running org.openmrs.validator.OrderTypeValidatorTest
21-Sep-2017 20:22:03 Tests run: 14, Failures: 0, Errors: 0, Skipped: 0, Time elapsed: 1.752 sec - in org.openmrs.validator.OrderTypeValidatorTest
21-Sep-2017 20:22:03 Running org.openmrs.validator.UserValidatorTest
21-Sep-2017 20:22:04 Tests run: 21, Failures: 0, Errors: 0, Skipped: 0, Time elapsed: 1.749 sec - in org.openmrs.validator.UserValidatorTest
21-Sep-2017 20:22:04 Running org.openmrs.validator.PersonValidatorTest
21-Sep-2017 20:22:05 Tests run: 8, Failures: 0, Errors: 0, Skipped: 0, Time elapsed: 1.022 sec - in org.openmrs.validator.PersonValidatorTest
21-Sep-2017 20:22:05 Running org.openmrs.validator.EncounterTypeValidatorTest
21-Sep-2017 20:22:07 Tests run: 7, Failures: 0, Errors: 0, Skipped: 0, Time elapsed: 1.137 sec - in org.openmrs.validator.EncounterTypeValidatorTest
21-Sep-2017 20:22:07 Running org.openmrs.validator.DrugValidatorTest
21-Sep-2017 20:22:09 Tests run: 9, Failures: 0, Errors: 0, Skipped: 0, Time elapsed: 2.385 sec - in org.openmrs.validator.DrugValidatorTest
21-Sep-2017 20:22:09 Running org.openmrs.validator.HL7SourceValidatorTest
21-Sep-2017 20:22:10 Tests run: 2, Failures: 0, Errors: 0, Skipped: 0, Time elapsed: 1.337 sec - in org.openmrs.validator.HL7SourceValidatorTest
21-Sep-2017 20:22:10 Running org.openmrs.validator.EncounterValidatorTest
21-Sep-2017 20:22:12 Tests run: 10, Failures: 0, Errors: 0, Skipped: 0, Time elapsed: 1.467 sec - in org.openmrs.validator.EncounterValidatorTest
21-Sep-2017 20:22:12 Running org.openmrs.validator.ConceptNameTagValidatorTest
21-Sep-2017 20:22:14 Tests run: 7, Failures: 0, Errors: 0, Skipped: 0, Time elapsed: 2.378 sec - in org.openmrs.validator.ConceptNameTagValidatorTest
21-Sep-2017 20:22:14 Running org.openmrs.validator.ConceptMapTypeValidatorTest
21-Sep-2017 20:22:15 Tests run: 8, Failures: 0, Errors: 0, Skipped: 0, Time elapsed: 1.379 sec - in org.openmrs.validator.ConceptMapTypeValidatorTest
21-Sep-2017 20:22:15 Running org.openmrs.validator.TestOrderValidatorTest
21-Sep-2017 20:22:18 Tests run: 2, Failures: 0, Errors: 0, Skipped: 0, Time elapsed: 2.531 sec - in org.openmrs.validator.TestOrderValidatorTest
21-Sep-2017 20:22:18 Running org.openmrs.validator.ConceptDatatypeValidatorTest
21-Sep-2017 20:22:20 Tests run: 5, Failures: 0, Errors: 0, Skipped: 0, Time elapsed: 1.961 sec - in org.openmrs.validator.ConceptDatatypeValidatorTest
21-Sep-2017 20:22:20 Running org.openmrs.validator.ObsValidatorTest
21-Sep-2017 20:22:23 Tests run: 21, Failures: 0, Errors: 0, Skipped: 0, Time elapsed: 2.981 sec - in org.openmrs.validator.ObsValidatorTest
21-Sep-2017 20:22:23 Running org.openmrs.validator.LocationAttributeTypeValidatorTest
21-Sep-2017 20:22:24 Tests run: 6, Failures: 0, Errors: 0, Skipped: 0, Time elapsed: 1.499 sec - in org.openmrs.validator.LocationAttributeTypeValidatorTest
21-Sep-2017 20:22:24 Running org.openmrs.validator.ValidateUtilTest
21-Sep-2017 20:22:27 Tests run: 8, Failures: 0, Errors: 0, Skipped: 0, Time elapsed: 2.549 sec - in org.openmrs.validator.ValidateUtilTest
21-Sep-2017 20:22:27 Running org.openmrs.validator.PersonAddressValidatorTest
21-Sep-2017 20:22:29 Tests run: 10, Failures: 0, Errors: 0, Skipped: 0, Time elapsed: 2.066 sec - in org.openmrs.validator.PersonAddressValidatorTest
21-Sep-2017 20:22:29 Running org.openmrs.validator.SchedulerFormValidatorTest
21-Sep-2017 20:22:31 Tests run: 10, Failures: 0, Errors: 0, Skipped: 0, Time elapsed: 1.647 sec - in org.openmrs.validator.SchedulerFormValidatorTest
21-Sep-2017 20:22:31 Running org.openmrs.validator.DrugOrderValidatorTest
21-Sep-2017 20:22:36 Tests run: 36, Failures: 0, Errors: 0, Skipped: 0, Time elapsed: 5.012 sec - in org.openmrs.validator.DrugOrderValidatorTest
21-Sep-2017 20:22:36 Running org.openmrs.validator.PersonNameValidatorTest
21-Sep-2017 20:22:39 Tests run: 50, Failures: 0, Errors: 0, Skipped: 0, Time elapsed: 3.72 sec - in org.openmrs.validator.PersonNameValidatorTest
21-Sep-2017 20:22:39 Running org.openmrs.validator.ProgramValidatorTest
21-Sep-2017 20:22:41 Tests run: 8, Failures: 0, Errors: 0, Skipped: 0, Time elapsed: 1.53 sec - in org.openmrs.validator.ProgramValidatorTest
21-Sep-2017 20:22:41 Running org.openmrs.validator.OrderFrequencyValidatorTest
21-Sep-2017 20:22:43 Tests run: 9, Failures: 0, Errors: 0, Skipped: 0, Time elapsed: 1.68 sec - in org.openmrs.validator.OrderFrequencyValidatorTest
21-Sep-2017 20:22:43 Running org.openmrs.validator.ConceptAttributeTypeValidatorTest
21-Sep-2017 20:22:45 Tests run: 6, Failures: 0, Errors: 0, Skipped: 0, Time elapsed: 2.146 sec - in org.openmrs.validator.ConceptAttributeTypeValidatorTest
21-Sep-2017 20:22:45 Running org.openmrs.validator.ConceptClassValidatorTest
21-Sep-2017 20:22:46 Tests run: 6, Failures: 0, Errors: 0, Skipped: 0, Time elapsed: 1.353 sec - in org.openmrs.validator.ConceptClassValidatorTest
21-Sep-2017 20:22:46 Running org.openmrs.validator.PersonMergeLogValidatorTest
21-Sep-2017 20:22:48 Tests run: 6, Failures: 0, Errors: 0, Skipped: 0, Time elapsed: 1.734 sec - in org.openmrs.validator.PersonMergeLogValidatorTest
21-Sep-2017 20:22:48 Running org.openmrs.validator.PatientIdentifierTypeValidatorTest
21-Sep-2017 20:22:49 Tests run: 9, Failures: 0, Errors: 0, Skipped: 0, Time elapsed: 1.41 sec - in org.openmrs.validator.PatientIdentifierTypeValidatorTest
21-Sep-2017 20:22:49 Running org.openmrs.validator.AllergyValidatorTest
21-Sep-2017 20:22:52 Tests run: 9, Failures: 0, Errors: 0, Skipped: 0, Time elapsed: 2.328 sec - in org.openmrs.validator.AllergyValidatorTest
21-Sep-2017 20:22:52 Running org.openmrs.validator.RelationshipValidatorTest
21-Sep-2017 20:22:54 Tests run: 7, Failures: 0, Errors: 0, Skipped: 0, Time elapsed: 2.099 sec - in org.openmrs.validator.RelationshipValidatorTest
21-Sep-2017 20:22:54 Running org.openmrs.validator.PatientIdentifierValidatorTest
21-Sep-2017 20:22:57 Tests run: 20, Failures: 0, Errors: 0, Skipped: 0, Time elapsed: 3.416 sec - in org.openmrs.validator.PatientIdentifierValidatorTest
21-Sep-2017 20:22:57 Running org.openmrs.validator.OrderValidatorTest
21-Sep-2017 20:23:01 Tests run: 22, Failures: 0, Errors: 0, Skipped: 0, Time elapsed: 3.524 sec - in org.openmrs.validator.OrderValidatorTest
21-Sep-2017 20:23:01 Running org.openmrs.validator.VisitTypeValidatorTest
21-Sep-2017 20:23:03 Tests run: 2, Failures: 0, Errors: 0, Skipped: 0, Time elapsed: 2.099 sec - in org.openmrs.validator.VisitTypeValidatorTest
21-Sep-2017 20:23:03 Running org.openmrs.validator.ConceptValidatorTest
21-Sep-2017 20:23:11 Tests run: 30, Failures: 0, Errors: 0, Skipped: 0, Time elapsed: 8.103 sec - in org.openmrs.validator.ConceptValidatorTest
21-Sep-2017 20:23:11 Running org.openmrs.validator.StateConversionValidatorTest
21-Sep-2017 20:23:12 Tests run: 4, Failures: 0, Errors: 0, Skipped: 0, Time elapsed: 1.298 sec - in org.openmrs.validator.StateConversionValidatorTest
21-Sep-2017 20:23:12 Running org.openmrs.validator.BaseAttributeTypeValidatorTest
21-Sep-2017 20:23:19 Tests run: 9, Failures: 0, Errors: 0, Skipped: 0, Time elapsed: 7.252 sec - in org.openmrs.validator.BaseAttributeTypeValidatorTest
21-Sep-2017 20:23:19 Running org.openmrs.validator.LocationTagValidatorTest
21-Sep-2017 20:23:21 Tests run: 2, Failures: 0, Errors: 0, Skipped: 0, Time elapsed: 1.487 sec - in org.openmrs.validator.LocationTagValidatorTest
21-Sep-2017 20:23:21 Running org.openmrs.api.UserServiceTest
21-Sep-2017 20:23:33 Tests run: 85, Failures: 0, Errors: 0, Skipped: 1, Time elapsed: 12.405 sec - in org.openmrs.api.UserServiceTest
21-Sep-2017 20:23:33 Running org.openmrs.api.db.SerializedObjectDAOTest
21-Sep-2017 20:23:33 Tests run: 1, Failures: 0, Errors: 0, Skipped: 1, Time elapsed: 0.001 sec - in org.openmrs.api.db.SerializedObjectDAOTest
21-Sep-2017 20:23:33 Running org.openmrs.api.db.ConceptDAOTest
21-Sep-2017 20:23:36 Tests run: 13, Failures: 0, Errors: 0, Skipped: 2, Time elapsed: 2.136 sec - in org.openmrs.api.db.ConceptDAOTest
21-Sep-2017 20:23:36 Running org.openmrs.api.db.EncounterDAOTest
21-Sep-2017 20:23:37 Tests run: 4, Failures: 0, Errors: 0, Skipped: 0, Time elapsed: 1.239 sec - in org.openmrs.api.db.EncounterDAOTest
21-Sep-2017 20:23:37 Running org.openmrs.api.db.hibernate.ImmutableEntityInterceptorTest
21-Sep-2017 20:23:38 Tests run: 4, Failures: 0, Errors: 0, Skipped: 0, Time elapsed: 1.574 sec - in org.openmrs.api.db.hibernate.ImmutableEntityInterceptorTest
21-Sep-2017 20:23:38 Running org.openmrs.api.db.hibernate.ProviderDAOTest
21-Sep-2017 20:23:39 Tests run: 3, Failures: 0, Errors: 0, Skipped: 0, Time elapsed: 0.953 sec - in org.openmrs.api.db.hibernate.ProviderDAOTest
21-Sep-2017 20:23:39 Running org.openmrs.api.db.hibernate.HibernatePersonDAOTest
21-Sep-2017 20:23:43 Tests run: 41, Failures: 0, Errors: 0, Skipped: 0, Time elapsed: 3.968 sec - in org.openmrs.api.db.hibernate.HibernatePersonDAOTest
21-Sep-2017 20:23:43 Running org.openmrs.api.db.hibernate.HibernateLocationDAOTest
21-Sep-2017 20:23:45 Tests run: 3, Failures: 0, Errors: 0, Skipped: 0, Time elapsed: 1.436 sec - in org.openmrs.api.db.hibernate.HibernateLocationDAOTest
21-Sep-2017 20:23:45 Running org.openmrs.api.db.hibernate.PatientSearchCriteriaTest
21-Sep-2017 20:23:46 Tests run: 18, Failures: 0, Errors: 0, Skipped: 0, Time elapsed: 1.747 sec - in org.openmrs.api.db.hibernate.PatientSearchCriteriaTest
21-Sep-2017 20:23:46 Running org.openmrs.api.db.hibernate.DropMillisecondsHibernateInterceptorTest
21-Sep-2017 20:23:47 Tests run: 3, Failures: 0, Errors: 0, Skipped: 0, Time elapsed: 0.777 sec - in org.openmrs.api.db.hibernate.DropMillisecondsHibernateInterceptorTest
21-Sep-2017 20:23:47 Running org.openmrs.api.db.hibernate.PersonAttributeHelperTest
21-Sep-2017 20:23:49 Tests run: 5, Failures: 0, Errors: 0, Skipped: 0, Time elapsed: 1.462 sec - in org.openmrs.api.db.hibernate.PersonAttributeHelperTest
21-Sep-2017 20:23:49 Running org.openmrs.api.db.hibernate.HibernateOrderDAOTest
21-Sep-2017 20:23:51 Tests run: 1, Failures: 0, Errors: 0, Skipped: 0, Time elapsed: 2.655 sec - in org.openmrs.api.db.hibernate.HibernateOrderDAOTest
21-Sep-2017 20:23:51 Running org.openmrs.api.db.hibernate.AuditableInterceptorTest
21-Sep-2017 20:23:54 Tests run: 15, Failures: 0, Errors: 0, Skipped: 0, Time elapsed: 2.182 sec - in org.openmrs.api.db.hibernate.AuditableInterceptorTest
21-Sep-2017 20:23:54 Running org.openmrs.api.db.hibernate.HibernateConceptDAOTest
21-Sep-2017 20:24:02 Tests run: 11, Failures: 0, Errors: 0, Skipped: 0, Time elapsed: 8.044 sec - in org.openmrs.api.db.hibernate.HibernateConceptDAOTest
21-Sep-2017 20:24:02 Running org.openmrs.api.db.hibernate.HibernateObsDAOTest
21-Sep-2017 20:24:03 Tests run: 1, Failures: 0, Errors: 0, Skipped: 0, Time elapsed: 1.057 sec - in org.openmrs.api.db.hibernate.HibernateObsDAOTest
21-Sep-2017 20:24:03 Running org.openmrs.api.db.hibernate.HibernateProviderDAOTest
21-Sep-2017 20:24:04 Tests run: 3, Failures: 0, Errors: 0, Skipped: 0, Time elapsed: 1.106 sec - in org.openmrs.api.db.hibernate.HibernateProviderDAOTest
21-Sep-2017 20:24:04 Running org.openmrs.api.db.ProgramWorkflowDAOTest
21-Sep-2017 20:24:05 Tests run: 4, Failures: 0, Errors: 0, Skipped: 0, Time elapsed: 1.045 sec - in org.openmrs.api.db.ProgramWorkflowDAOTest
21-Sep-2017 20:24:05 Running org.openmrs.api.db.ContextDAOTest
21-Sep-2017 20:24:06 ERROR - HibernateContextDAO.authenticate(184) |2017-09-21 20:24:06,111| Unable to convert the global property security.allowedFailedLoginsBeforeLockoutto a valid integer. Using default value of 7
21-Sep-2017 20:24:06 ERROR - HibernateContextDAO.authenticate(184) |2017-09-21 20:24:06,200| Unable to convert the global property security.allowedFailedLoginsBeforeLockoutto a valid integer. Using default value of 7
21-Sep-2017 20:24:06 ERROR - HibernateContextDAO.authenticate(184) |2017-09-21 20:24:06,203| Unable to convert the global property security.allowedFailedLoginsBeforeLockoutto a valid integer. Using default value of 7
21-Sep-2017 20:24:06 ERROR - HibernateContextDAO.authenticate(184) |2017-09-21 20:24:06,205| Unable to convert the global property security.allowedFailedLoginsBeforeLockoutto a valid integer. Using default value of 7
21-Sep-2017 20:24:06 ERROR - HibernateContextDAO.authenticate(184) |2017-09-21 20:24:06,208| Unable to convert the global property security.allowedFailedLoginsBeforeLockoutto a valid integer. Using default value of 7
21-Sep-2017 20:24:06 ERROR - HibernateContextDAO.authenticate(184) |2017-09-21 20:24:06,210| Unable to convert the global property security.allowedFailedLoginsBeforeLockoutto a valid integer. Using default value of 7
21-Sep-2017 20:24:06 ERROR - HibernateContextDAO.authenticate(184) |2017-09-21 20:24:06,213| Unable to convert the global property security.allowedFailedLoginsBeforeLockoutto a valid integer. Using default value of 7
21-Sep-2017 20:24:06 ERROR - HibernateContextDAO.authenticate(184) |2017-09-21 20:24:06,216| Unable to convert the global property security.allowedFailedLoginsBeforeLockoutto a valid integer. Using default value of 7
21-Sep-2017 20:24:06 ERROR - HibernateContextDAO.authenticate(184) |2017-09-21 20:24:06,217| Unable to convert the global property security.allowedFailedLoginsBeforeLockoutto a valid integer. Using default value of 7
21-Sep-2017 20:24:06 ERROR - HibernateContextDAO.authenticate(184) |2017-09-21 20:24:06,219| Unable to convert the global property security.allowedFailedLoginsBeforeLockoutto a valid integer. Using default value of 7
21-Sep-2017 20:24:06 ERROR - HibernateContextDAO.authenticate(184) |2017-09-21 20:24:06,298| Unable to convert the global property security.allowedFailedLoginsBeforeLockoutto a valid integer. Using default value of 7
21-Sep-2017 20:24:06 ERROR - HibernateContextDAO.authenticate(184) |2017-09-21 20:24:06,392| Unable to convert the global property security.allowedFailedLoginsBeforeLockoutto a valid integer. Using default value of 7
21-Sep-2017 20:24:06 ERROR - HibernateContextDAO.authenticate(184) |2017-09-21 20:24:06,749| Unable to convert the global property security.allowedFailedLoginsBeforeLockoutto a valid integer. Using default value of 7
21-Sep-2017 20:24:06 ERROR - HibernateContextDAO.authenticate(184) |2017-09-21 20:24:06,752| Unable to convert the global property security.allowedFailedLoginsBeforeLockoutto a valid integer. Using default value of 7
21-Sep-2017 20:24:06 ERROR - HibernateContextDAO.authenticate(184) |2017-09-21 20:24:06,761| Unable to convert the global property security.allowedFailedLoginsBeforeLockoutto a valid integer. Using default value of 7
21-Sep-2017 20:24:06 ERROR - HibernateContextDAO.authenticate(184) |2017-09-21 20:24:06,763| Unable to convert the global property security.allowedFailedLoginsBeforeLockoutto a valid integer. Using default value of 7
21-Sep-2017 20:24:06 ERROR - HibernateContextDAO.authenticate(184) |2017-09-21 20:24:06,765| Unable to convert the global property security.allowedFailedLoginsBeforeLockoutto a valid integer. Using default value of 7
21-Sep-2017 20:24:06 ERROR - HibernateContextDAO.authenticate(184) |2017-09-21 20:24:06,767| Unable to convert the global property security.allowedFailedLoginsBeforeLockoutto a valid integer. Using default value of 7
21-Sep-2017 20:24:06 ERROR - HibernateContextDAO.authenticate(184) |2017-09-21 20:24:06,769| Unable to convert the global property security.allowedFailedLoginsBeforeLockoutto a valid integer. Using default value of 7
21-Sep-2017 20:24:06 ERROR - HibernateContextDAO.authenticate(184) |2017-09-21 20:24:06,836| Unable to convert the global property security.allowedFailedLoginsBeforeLockoutto a valid integer. Using default value of 7
21-Sep-2017 20:24:06 ERROR - HibernateContextDAO.authenticate(184) |2017-09-21 20:24:06,905| Unable to convert the global property security.allowedFailedLoginsBeforeLockoutto a valid integer. Using default value of 7
21-Sep-2017 20:24:08 Tests run: 21, Failures: 0, Errors: 0, Skipped: 0, Time elapsed: 3.264 sec - in org.openmrs.api.db.ContextDAOTest
21-Sep-2017 20:24:08 Running org.openmrs.api.db.PersonDAOTest
21-Sep-2017 20:24:09 Tests run: 3, Failures: 0, Errors: 0, Skipped: 0, Time elapsed: 1.182 sec - in org.openmrs.api.db.PersonDAOTest
21-Sep-2017 20:24:09 Running org.openmrs.api.db.VisitDAOTest
21-Sep-2017 20:24:11 Tests run: 3, Failures: 0, Errors: 0, Skipped: 0, Time elapsed: 1.309 sec - in org.openmrs.api.db.VisitDAOTest
21-Sep-2017 20:24:11 Running org.openmrs.api.db.PatientDAOTest
21-Sep-2017 20:24:18 WARN - HibernatePatientDAO.getDuplicatePatientsSQLString(556) |2017-09-21 20:24:18,027| Unidentified attribute: abcDef
21-Sep-2017 20:24:30 WARN - HibernatePatientDAO.getDuplicatePatientsSQLString(556) |2017-09-21 20:24:30,319| Unidentified attribute: abcDef
21-Sep-2017 20:24:30 Tests run: 141, Failures: 0, Errors: 0, Skipped: 0, Time elapsed: 19.869 sec - in org.openmrs.api.db.PatientDAOTest
21-Sep-2017 20:24:30 Running org.openmrs.api.db.UserDAOTest
21-Sep-2017 20:24:32 Tests run: 8, Failures: 0, Errors: 0, Skipped: 0, Time elapsed: 1.484 sec - in org.openmrs.api.db.UserDAOTest
21-Sep-2017 20:24:32 Running org.openmrs.api.OrderSetServiceTest
21-Sep-2017 20:24:34 Tests run: 12, Failures: 0, Errors: 0, Skipped: 0, Time elapsed: 2.087 sec - in org.openmrs.api.OrderSetServiceTest
21-Sep-2017 20:24:34 Running org.openmrs.api.PatientServiceTest
21-Sep-2017 20:24:57 Tests run: 163, Failures: 0, Errors: 0, Skipped: 2, Time elapsed: 22.546 sec - in org.openmrs.api.PatientServiceTest
21-Sep-2017 20:24:57 Running org.openmrs.api.impl.ConceptServiceImplTest
21-Sep-2017 20:24:58 Tests run: 8, Failures: 0, Errors: 0, Skipped: 0, Time elapsed: 1.446 sec - in org.openmrs.api.impl.ConceptServiceImplTest
21-Sep-2017 20:24:58 Running org.openmrs.api.impl.SerializationServiceImplTest
21-Sep-2017 20:24:58 Tests run: 1, Failures: 0, Errors: 0, Skipped: 0, Time elapsed: 0.071 sec - in org.openmrs.api.impl.SerializationServiceImplTest
21-Sep-2017 20:24:58 Running org.openmrs.api.ObsServiceTest
21-Sep-2017 20:25:04 ERROR - ImageHandler.getObs(79) |2017-09-21 20:25:04,102| Trying to read file: /home/bamboo-agent-1/bamboo-agent/.agent_tmp/TRUNK-OC2-JOB1/appdir-for-unit-tests-8853771709270985203/complex_obs/openmrs_logo_small.gif
21-Sep-2017 20:25:04 javax.imageio.IIOException: Can't read input file!
21-Sep-2017 20:25:04         at javax.imageio.ImageIO.read(ImageIO.java:1301)
21-Sep-2017 20:25:04         at org.openmrs.obs.handler.ImageHandler.getObs(ImageHandler.java:76)
21-Sep-2017 20:25:04         at org.openmrs.api.impl.ObsServiceImpl.getComplexObs(ObsServiceImpl.java:480)
21-Sep-2017 20:25:04         at sun.reflect.NativeMethodAccessorImpl.invoke0(Native Method)
21-Sep-2017 20:25:04         at sun.reflect.NativeMethodAccessorImpl.invoke(NativeMethodAccessorImpl.java:62)
21-Sep-2017 20:25:04         at sun.reflect.DelegatingMethodAccessorImpl.invoke(DelegatingMethodAccessorImpl.java:43)
21-Sep-2017 20:25:04         at java.lang.reflect.Method.invoke(Method.java:498)
21-Sep-2017 20:25:04         at org.springframework.aop.support.AopUtils.invokeJoinpointUsingReflection(AopUtils.java:317)
21-Sep-2017 20:25:04         at org.springframework.aop.framework.ReflectiveMethodInvocation.invokeJoinpoint(ReflectiveMethodInvocation.java:190)
21-Sep-2017 20:25:04         at org.springframework.aop.framework.ReflectiveMethodInvocation.proceed(ReflectiveMethodInvocation.java:157)
21-Sep-2017 20:25:04         at org.springframework.transaction.interceptor.TransactionInterceptor$1.proceedWithInvocation(TransactionInterceptor.java:99)
21-Sep-2017 20:25:04         at org.springframework.transaction.interceptor.TransactionAspectSupport.invokeWithinTransaction(TransactionAspectSupport.java:281)
21-Sep-2017 20:25:04         at org.springframework.transaction.interceptor.TransactionInterceptor.invoke(TransactionInterceptor.java:96)
21-Sep-2017 20:25:04         at org.springframework.aop.framework.ReflectiveMethodInvocation.proceed(ReflectiveMethodInvocation.java:179)
21-Sep-2017 20:25:04         at org.springframework.aop.framework.JdkDynamicAopProxy.invoke(JdkDynamicAopProxy.java:207)
21-Sep-2017 20:25:04         at com.sun.proxy.$Proxy73.getComplexObs(Unknown Source)
21-Sep-2017 20:25:04         at sun.reflect.NativeMethodAccessorImpl.invoke0(Native Method)
21-Sep-2017 20:25:04         at sun.reflect.NativeMethodAccessorImpl.invoke(NativeMethodAccessorImpl.java:62)
21-Sep-2017 20:25:04         at sun.reflect.DelegatingMethodAccessorImpl.invoke(DelegatingMethodAccessorImpl.java:43)
21-Sep-2017 20:25:04         at java.lang.reflect.Method.invoke(Method.java:498)
21-Sep-2017 20:25:04         at org.springframework.aop.support.AopUtils.invokeJoinpointUsingReflection(AopUtils.java:317)
21-Sep-2017 20:25:04         at org.springframework.aop.framework.ReflectiveMethodInvocation.invokeJoinpoint(ReflectiveMethodInvocation.java:190)
21-Sep-2017 20:25:04         at org.springframework.aop.framework.ReflectiveMethodInvocation.proceed(ReflectiveMethodInvocation.java:157)
21-Sep-2017 20:25:04         at org.openmrs.aop.LoggingAdvice.invoke(LoggingAdvice.java:121)
21-Sep-2017 20:25:04         at org.springframework.aop.framework.ReflectiveMethodInvocation.proceed(ReflectiveMethodInvocation.java:179)
21-Sep-2017 20:25:04         at org.springframework.aop.framework.adapter.MethodBeforeAdviceInterceptor.invoke(MethodBeforeAdviceInterceptor.java:52)
21-Sep-2017 20:25:04         at org.springframework.aop.framework.ReflectiveMethodInvocation.proceed(ReflectiveMethodInvocation.java:179)
21-Sep-2017 20:25:04         at org.springframework.aop.framework.adapter.MethodBeforeAdviceInterceptor.invoke(MethodBeforeAdviceInterceptor.java:52)
21-Sep-2017 20:25:04         at org.springframework.aop.framework.ReflectiveMethodInvocation.proceed(ReflectiveMethodInvocation.java:179)
21-Sep-2017 20:25:04         at org.springframework.aop.framework.JdkDynamicAopProxy.invoke(JdkDynamicAopProxy.java:207)
21-Sep-2017 20:25:04         at com.sun.proxy.$Proxy74.getComplexObs(Unknown Source)
21-Sep-2017 20:25:04         at org.openmrs.api.ObsServiceTest.purgeObs_shouldDeleteTheGivenObsFromTheDatabase(ObsServiceTest.java:1353)
21-Sep-2017 20:25:04         at sun.reflect.NativeMethodAccessorImpl.invoke0(Native Method)
21-Sep-2017 20:25:04         at sun.reflect.NativeMethodAccessorImpl.invoke(NativeMethodAccessorImpl.java:62)
21-Sep-2017 20:25:04         at sun.reflect.DelegatingMethodAccessorImpl.invoke(DelegatingMethodAccessorImpl.java:43)
21-Sep-2017 20:25:04         at java.lang.reflect.Method.invoke(Method.java:498)
21-Sep-2017 20:25:04         at org.junit.runners.model.FrameworkMethod$1.runReflectiveCall(FrameworkMethod.java:47)
21-Sep-2017 20:25:04         at org.junit.internal.runners.model.ReflectiveCallable.run(ReflectiveCallable.java:12)
21-Sep-2017 20:25:04         at org.junit.runners.model.FrameworkMethod.invokeExplosively(FrameworkMethod.java:44)
21-Sep-2017 20:25:04         at org.junit.internal.runners.statements.InvokeMethod.evaluate(InvokeMethod.java:17)
21-Sep-2017 20:25:04         at org.junit.internal.runners.statements.RunBefores.evaluate(RunBefores.java:26)
21-Sep-2017 20:25:04         at org.springframework.test.context.junit4.statements.RunBeforeTestMethodCallbacks.evaluate(RunBeforeTestMethodCallbacks.java:73)
21-Sep-2017 20:25:04         at org.junit.internal.runners.statements.RunAfters.evaluate(RunAfters.java:27)
21-Sep-2017 20:25:04         at org.springframework.test.context.junit4.statements.RunAfterTestMethodCallbacks.evaluate(RunAfterTestMethodCallbacks.java:82)
21-Sep-2017 20:25:04         at org.junit.rules.ExpectedException$ExpectedExceptionStatement.evaluate(ExpectedException.java:168)
21-Sep-2017 20:25:04         at org.junit.rules.RunRules.evaluate(RunRules.java:20)
21-Sep-2017 20:25:04         at org.springframework.test.context.junit4.statements.SpringRepeat.evaluate(SpringRepeat.java:73)
21-Sep-2017 20:25:04         at org.junit.runners.ParentRunner.runLeaf(ParentRunner.java:271)
21-Sep-2017 20:25:04         at org.springframework.test.context.junit4.SpringJUnit4ClassRunner.runChild(SpringJUnit4ClassRunner.java:217)
21-Sep-2017 20:25:04         at org.springframework.test.context.junit4.SpringJUnit4ClassRunner.runChild(SpringJUnit4ClassRunner.java:83)
21-Sep-2017 20:25:04         at org.junit.runners.ParentRunner$3.run(ParentRunner.java:238)
21-Sep-2017 20:25:04         at org.junit.runners.ParentRunner$1.schedule(ParentRunner.java:63)
21-Sep-2017 20:25:04         at org.junit.runners.ParentRunner.runChildren(ParentRunner.java:236)
21-Sep-2017 20:25:04         at org.junit.runners.ParentRunner.access$000(ParentRunner.java:53)
21-Sep-2017 20:25:04         at org.junit.runners.ParentRunner$2.evaluate(ParentRunner.java:229)
21-Sep-2017 20:25:04         at org.springframework.test.context.junit4.statements.RunBeforeTestClassCallbacks.evaluate(RunBeforeTestClassCallbacks.java:61)
21-Sep-2017 20:25:04         at org.junit.internal.runners.statements.RunAfters.evaluate(RunAfters.java:27)
21-Sep-2017 20:25:04         at org.springframework.test.context.junit4.statements.RunAfterTestClassCallbacks.evaluate(RunAfterTestClassCallbacks.java:68)
21-Sep-2017 20:25:04         at org.junit.runners.ParentRunner.run(ParentRunner.java:309)
21-Sep-2017 20:25:04         at org.springframework.test.context.junit4.SpringJUnit4ClassRunner.run(SpringJUnit4ClassRunner.java:163)
21-Sep-2017 20:25:04         at org.apache.maven.surefire.junit4.JUnit4Provider.execute(JUnit4Provider.java:283)
21-Sep-2017 20:25:04         at org.apache.maven.surefire.junit4.JUnit4Provider.executeWithRerun(JUnit4Provider.java:173)
21-Sep-2017 20:25:04         at org.apache.maven.surefire.junit4.JUnit4Provider.executeTestSet(JUnit4Provider.java:153)
21-Sep-2017 20:25:04         at org.apache.maven.surefire.junit4.JUnit4Provider.invoke(JUnit4Provider.java:128)
21-Sep-2017 20:25:04         at org.apache.maven.surefire.booter.ForkedBooter.invokeProviderInSameClassLoader(ForkedBooter.java:203)
21-Sep-2017 20:25:04         at org.apache.maven.surefire.booter.ForkedBooter.runSuitesInProcess(ForkedBooter.java:155)
21-Sep-2017 20:25:04         at org.apache.maven.surefire.booter.ForkedBooter.main(ForkedBooter.java:103)
21-Sep-2017 20:25:04 ERROR - ImageHandler.getObs(96) |2017-09-21 20:25:04,115| Image /home/bamboo-agent-1/bamboo-agent/.agent_tmp/TRUNK-OC2-JOB1/appdir-for-unit-tests-8853771709270985203/complex_obs/openmrs_logo_small.gif was not found
21-Sep-2017 20:25:04 java.io.FileNotFoundException: /home/bamboo-agent-1/bamboo-agent/.agent_tmp/TRUNK-OC2-JOB1/appdir-for-unit-tests-8853771709270985203/complex_obs/openmrs_logo_small.gif (No such file or directory)
21-Sep-2017 20:25:04         at java.io.RandomAccessFile.open0(Native Method)
21-Sep-2017 20:25:04         at java.io.RandomAccessFile.open(RandomAccessFile.java:316)
21-Sep-2017 20:25:04         at java.io.RandomAccessFile.<init>(RandomAccessFile.java:243)
21-Sep-2017 20:25:04         at javax.imageio.stream.FileImageInputStream.<init>(FileImageInputStream.java:73)
21-Sep-2017 20:25:04         at org.openmrs.obs.handler.ImageHandler.getObs(ImageHandler.java:86)
21-Sep-2017 20:25:04         at org.openmrs.api.impl.ObsServiceImpl.getComplexObs(ObsServiceImpl.java:480)
21-Sep-2017 20:25:04         at sun.reflect.NativeMethodAccessorImpl.invoke0(Native Method)
21-Sep-2017 20:25:04         at sun.reflect.NativeMethodAccessorImpl.invoke(NativeMethodAccessorImpl.java:62)
21-Sep-2017 20:25:04         at sun.reflect.DelegatingMethodAccessorImpl.invoke(DelegatingMethodAccessorImpl.java:43)
21-Sep-2017 20:25:04         at java.lang.reflect.Method.invoke(Method.java:498)
21-Sep-2017 20:25:04         at org.springframework.aop.support.AopUtils.invokeJoinpointUsingReflection(AopUtils.java:317)
21-Sep-2017 20:25:04         at org.springframework.aop.framework.ReflectiveMethodInvocation.invokeJoinpoint(ReflectiveMethodInvocation.java:190)
21-Sep-2017 20:25:04         at org.springframework.aop.framework.ReflectiveMethodInvocation.proceed(ReflectiveMethodInvocation.java:157)
21-Sep-2017 20:25:04         at org.springframework.transaction.interceptor.TransactionInterceptor$1.proceedWithInvocation(TransactionInterceptor.java:99)
21-Sep-2017 20:25:04         at org.springframework.transaction.interceptor.TransactionAspectSupport.invokeWithinTransaction(TransactionAspectSupport.java:281)
21-Sep-2017 20:25:04         at org.springframework.transaction.interceptor.TransactionInterceptor.invoke(TransactionInterceptor.java:96)
21-Sep-2017 20:25:04         at org.springframework.aop.framework.ReflectiveMethodInvocation.proceed(ReflectiveMethodInvocation.java:179)
21-Sep-2017 20:25:04         at org.springframework.aop.framework.JdkDynamicAopProxy.invoke(JdkDynamicAopProxy.java:207)
21-Sep-2017 20:25:04         at com.sun.proxy.$Proxy73.getComplexObs(Unknown Source)
21-Sep-2017 20:25:04         at sun.reflect.NativeMethodAccessorImpl.invoke0(Native Method)
21-Sep-2017 20:25:04         at sun.reflect.NativeMethodAccessorImpl.invoke(NativeMethodAccessorImpl.java:62)
21-Sep-2017 20:25:04         at sun.reflect.DelegatingMethodAccessorImpl.invoke(DelegatingMethodAccessorImpl.java:43)
21-Sep-2017 20:25:04         at java.lang.reflect.Method.invoke(Method.java:498)
21-Sep-2017 20:25:04         at org.springframework.aop.support.AopUtils.invokeJoinpointUsingReflection(AopUtils.java:317)
21-Sep-2017 20:25:04         at org.springframework.aop.framework.ReflectiveMethodInvocation.invokeJoinpoint(ReflectiveMethodInvocation.java:190)
21-Sep-2017 20:25:04         at org.springframework.aop.framework.ReflectiveMethodInvocation.proceed(ReflectiveMethodInvocation.java:157)
21-Sep-2017 20:25:04         at org.openmrs.aop.LoggingAdvice.invoke(LoggingAdvice.java:121)
21-Sep-2017 20:25:04         at org.springframework.aop.framework.ReflectiveMethodInvocation.proceed(ReflectiveMethodInvocation.java:179)
21-Sep-2017 20:25:04         at org.springframework.aop.framework.adapter.MethodBeforeAdviceInterceptor.invoke(MethodBeforeAdviceInterceptor.java:52)
21-Sep-2017 20:25:04         at org.springframework.aop.framework.ReflectiveMethodInvocation.proceed(ReflectiveMethodInvocation.java:179)
21-Sep-2017 20:25:04         at org.springframework.aop.framework.adapter.MethodBeforeAdviceInterceptor.invoke(MethodBeforeAdviceInterceptor.java:52)
21-Sep-2017 20:25:04         at org.springframework.aop.framework.ReflectiveMethodInvocation.proceed(ReflectiveMethodInvocation.java:179)
21-Sep-2017 20:25:04         at org.springframework.aop.framework.JdkDynamicAopProxy.invoke(JdkDynamicAopProxy.java:207)
21-Sep-2017 20:25:04         at com.sun.proxy.$Proxy74.getComplexObs(Unknown Source)
21-Sep-2017 20:25:04         at org.openmrs.api.ObsServiceTest.purgeObs_shouldDeleteTheGivenObsFromTheDatabase(ObsServiceTest.java:1353)
21-Sep-2017 20:25:04         at sun.reflect.NativeMethodAccessorImpl.invoke0(Native Method)
21-Sep-2017 20:25:04         at sun.reflect.NativeMethodAccessorImpl.invoke(NativeMethodAccessorImpl.java:62)
21-Sep-2017 20:25:04         at sun.reflect.DelegatingMethodAccessorImpl.invoke(DelegatingMethodAccessorImpl.java:43)
21-Sep-2017 20:25:04         at java.lang.reflect.Method.invoke(Method.java:498)
21-Sep-2017 20:25:04         at org.junit.runners.model.FrameworkMethod$1.runReflectiveCall(FrameworkMethod.java:47)
21-Sep-2017 20:25:04         at org.junit.internal.runners.model.ReflectiveCallable.run(ReflectiveCallable.java:12)
21-Sep-2017 20:25:04         at org.junit.runners.model.FrameworkMethod.invokeExplosively(FrameworkMethod.java:44)
21-Sep-2017 20:25:04         at org.junit.internal.runners.statements.InvokeMethod.evaluate(InvokeMethod.java:17)
21-Sep-2017 20:25:04         at org.junit.internal.runners.statements.RunBefores.evaluate(RunBefores.java:26)
21-Sep-2017 20:25:04         at org.springframework.test.context.junit4.statements.RunBeforeTestMethodCallbacks.evaluate(RunBeforeTestMethodCallbacks.java:73)
21-Sep-2017 20:25:04         at org.junit.internal.runners.statements.RunAfters.evaluate(RunAfters.java:27)
21-Sep-2017 20:25:04         at org.springframework.test.context.junit4.statements.RunAfterTestMethodCallbacks.evaluate(RunAfterTestMethodCallbacks.java:82)
21-Sep-2017 20:25:04         at org.junit.rules.ExpectedException$ExpectedExceptionStatement.evaluate(ExpectedException.java:168)
21-Sep-2017 20:25:04         at org.junit.rules.RunRules.evaluate(RunRules.java:20)
21-Sep-2017 20:25:04         at org.springframework.test.context.junit4.statements.SpringRepeat.evaluate(SpringRepeat.java:73)
21-Sep-2017 20:25:04         at org.junit.runners.ParentRunner.runLeaf(ParentRunner.java:271)
21-Sep-2017 20:25:04         at org.springframework.test.context.junit4.SpringJUnit4ClassRunner.runChild(SpringJUnit4ClassRunner.java:217)
21-Sep-2017 20:25:04         at org.springframework.test.context.junit4.SpringJUnit4ClassRunner.runChild(SpringJUnit4ClassRunner.java:83)
21-Sep-2017 20:25:04         at org.junit.runners.ParentRunner$3.run(ParentRunner.java:238)
21-Sep-2017 20:25:04         at org.junit.runners.ParentRunner$1.schedule(ParentRunner.java:63)
21-Sep-2017 20:25:04         at org.junit.runners.ParentRunner.runChildren(ParentRunner.java:236)
21-Sep-2017 20:25:04         at org.junit.runners.ParentRunner.access$000(ParentRunner.java:53)
21-Sep-2017 20:25:04         at org.junit.runners.ParentRunner$2.evaluate(ParentRunner.java:229)
21-Sep-2017 20:25:04         at org.springframework.test.context.junit4.statements.RunBeforeTestClassCallbacks.evaluate(RunBeforeTestClassCallbacks.java:61)
21-Sep-2017 20:25:04         at org.junit.internal.runners.statements.RunAfters.evaluate(RunAfters.java:27)
21-Sep-2017 20:25:04         at org.springframework.test.context.junit4.statements.RunAfterTestClassCallbacks.evaluate(RunAfterTestClassCallbacks.java:68)
21-Sep-2017 20:25:04         at org.junit.runners.ParentRunner.run(ParentRunner.java:309)
21-Sep-2017 20:25:04         at org.springframework.test.context.junit4.SpringJUnit4ClassRunner.run(SpringJUnit4ClassRunner.java:163)
21-Sep-2017 20:25:04         at org.apache.maven.surefire.junit4.JUnit4Provider.execute(JUnit4Provider.java:283)
21-Sep-2017 20:25:04         at org.apache.maven.surefire.junit4.JUnit4Provider.executeWithRerun(JUnit4Provider.java:173)
21-Sep-2017 20:25:04         at org.apache.maven.surefire.junit4.JUnit4Provider.executeTestSet(JUnit4Provider.java:153)
21-Sep-2017 20:25:04         at org.apache.maven.surefire.junit4.JUnit4Provider.invoke(JUnit4Provider.java:128)
21-Sep-2017 20:25:04         at org.apache.maven.surefire.booter.ForkedBooter.invokeProviderInSameClassLoader(ForkedBooter.java:203)
21-Sep-2017 20:25:04         at org.apache.maven.surefire.booter.ForkedBooter.runSuitesInProcess(ForkedBooter.java:155)
21-Sep-2017 20:25:04         at org.apache.maven.surefire.booter.ForkedBooter.main(ForkedBooter.java:103)
21-Sep-2017 20:25:05 Tests run: 75, Failures: 0, Errors: 0, Skipped: 0, Time elapsed: 6.858 sec - in org.openmrs.api.ObsServiceTest
21-Sep-2017 20:25:05 Running org.openmrs.api.ProviderServiceTest
21-Sep-2017 20:25:09 Tests run: 40, Failures: 0, Errors: 0, Skipped: 2, Time elapsed: 3.977 sec - in org.openmrs.api.ProviderServiceTest
21-Sep-2017 20:25:09 Running org.openmrs.api.CohortServiceTest
21-Sep-2017 20:25:12 Tests run: 24, Failures: 0, Errors: 0, Skipped: 0, Time elapsed: 2.731 sec - in org.openmrs.api.CohortServiceTest
21-Sep-2017 20:25:12 Running org.openmrs.api.ProgramWorkflowServiceTest
21-Sep-2017 20:25:15 Tests run: 25, Failures: 0, Errors: 0, Skipped: 0, Time elapsed: 3.008 sec - in org.openmrs.api.ProgramWorkflowServiceTest
21-Sep-2017 20:25:15 Running org.openmrs.api.OrderServiceTest
21-Sep-2017 20:25:30 Tests run: 169, Failures: 0, Errors: 0, Skipped: 3, Time elapsed: 14.897 sec - in org.openmrs.api.OrderServiceTest
21-Sep-2017 20:25:30 Running org.openmrs.api.handler.OpenmrsMetadataSaveHandlerTest
21-Sep-2017 20:25:30 Tests run: 2, Failures: 0, Errors: 0, Skipped: 0, Time elapsed: 0.113 sec - in org.openmrs.api.handler.OpenmrsMetadataSaveHandlerTest
21-Sep-2017 20:25:30 Running org.openmrs.api.handler.OpenmrsObjectSaveHandlerTest
21-Sep-2017 20:25:30 Tests run: 5, Failures: 0, Errors: 0, Skipped: 0, Time elapsed: 0.304 sec - in org.openmrs.api.handler.OpenmrsObjectSaveHandlerTest
21-Sep-2017 20:25:30 Running org.openmrs.api.handler.RequiredReasonVoidSaveHandlerTest
21-Sep-2017 20:25:31 Tests run: 5, Failures: 0, Errors: 0, Skipped: 0, Time elapsed: 0.996 sec - in org.openmrs.api.handler.RequiredReasonVoidSaveHandlerTest
21-Sep-2017 20:25:31 Running org.openmrs.api.handler.BaseUnretireHandlerTest
21-Sep-2017 20:25:31 Tests run: 6, Failures: 0, Errors: 0, Skipped: 0, Time elapsed: 0.355 sec - in org.openmrs.api.handler.BaseUnretireHandlerTest
21-Sep-2017 20:25:31 Running org.openmrs.api.handler.BaseUnvoidHandlerTest
21-Sep-2017 20:25:32 Tests run: 6, Failures: 0, Errors: 0, Skipped: 0, Time elapsed: 0.35 sec - in org.openmrs.api.handler.BaseUnvoidHandlerTest
21-Sep-2017 20:25:32 Running org.openmrs.api.handler.ConceptNameSaveHandlerTest
21-Sep-2017 20:25:33 Tests run: 4, Failures: 0, Errors: 0, Skipped: 0, Time elapsed: 1.307 sec - in org.openmrs.api.handler.ConceptNameSaveHandlerTest
21-Sep-2017 20:25:33 Running org.openmrs.api.handler.BaseVoidHandlerTest
21-Sep-2017 20:25:33 Tests run: 8, Failures: 0, Errors: 0, Skipped: 0, Time elapsed: 0.464 sec - in org.openmrs.api.handler.BaseVoidHandlerTest
21-Sep-2017 20:25:33 Running org.openmrs.api.handler.ExistingOrNewVisitAssignmentHandlerTest
21-Sep-2017 20:25:35 Tests run: 5, Failures: 0, Errors: 0, Skipped: 0, Time elapsed: 1.451 sec - in org.openmrs.api.handler.ExistingOrNewVisitAssignmentHandlerTest
21-Sep-2017 20:25:35 Running org.openmrs.api.handler.PatientDataUnvoidHandlerTest
21-Sep-2017 20:25:37 Tests run: 2, Failures: 0, Errors: 0, Skipped: 0, Time elapsed: 2.094 sec - in org.openmrs.api.handler.PatientDataUnvoidHandlerTest
21-Sep-2017 20:25:37 Running org.openmrs.api.handler.PersonVoidHandlerTest
21-Sep-2017 20:25:38 Tests run: 8, Failures: 0, Errors: 0, Skipped: 0, Time elapsed: 1.454 sec - in org.openmrs.api.handler.PersonVoidHandlerTest
21-Sep-2017 20:25:38 Running org.openmrs.api.handler.PersonUnvoidHandlerTest
21-Sep-2017 20:25:39 Tests run: 6, Failures: 0, Errors: 0, Skipped: 0, Time elapsed: 0.366 sec - in org.openmrs.api.handler.PersonUnvoidHandlerTest
21-Sep-2017 20:25:39 Running org.openmrs.api.handler.BaseRetireHandlerTest
21-Sep-2017 20:25:39 Tests run: 8, Failures: 0, Errors: 0, Skipped: 0, Time elapsed: 0.489 sec - in org.openmrs.api.handler.BaseRetireHandlerTest
21-Sep-2017 20:25:39 Running org.openmrs.api.handler.PatientDataVoidHandlerTest
21-Sep-2017 20:25:40 Tests run: 1, Failures: 0, Errors: 0, Skipped: 0, Time elapsed: 0.677 sec - in org.openmrs.api.handler.PatientDataVoidHandlerTest
21-Sep-2017 20:25:40 Running org.openmrs.api.handler.RequireVoidReasonVoidHandlerTest
21-Sep-2017 20:25:41 Tests run: 5, Failures: 0, Errors: 0, Skipped: 0, Time elapsed: 0.959 sec - in org.openmrs.api.handler.RequireVoidReasonVoidHandlerTest
21-Sep-2017 20:25:41 Running org.openmrs.api.handler.ExistingVisitAssignmentHandlerTest
21-Sep-2017 20:25:42 Tests run: 3, Failures: 0, Errors: 0, Skipped: 0, Time elapsed: 0.917 sec - in org.openmrs.api.handler.ExistingVisitAssignmentHandlerTest
21-Sep-2017 20:25:42 Running org.openmrs.api.FormServiceTest
21-Sep-2017 20:25:45 Tests run: 40, Failures: 0, Errors: 0, Skipped: 0, Time elapsed: 3.604 sec - in org.openmrs.api.FormServiceTest
21-Sep-2017 20:25:45 Running org.openmrs.api.PatientServiceAllergyTest
21-Sep-2017 20:25:48 Tests run: 16, Failures: 0, Errors: 0, Skipped: 0, Time elapsed: 2.645 sec - in org.openmrs.api.PatientServiceAllergyTest
21-Sep-2017 20:25:48 Running org.openmrs.api.VisitServiceTest
21-Sep-2017 20:25:53 ERROR - AbstractBatchImpl.clearBatch(183) |2017-09-21 20:25:53,861| HHH000352: Unable to release batch statement...
21-Sep-2017 20:25:54 Tests run: 60, Failures: 0, Errors: 0, Skipped: 0, Time elapsed: 6.378 sec - in org.openmrs.api.VisitServiceTest
21-Sep-2017 20:25:54 Running org.openmrs.api.NoteServiceTest
21-Sep-2017 20:25:54 Tests run: 1, Failures: 0, Errors: 0, Skipped: 1, Time elapsed: 0 sec - in org.openmrs.api.NoteServiceTest
21-Sep-2017 20:25:54 Running org.openmrs.api.AdministrationServiceTest
21-Sep-2017 20:26:00 Tests run: 53, Failures: 0, Errors: 0, Skipped: 4, Time elapsed: 5.011 sec - in org.openmrs.api.AdministrationServiceTest
21-Sep-2017 20:26:00 Running org.openmrs.api.context.ContextTest
21-Sep-2017 20:26:02 Tests run: 16, Failures: 0, Errors: 0, Skipped: 0, Time elapsed: 2.225 sec - in org.openmrs.api.context.ContextTest
21-Sep-2017 20:26:02 Running org.openmrs.api.context.ContextWithModuleTest
21-Sep-2017 20:26:03 Tests run: 1, Failures: 0, Errors: 0, Skipped: 0, Time elapsed: 1.1 sec - in org.openmrs.api.context.ContextWithModuleTest
21-Sep-2017 20:26:03 Running org.openmrs.api.context.DaemonTest
21-Sep-2017 20:26:05 Tests run: 7, Failures: 0, Errors: 0, Skipped: 0, Time elapsed: 2.418 sec - in org.openmrs.api.context.DaemonTest
21-Sep-2017 20:26:05 Running org.openmrs.api.OpenmrsServiceTest
21-Sep-2017 20:26:05 Tests run: 1, Failures: 0, Errors: 0, Skipped: 1, Time elapsed: 0 sec - in org.openmrs.api.OpenmrsServiceTest
21-Sep-2017 20:26:05 Running org.openmrs.api.LocationServiceTest
21-Sep-2017 20:26:12 Tests run: 70, Failures: 0, Errors: 0, Skipped: 0, Time elapsed: 6.971 sec - in org.openmrs.api.LocationServiceTest
21-Sep-2017 20:26:12 Running org.openmrs.api.ProgramWorkflowServiceUnitTest
21-Sep-2017 20:26:12 Tests run: 3, Failures: 0, Errors: 0, Skipped: 0, Time elapsed: 0.205 sec - in org.openmrs.api.ProgramWorkflowServiceUnitTest
21-Sep-2017 20:26:12 Running org.openmrs.api.DatatypeServiceTest
21-Sep-2017 20:26:14 Tests run: 2, Failures: 0, Errors: 0, Skipped: 0, Time elapsed: 1.282 sec - in org.openmrs.api.DatatypeServiceTest
21-Sep-2017 20:26:14 Running org.openmrs.api.ConceptServiceTest
21-Sep-2017 20:28:45 Tests run: 236, Failures: 0, Errors: 0, Skipped: 1, Time elapsed: 150.835 sec - in org.openmrs.api.ConceptServiceTest
21-Sep-2017 20:28:45 Running org.openmrs.api.EncounterServiceTest
21-Sep-2017 20:28:47 ERROR - ImageHandler.getObs(79) |2017-09-21 20:28:47,883| Trying to read file: /home/bamboo-agent-1/bamboo-agent/.agent_tmp/TRUNK-OC2-JOB1/appdir-for-unit-tests-7371319967205943523/complex_obs/file1.jpg
21-Sep-2017 20:28:47 javax.imageio.IIOException: Can't read input file!
21-Sep-2017 20:28:47         at javax.imageio.ImageIO.read(ImageIO.java:1301)
21-Sep-2017 20:28:47         at org.openmrs.obs.handler.ImageHandler.getObs(ImageHandler.java:76)
21-Sep-2017 20:28:47         at org.openmrs.api.impl.ObsServiceImpl.getObs(ObsServiceImpl.java:254)
21-Sep-2017 20:28:47         at sun.reflect.GeneratedMethodAccessor669.invoke(Unknown Source)
21-Sep-2017 20:28:47         at sun.reflect.DelegatingMethodAccessorImpl.invoke(DelegatingMethodAccessorImpl.java:43)
21-Sep-2017 20:28:47         at java.lang.reflect.Method.invoke(Method.java:498)
21-Sep-2017 20:28:47         at org.springframework.aop.support.AopUtils.invokeJoinpointUsingReflection(AopUtils.java:317)
21-Sep-2017 20:28:47         at org.springframework.aop.framework.ReflectiveMethodInvocation.invokeJoinpoint(ReflectiveMethodInvocation.java:190)
21-Sep-2017 20:28:47         at org.springframework.aop.framework.ReflectiveMethodInvocation.proceed(ReflectiveMethodInvocation.java:157)
21-Sep-2017 20:28:47         at org.springframework.transaction.interceptor.TransactionInterceptor$1.proceedWithInvocation(TransactionInterceptor.java:99)
21-Sep-2017 20:28:47         at org.springframework.transaction.interceptor.TransactionAspectSupport.invokeWithinTransaction(TransactionAspectSupport.java:281)
21-Sep-2017 20:28:47         at org.springframework.transaction.interceptor.TransactionInterceptor.invoke(TransactionInterceptor.java:96)
21-Sep-2017 20:28:47         at org.springframework.aop.framework.ReflectiveMethodInvocation.proceed(ReflectiveMethodInvocation.java:179)
21-Sep-2017 20:28:47         at org.springframework.aop.framework.JdkDynamicAopProxy.invoke(JdkDynamicAopProxy.java:207)
21-Sep-2017 20:28:47         at com.sun.proxy.$Proxy73.getObs(Unknown Source)
21-Sep-2017 20:28:47         at sun.reflect.GeneratedMethodAccessor669.invoke(Unknown Source)
21-Sep-2017 20:28:47         at sun.reflect.DelegatingMethodAccessorImpl.invoke(DelegatingMethodAccessorImpl.java:43)
21-Sep-2017 20:28:47         at java.lang.reflect.Method.invoke(Method.java:498)
21-Sep-2017 20:28:47         at org.springframework.aop.support.AopUtils.invokeJoinpointUsingReflection(AopUtils.java:317)
21-Sep-2017 20:28:47         at org.springframework.aop.framework.ReflectiveMethodInvocation.invokeJoinpoint(ReflectiveMethodInvocation.java:190)
21-Sep-2017 20:28:47         at org.springframework.aop.framework.ReflectiveMethodInvocation.proceed(ReflectiveMethodInvocation.java:157)
21-Sep-2017 20:28:47         at org.openmrs.aop.LoggingAdvice.invoke(LoggingAdvice.java:121)
21-Sep-2017 20:28:47         at org.springframework.aop.framework.ReflectiveMethodInvocation.proceed(ReflectiveMethodInvocation.java:179)
21-Sep-2017 20:28:47         at org.springframework.aop.framework.adapter.MethodBeforeAdviceInterceptor.invoke(MethodBeforeAdviceInterceptor.java:52)
21-Sep-2017 20:28:47         at org.springframework.aop.framework.ReflectiveMethodInvocation.proceed(ReflectiveMethodInvocation.java:179)
21-Sep-2017 20:28:47         at org.springframework.aop.framework.adapter.MethodBeforeAdviceInterceptor.invoke(MethodBeforeAdviceInterceptor.java:52)
21-Sep-2017 20:28:47         at org.springframework.aop.framework.ReflectiveMethodInvocation.proceed(ReflectiveMethodInvocation.java:179)
21-Sep-2017 20:28:47         at org.springframework.aop.framework.JdkDynamicAopProxy.invoke(JdkDynamicAopProxy.java:207)
21-Sep-2017 20:28:47         at com.sun.proxy.$Proxy74.getObs(Unknown Source)
21-Sep-2017 20:28:47         at org.openmrs.api.impl.EncounterServiceImpl.saveEncounter(EncounterServiceImpl.java:214)
21-Sep-2017 20:28:47         at sun.reflect.GeneratedMethodAccessor1066.invoke(Unknown Source)
21-Sep-2017 20:28:47         at sun.reflect.DelegatingMethodAccessorImpl.invoke(DelegatingMethodAccessorImpl.java:43)
21-Sep-2017 20:28:47         at java.lang.reflect.Method.invoke(Method.java:498)
21-Sep-2017 20:28:47         at org.springframework.aop.support.AopUtils.invokeJoinpointUsingReflection(AopUtils.java:317)
21-Sep-2017 20:28:47         at org.springframework.aop.framework.ReflectiveMethodInvocation.invokeJoinpoint(ReflectiveMethodInvocation.java:190)
21-Sep-2017 20:28:47         at org.springframework.aop.framework.ReflectiveMethodInvocation.proceed(ReflectiveMethodInvocation.java:157)
21-Sep-2017 20:28:47         at org.springframework.transaction.interceptor.TransactionInterceptor$1.proceedWithInvocation(TransactionInterceptor.java:99)
21-Sep-2017 20:28:47         at org.springframework.transaction.interceptor.TransactionAspectSupport.invokeWithinTransaction(TransactionAspectSupport.java:281)
21-Sep-2017 20:28:47         at org.springframework.transaction.interceptor.TransactionInterceptor.invoke(TransactionInterceptor.java:96)
21-Sep-2017 20:28:47         at org.springframework.aop.framework.ReflectiveMethodInvocation.proceed(ReflectiveMethodInvocation.java:179)
21-Sep-2017 20:28:47         at org.springframework.aop.framework.JdkDynamicAopProxy.invoke(JdkDynamicAopProxy.java:207)
21-Sep-2017 20:28:47         at com.sun.proxy.$Proxy75.saveEncounter(Unknown Source)
21-Sep-2017 20:28:47         at sun.reflect.GeneratedMethodAccessor1066.invoke(Unknown Source)
21-Sep-2017 20:28:47         at sun.reflect.DelegatingMethodAccessorImpl.invoke(DelegatingMethodAccessorImpl.java:43)
21-Sep-2017 20:28:47         at java.lang.reflect.Method.invoke(Method.java:498)
21-Sep-2017 20:28:47         at org.springframework.aop.support.AopUtils.invokeJoinpointUsingReflection(AopUtils.java:317)
21-Sep-2017 20:28:47         at org.springframework.aop.framework.ReflectiveMethodInvocation.invokeJoinpoint(ReflectiveMethodInvocation.java:190)
21-Sep-2017 20:28:47         at org.springframework.aop.framework.ReflectiveMethodInvocation.proceed(ReflectiveMethodInvocation.java:157)
21-Sep-2017 20:28:47         at org.openmrs.aop.LoggingAdvice.invoke(LoggingAdvice.java:121)
21-Sep-2017 20:28:47         at org.springframework.aop.framework.ReflectiveMethodInvocation.proceed(ReflectiveMethodInvocation.java:179)
21-Sep-2017 20:28:47         at org.springframework.aop.framework.adapter.MethodBeforeAdviceInterceptor.invoke(MethodBeforeAdviceInterceptor.java:52)
21-Sep-2017 20:28:47         at org.springframework.aop.framework.ReflectiveMethodInvocation.proceed(ReflectiveMethodInvocation.java:179)
21-Sep-2017 20:28:47         at org.springframework.aop.framework.adapter.MethodBeforeAdviceInterceptor.invoke(MethodBeforeAdviceInterceptor.java:52)
21-Sep-2017 20:28:47         at org.springframework.aop.framework.ReflectiveMethodInvocation.proceed(ReflectiveMethodInvocation.java:179)
21-Sep-2017 20:28:47         at org.springframework.aop.framework.JdkDynamicAopProxy.invoke(JdkDynamicAopProxy.java:207)
21-Sep-2017 20:28:47         at com.sun.proxy.$Proxy76.saveEncounter(Unknown Source)
21-Sep-2017 20:28:47         at org.openmrs.api.EncounterServiceTest.saveEncounter_shouldSaveEncounterWithComplexObs(EncounterServiceTest.java:385)
21-Sep-2017 20:28:47         at sun.reflect.NativeMethodAccessorImpl.invoke0(Native Method)
21-Sep-2017 20:28:47         at sun.reflect.NativeMethodAccessorImpl.invoke(NativeMethodAccessorImpl.java:62)
21-Sep-2017 20:28:47         at sun.reflect.DelegatingMethodAccessorImpl.invoke(DelegatingMethodAccessorImpl.java:43)
21-Sep-2017 20:28:47         at java.lang.reflect.Method.invoke(Method.java:498)
21-Sep-2017 20:28:47         at org.junit.runners.model.FrameworkMethod$1.runReflectiveCall(FrameworkMethod.java:47)
21-Sep-2017 20:28:47         at org.junit.internal.runners.model.ReflectiveCallable.run(ReflectiveCallable.java:12)
21-Sep-2017 20:28:47         at org.junit.runners.model.FrameworkMethod.invokeExplosively(FrameworkMethod.java:44)
21-Sep-2017 20:28:47         at org.junit.internal.runners.statements.InvokeMethod.evaluate(InvokeMethod.java:17)
21-Sep-2017 20:28:47         at org.junit.internal.runners.statements.RunBefores.evaluate(RunBefores.java:26)
21-Sep-2017 20:28:47         at org.springframework.test.context.junit4.statements.RunBeforeTestMethodCallbacks.evaluate(RunBeforeTestMethodCallbacks.java:73)
21-Sep-2017 20:28:47         at org.junit.internal.runners.statements.RunAfters.evaluate(RunAfters.java:27)
21-Sep-2017 20:28:47         at org.springframework.test.context.junit4.statements.RunAfterTestMethodCallbacks.evaluate(RunAfterTestMethodCallbacks.java:82)
21-Sep-2017 20:28:47         at org.springframework.test.context.junit4.statements.SpringRepeat.evaluate(SpringRepeat.java:73)
21-Sep-2017 20:28:47         at org.junit.runners.ParentRunner.runLeaf(ParentRunner.java:271)
21-Sep-2017 20:28:47         at org.springframework.test.context.junit4.SpringJUnit4ClassRunner.runChild(SpringJUnit4ClassRunner.java:217)
21-Sep-2017 20:28:47         at org.springframework.test.context.junit4.SpringJUnit4ClassRunner.runChild(SpringJUnit4ClassRunner.java:83)
21-Sep-2017 20:28:47         at org.junit.runners.ParentRunner$3.run(ParentRunner.java:238)
21-Sep-2017 20:28:47         at org.junit.runners.ParentRunner$1.schedule(ParentRunner.java:63)
21-Sep-2017 20:28:47         at org.junit.runners.ParentRunner.runChildren(ParentRunner.java:236)
21-Sep-2017 20:28:47         at org.junit.runners.ParentRunner.access$000(ParentRunner.java:53)
21-Sep-2017 20:28:47         at org.junit.runners.ParentRunner$2.evaluate(ParentRunner.java:229)
21-Sep-2017 20:28:47         at org.springframework.test.context.junit4.statements.RunBeforeTestClassCallbacks.evaluate(RunBeforeTestClassCallbacks.java:61)
21-Sep-2017 20:28:47         at org.junit.internal.runners.statements.RunAfters.evaluate(RunAfters.java:27)
21-Sep-2017 20:28:47         at org.springframework.test.context.junit4.statements.RunAfterTestClassCallbacks.evaluate(RunAfterTestClassCallbacks.java:68)
21-Sep-2017 20:28:47         at org.junit.runners.ParentRunner.run(ParentRunner.java:309)
21-Sep-2017 20:28:47         at org.springframework.test.context.junit4.SpringJUnit4ClassRunner.run(SpringJUnit4ClassRunner.java:163)
21-Sep-2017 20:28:47         at org.apache.maven.surefire.junit4.JUnit4Provider.execute(JUnit4Provider.java:283)
21-Sep-2017 20:28:47         at org.apache.maven.surefire.junit4.JUnit4Provider.executeWithRerun(JUnit4Provider.java:173)
21-Sep-2017 20:28:47         at org.apache.maven.surefire.junit4.JUnit4Provider.executeTestSet(JUnit4Provider.java:153)
21-Sep-2017 20:28:47         at org.apache.maven.surefire.junit4.JUnit4Provider.invoke(JUnit4Provider.java:128)
21-Sep-2017 20:28:47         at org.apache.maven.surefire.booter.ForkedBooter.invokeProviderInSameClassLoader(ForkedBooter.java:203)
21-Sep-2017 20:28:47         at org.apache.maven.surefire.booter.ForkedBooter.runSuitesInProcess(ForkedBooter.java:155)
21-Sep-2017 20:28:47         at org.apache.maven.surefire.booter.ForkedBooter.main(ForkedBooter.java:103)
21-Sep-2017 20:28:47 ERROR - ImageHandler.getObs(96) |2017-09-21 20:28:47,888| Image /home/bamboo-agent-1/bamboo-agent/.agent_tmp/TRUNK-OC2-JOB1/appdir-for-unit-tests-7371319967205943523/complex_obs/file1.jpg was not found
21-Sep-2017 20:28:47 java.io.FileNotFoundException: /home/bamboo-agent-1/bamboo-agent/.agent_tmp/TRUNK-OC2-JOB1/appdir-for-unit-tests-7371319967205943523/complex_obs/file1.jpg (No such file or directory)
21-Sep-2017 20:28:47         at java.io.RandomAccessFile.open0(Native Method)
21-Sep-2017 20:28:47         at java.io.RandomAccessFile.open(RandomAccessFile.java:316)
21-Sep-2017 20:28:47         at java.io.RandomAccessFile.<init>(RandomAccessFile.java:243)
21-Sep-2017 20:28:47         at javax.imageio.stream.FileImageInputStream.<init>(FileImageInputStream.java:73)
21-Sep-2017 20:28:47         at org.openmrs.obs.handler.ImageHandler.getObs(ImageHandler.java:86)
21-Sep-2017 20:28:47         at org.openmrs.api.impl.ObsServiceImpl.getObs(ObsServiceImpl.java:254)
21-Sep-2017 20:28:47         at sun.reflect.GeneratedMethodAccessor669.invoke(Unknown Source)
21-Sep-2017 20:28:47         at sun.reflect.DelegatingMethodAccessorImpl.invoke(DelegatingMethodAccessorImpl.java:43)
21-Sep-2017 20:28:47         at java.lang.reflect.Method.invoke(Method.java:498)
21-Sep-2017 20:28:47         at org.springframework.aop.support.AopUtils.invokeJoinpointUsingReflection(AopUtils.java:317)
21-Sep-2017 20:28:47         at org.springframework.aop.framework.ReflectiveMethodInvocation.invokeJoinpoint(ReflectiveMethodInvocation.java:190)
21-Sep-2017 20:28:47         at org.springframework.aop.framework.ReflectiveMethodInvocation.proceed(ReflectiveMethodInvocation.java:157)
21-Sep-2017 20:28:47         at org.springframework.transaction.interceptor.TransactionInterceptor$1.proceedWithInvocation(TransactionInterceptor.java:99)
21-Sep-2017 20:28:47         at org.springframework.transaction.interceptor.TransactionAspectSupport.invokeWithinTransaction(TransactionAspectSupport.java:281)
21-Sep-2017 20:28:47         at org.springframework.transaction.interceptor.TransactionInterceptor.invoke(TransactionInterceptor.java:96)
21-Sep-2017 20:28:47         at org.springframework.aop.framework.ReflectiveMethodInvocation.proceed(ReflectiveMethodInvocation.java:179)
21-Sep-2017 20:28:47         at org.springframework.aop.framework.JdkDynamicAopProxy.invoke(JdkDynamicAopProxy.java:207)
21-Sep-2017 20:28:47         at com.sun.proxy.$Proxy73.getObs(Unknown Source)
21-Sep-2017 20:28:47         at sun.reflect.GeneratedMethodAccessor669.invoke(Unknown Source)
21-Sep-2017 20:28:47         at sun.reflect.DelegatingMethodAccessorImpl.invoke(DelegatingMethodAccessorImpl.java:43)
21-Sep-2017 20:28:47         at java.lang.reflect.Method.invoke(Method.java:498)
21-Sep-2017 20:28:47         at org.springframework.aop.support.AopUtils.invokeJoinpointUsingReflection(AopUtils.java:317)
21-Sep-2017 20:28:47         at org.springframework.aop.framework.ReflectiveMethodInvocation.invokeJoinpoint(ReflectiveMethodInvocation.java:190)
21-Sep-2017 20:28:47         at org.springframework.aop.framework.ReflectiveMethodInvocation.proceed(ReflectiveMethodInvocation.java:157)
21-Sep-2017 20:28:47         at org.openmrs.aop.LoggingAdvice.invoke(LoggingAdvice.java:121)
21-Sep-2017 20:28:47         at org.springframework.aop.framework.ReflectiveMethodInvocation.proceed(ReflectiveMethodInvocation.java:179)
21-Sep-2017 20:28:47         at org.springframework.aop.framework.adapter.MethodBeforeAdviceInterceptor.invoke(MethodBeforeAdviceInterceptor.java:52)
21-Sep-2017 20:28:47         at org.springframework.aop.framework.ReflectiveMethodInvocation.proceed(ReflectiveMethodInvocation.java:179)
21-Sep-2017 20:28:47         at org.springframework.aop.framework.adapter.MethodBeforeAdviceInterceptor.invoke(MethodBeforeAdviceInterceptor.java:52)
21-Sep-2017 20:28:47         at org.springframework.aop.framework.ReflectiveMethodInvocation.proceed(ReflectiveMethodInvocation.java:179)
21-Sep-2017 20:28:47         at org.springframework.aop.framework.JdkDynamicAopProxy.invoke(JdkDynamicAopProxy.java:207)
21-Sep-2017 20:28:47         at com.sun.proxy.$Proxy74.getObs(Unknown Source)
21-Sep-2017 20:28:47         at org.openmrs.api.impl.EncounterServiceImpl.saveEncounter(EncounterServiceImpl.java:214)
21-Sep-2017 20:28:47         at sun.reflect.GeneratedMethodAccessor1066.invoke(Unknown Source)
21-Sep-2017 20:28:47         at sun.reflect.DelegatingMethodAccessorImpl.invoke(DelegatingMethodAccessorImpl.java:43)
21-Sep-2017 20:28:47         at java.lang.reflect.Method.invoke(Method.java:498)
21-Sep-2017 20:28:47         at org.springframework.aop.support.AopUtils.invokeJoinpointUsingReflection(AopUtils.java:317)
21-Sep-2017 20:28:47         at org.springframework.aop.framework.ReflectiveMethodInvocation.invokeJoinpoint(ReflectiveMethodInvocation.java:190)
21-Sep-2017 20:28:47         at org.springframework.aop.framework.ReflectiveMethodInvocation.proceed(ReflectiveMethodInvocation.java:157)
21-Sep-2017 20:28:47         at org.springframework.transaction.interceptor.TransactionInterceptor$1.proceedWithInvocation(TransactionInterceptor.java:99)
21-Sep-2017 20:28:47         at org.springframework.transaction.interceptor.TransactionAspectSupport.invokeWithinTransaction(TransactionAspectSupport.java:281)
21-Sep-2017 20:28:47         at org.springframework.transaction.interceptor.TransactionInterceptor.invoke(TransactionInterceptor.java:96)
21-Sep-2017 20:28:47         at org.springframework.aop.framework.ReflectiveMethodInvocation.proceed(ReflectiveMethodInvocation.java:179)
21-Sep-2017 20:28:47         at org.springframework.aop.framework.JdkDynamicAopProxy.invoke(JdkDynamicAopProxy.java:207)
21-Sep-2017 20:28:47         at com.sun.proxy.$Proxy75.saveEncounter(Unknown Source)
21-Sep-2017 20:28:47         at sun.reflect.GeneratedMethodAccessor1066.invoke(Unknown Source)
21-Sep-2017 20:28:47         at sun.reflect.DelegatingMethodAccessorImpl.invoke(DelegatingMethodAccessorImpl.java:43)
21-Sep-2017 20:28:47         at java.lang.reflect.Method.invoke(Method.java:498)
21-Sep-2017 20:28:47         at org.springframework.aop.support.AopUtils.invokeJoinpointUsingReflection(AopUtils.java:317)
21-Sep-2017 20:28:47         at org.springframework.aop.framework.ReflectiveMethodInvocation.invokeJoinpoint(ReflectiveMethodInvocation.java:190)
21-Sep-2017 20:28:47         at org.springframework.aop.framework.ReflectiveMethodInvocation.proceed(ReflectiveMethodInvocation.java:157)
21-Sep-2017 20:28:47         at org.openmrs.aop.LoggingAdvice.invoke(LoggingAdvice.java:121)
21-Sep-2017 20:28:47         at org.springframework.aop.framework.ReflectiveMethodInvocation.proceed(ReflectiveMethodInvocation.java:179)
21-Sep-2017 20:28:47         at org.springframework.aop.framework.adapter.MethodBeforeAdviceInterceptor.invoke(MethodBeforeAdviceInterceptor.java:52)
21-Sep-2017 20:28:47         at org.springframework.aop.framework.ReflectiveMethodInvocation.proceed(ReflectiveMethodInvocation.java:179)
21-Sep-2017 20:28:47         at org.springframework.aop.framework.adapter.MethodBeforeAdviceInterceptor.invoke(MethodBeforeAdviceInterceptor.java:52)
21-Sep-2017 20:28:47         at org.springframework.aop.framework.ReflectiveMethodInvocation.proceed(ReflectiveMethodInvocation.java:179)
21-Sep-2017 20:28:47         at org.springframework.aop.framework.JdkDynamicAopProxy.invoke(JdkDynamicAopProxy.java:207)
21-Sep-2017 20:28:47         at com.sun.proxy.$Proxy76.saveEncounter(Unknown Source)
21-Sep-2017 20:28:47         at org.openmrs.api.EncounterServiceTest.saveEncounter_shouldSaveEncounterWithComplexObs(EncounterServiceTest.java:385)
21-Sep-2017 20:28:47         at sun.reflect.NativeMethodAccessorImpl.invoke0(Native Method)
21-Sep-2017 20:28:47         at sun.reflect.NativeMethodAccessorImpl.invoke(NativeMethodAccessorImpl.java:62)
21-Sep-2017 20:28:47         at sun.reflect.DelegatingMethodAccessorImpl.invoke(DelegatingMethodAccessorImpl.java:43)
21-Sep-2017 20:28:47         at java.lang.reflect.Method.invoke(Method.java:498)
21-Sep-2017 20:28:47         at org.junit.runners.model.FrameworkMethod$1.runReflectiveCall(FrameworkMethod.java:47)
21-Sep-2017 20:28:47         at org.junit.internal.runners.model.ReflectiveCallable.run(ReflectiveCallable.java:12)
21-Sep-2017 20:28:47         at org.junit.runners.model.FrameworkMethod.invokeExplosively(FrameworkMethod.java:44)
21-Sep-2017 20:28:47         at org.junit.internal.runners.statements.InvokeMethod.evaluate(InvokeMethod.java:17)
21-Sep-2017 20:28:47         at org.junit.internal.runners.statements.RunBefores.evaluate(RunBefores.java:26)
21-Sep-2017 20:28:47         at org.springframework.test.context.junit4.statements.RunBeforeTestMethodCallbacks.evaluate(RunBeforeTestMethodCallbacks.java:73)
21-Sep-2017 20:28:47         at org.junit.internal.runners.statements.RunAfters.evaluate(RunAfters.java:27)
21-Sep-2017 20:28:47         at org.springframework.test.context.junit4.statements.RunAfterTestMethodCallbacks.evaluate(RunAfterTestMethodCallbacks.java:82)
21-Sep-2017 20:28:47         at org.springframework.test.context.junit4.statements.SpringRepeat.evaluate(SpringRepeat.java:73)
21-Sep-2017 20:28:47         at org.junit.runners.ParentRunner.runLeaf(ParentRunner.java:271)
21-Sep-2017 20:28:47         at org.springframework.test.context.junit4.SpringJUnit4ClassRunner.runChild(SpringJUnit4ClassRunner.java:217)
21-Sep-2017 20:28:47         at org.springframework.test.context.junit4.SpringJUnit4ClassRunner.runChild(SpringJUnit4ClassRunner.java:83)
21-Sep-2017 20:28:47         at org.junit.runners.ParentRunner$3.run(ParentRunner.java:238)
21-Sep-2017 20:28:47         at org.junit.runners.ParentRunner$1.schedule(ParentRunner.java:63)
21-Sep-2017 20:28:47         at org.junit.runners.ParentRunner.runChildren(ParentRunner.java:236)
21-Sep-2017 20:28:47         at org.junit.runners.ParentRunner.access$000(ParentRunner.java:53)
21-Sep-2017 20:28:47         at org.junit.runners.ParentRunner$2.evaluate(ParentRunner.java:229)
21-Sep-2017 20:28:47         at org.springframework.test.context.junit4.statements.RunBeforeTestClassCallbacks.evaluate(RunBeforeTestClassCallbacks.java:61)
21-Sep-2017 20:28:47         at org.junit.internal.runners.statements.RunAfters.evaluate(RunAfters.java:27)
21-Sep-2017 20:28:47         at org.springframework.test.context.junit4.statements.RunAfterTestClassCallbacks.evaluate(RunAfterTestClassCallbacks.java:68)
21-Sep-2017 20:28:47         at org.junit.runners.ParentRunner.run(ParentRunner.java:309)
21-Sep-2017 20:28:47         at org.springframework.test.context.junit4.SpringJUnit4ClassRunner.run(SpringJUnit4ClassRunner.java:163)
21-Sep-2017 20:28:47         at org.apache.maven.surefire.junit4.JUnit4Provider.execute(JUnit4Provider.java:283)
21-Sep-2017 20:28:47         at org.apache.maven.surefire.junit4.JUnit4Provider.executeWithRerun(JUnit4Provider.java:173)
21-Sep-2017 20:28:47         at org.apache.maven.surefire.junit4.JUnit4Provider.executeTestSet(JUnit4Provider.java:153)
21-Sep-2017 20:28:47         at org.apache.maven.surefire.junit4.JUnit4Provider.invoke(JUnit4Provider.java:128)
21-Sep-2017 20:28:47         at org.apache.maven.surefire.booter.ForkedBooter.invokeProviderInSameClassLoader(ForkedBooter.java:203)
21-Sep-2017 20:28:47         at org.apache.maven.surefire.booter.ForkedBooter.runSuitesInProcess(ForkedBooter.java:155)
21-Sep-2017 20:28:47         at org.apache.maven.surefire.booter.ForkedBooter.main(ForkedBooter.java:103)
21-Sep-2017 20:29:05 Tests run: 141, Failures: 0, Errors: 0, Skipped: 2, Time elapsed: 19.98 sec - in org.openmrs.api.EncounterServiceTest
21-Sep-2017 20:29:05 Running org.openmrs.api.PersonServiceTest
21-Sep-2017 20:29:16 Tests run: 119, Failures: 0, Errors: 0, Skipped: 0, Time elapsed: 11.85 sec - in org.openmrs.api.PersonServiceTest
21-Sep-2017 20:29:16 Running org.openmrs.OrderTest
21-Sep-2017 20:29:22 Tests run: 56, Failures: 0, Errors: 0, Skipped: 0, Time elapsed: 5.617 sec - in org.openmrs.OrderTest
21-Sep-2017 20:29:22 Running org.openmrs.hl7.HL7UtilTest
21-Sep-2017 20:29:22 Tests run: 5, Failures: 0, Errors: 0, Skipped: 0, Time elapsed: 0.394 sec - in org.openmrs.hl7.HL7UtilTest
21-Sep-2017 20:29:22 Running org.openmrs.hl7.handler.ORUR01HandlerTest
21-Sep-2017 20:29:29 Tests run: 37, Failures: 0, Errors: 0, Skipped: 0, Time elapsed: 6.57 sec - in org.openmrs.hl7.handler.ORUR01HandlerTest
21-Sep-2017 20:29:29 Running org.openmrs.hl7.HL7ServiceTest
21-Sep-2017 20:29:31 ERROR - HL7ServiceImpl.setFatalError(742) |2017-09-21 20:29:31,240| ca.uhn.hl7v2.HL7Exception: HL7 encoding not supported
21-Sep-2017 20:29:32 Tests run: 26, Failures: 0, Errors: 0, Skipped: 2, Time elapsed: 3.49 sec - in org.openmrs.hl7.HL7ServiceTest
21-Sep-2017 20:29:32 Running org.openmrs.BaseCustomizableMetadataTest
21-Sep-2017 20:29:35 Tests run: 2, Failures: 0, Errors: 0, Skipped: 0, Time elapsed: 2.208 sec - in org.openmrs.BaseCustomizableMetadataTest
21-Sep-2017 20:29:35 Running org.openmrs.propertyeditor.PrivilegeEditorTest
21-Sep-2017 20:29:36 Tests run: 2, Failures: 0, Errors: 0, Skipped: 0, Time elapsed: 0.955 sec - in org.openmrs.propertyeditor.PrivilegeEditorTest
21-Sep-2017 20:29:36 Running org.openmrs.propertyeditor.ConceptEditorTest
21-Sep-2017 20:29:37 Tests run: 2, Failures: 0, Errors: 0, Skipped: 0, Time elapsed: 1.025 sec - in org.openmrs.propertyeditor.ConceptEditorTest
21-Sep-2017 20:29:37 Running org.openmrs.propertyeditor.ConceptDatatypeEditorTest
21-Sep-2017 20:29:37 Tests run: 2, Failures: 0, Errors: 0, Skipped: 0, Time elapsed: 0.812 sec - in org.openmrs.propertyeditor.ConceptDatatypeEditorTest
21-Sep-2017 20:29:37 Running org.openmrs.propertyeditor.DrugEditorTest
21-Sep-2017 20:29:38 Tests run: 2, Failures: 0, Errors: 0, Skipped: 0, Time elapsed: 0.847 sec - in org.openmrs.propertyeditor.DrugEditorTest
21-Sep-2017 20:29:38 Running org.openmrs.propertyeditor.ConceptAnswersEditorTest
21-Sep-2017 20:29:39 Tests run: 1, Failures: 0, Errors: 0, Skipped: 0, Time elapsed: 0.663 sec - in org.openmrs.propertyeditor.ConceptAnswersEditorTest
21-Sep-2017 20:29:39 Running org.openmrs.propertyeditor.PersonAttributeEditorTest
21-Sep-2017 20:29:40 Tests run: 2, Failures: 0, Errors: 0, Skipped: 0, Time elapsed: 0.815 sec - in org.openmrs.propertyeditor.PersonAttributeEditorTest
21-Sep-2017 20:29:40 Running org.openmrs.propertyeditor.ConceptSourceEditorTest
21-Sep-2017 20:29:41 Tests run: 2, Failures: 0, Errors: 0, Skipped: 0, Time elapsed: 0.763 sec - in org.openmrs.propertyeditor.ConceptSourceEditorTest
21-Sep-2017 20:29:41 Running org.openmrs.propertyeditor.FormEditorTest
21-Sep-2017 20:29:41 Tests run: 2, Failures: 0, Errors: 0, Skipped: 0, Time elapsed: 0.668 sec - in org.openmrs.propertyeditor.FormEditorTest
21-Sep-2017 20:29:41 Running org.openmrs.propertyeditor.OrderEditorTest
21-Sep-2017 20:29:42 Tests run: 2, Failures: 0, Errors: 0, Skipped: 0, Time elapsed: 0.721 sec - in org.openmrs.propertyeditor.OrderEditorTest
21-Sep-2017 20:29:42 Running org.openmrs.propertyeditor.LocationTagEditorTest
21-Sep-2017 20:29:43 Tests run: 2, Failures: 0, Errors: 0, Skipped: 0, Time elapsed: 0.668 sec - in org.openmrs.propertyeditor.LocationTagEditorTest
21-Sep-2017 20:29:43 Running org.openmrs.propertyeditor.DateOrDatetimeEditorTest
21-Sep-2017 20:29:43 Tests run: 6, Failures: 0, Errors: 0, Skipped: 0, Time elapsed: 0.416 sec - in org.openmrs.propertyeditor.DateOrDatetimeEditorTest
21-Sep-2017 20:29:43 Running org.openmrs.propertyeditor.ProviderEditorTest
21-Sep-2017 20:29:44 Tests run: 2, Failures: 0, Errors: 0, Skipped: 0, Time elapsed: 0.667 sec - in org.openmrs.propertyeditor.ProviderEditorTest
21-Sep-2017 20:29:44 Running org.openmrs.propertyeditor.VisitTypeEditorTest
21-Sep-2017 20:29:44 Tests run: 2, Failures: 0, Errors: 0, Skipped: 0, Time elapsed: 0.678 sec - in org.openmrs.propertyeditor.VisitTypeEditorTest
21-Sep-2017 20:29:44 Running org.openmrs.propertyeditor.ConceptAnswerEditorTest
21-Sep-2017 20:29:45 Tests run: 2, Failures: 0, Errors: 0, Skipped: 0, Time elapsed: 0.684 sec - in org.openmrs.propertyeditor.ConceptAnswerEditorTest
21-Sep-2017 20:29:45 Running org.openmrs.propertyeditor.PersonEditorTest
21-Sep-2017 20:29:46 Tests run: 2, Failures: 0, Errors: 0, Skipped: 0, Time elapsed: 0.707 sec - in org.openmrs.propertyeditor.PersonEditorTest
21-Sep-2017 20:29:46 Running org.openmrs.propertyeditor.ConceptClassEditorTest
21-Sep-2017 20:29:47 Tests run: 2, Failures: 0, Errors: 0, Skipped: 0, Time elapsed: 0.751 sec - in org.openmrs.propertyeditor.ConceptClassEditorTest
21-Sep-2017 20:29:47 Running org.openmrs.propertyeditor.ProgramEditorTest
21-Sep-2017 20:29:48 Tests run: 4, Failures: 0, Errors: 0, Skipped: 0, Time elapsed: 0.944 sec - in org.openmrs.propertyeditor.ProgramEditorTest
21-Sep-2017 20:29:48 Running org.openmrs.propertyeditor.PatientIdentifierTypeEditorTest
21-Sep-2017 20:29:48 Tests run: 2, Failures: 0, Errors: 0, Skipped: 0, Time elapsed: 0.784 sec - in org.openmrs.propertyeditor.PatientIdentifierTypeEditorTest
21-Sep-2017 20:29:48 Running org.openmrs.propertyeditor.WorkflowCollectionEditorTest
21-Sep-2017 20:29:49 Tests run: 1, Failures: 0, Errors: 0, Skipped: 0, Time elapsed: 0.659 sec - in org.openmrs.propertyeditor.WorkflowCollectionEditorTest
21-Sep-2017 20:29:49 Running org.openmrs.propertyeditor.PersonAttributeTypeEditorTest
21-Sep-2017 20:29:50 Tests run: 2, Failures: 0, Errors: 0, Skipped: 0, Time elapsed: 0.765 sec - in org.openmrs.propertyeditor.PersonAttributeTypeEditorTest
21-Sep-2017 20:29:50 Running org.openmrs.propertyeditor.ConceptNameEditorTest
21-Sep-2017 20:29:51 Tests run: 2, Failures: 0, Errors: 0, Skipped: 0, Time elapsed: 0.802 sec - in org.openmrs.propertyeditor.ConceptNameEditorTest
21-Sep-2017 20:29:51 Running org.openmrs.propertyeditor.PatientEditorTest
21-Sep-2017 20:29:52 Tests run: 2, Failures: 0, Errors: 0, Skipped: 0, Time elapsed: 1.088 sec - in org.openmrs.propertyeditor.PatientEditorTest
21-Sep-2017 20:29:52 Running org.openmrs.propertyeditor.CohortEditorTest
21-Sep-2017 20:29:53 Tests run: 2, Failures: 0, Errors: 0, Skipped: 0, Time elapsed: 0.939 sec - in org.openmrs.propertyeditor.CohortEditorTest
21-Sep-2017 20:29:53 Running org.openmrs.propertyeditor.LocationEditorTest
21-Sep-2017 20:29:53 Tests run: 2, Failures: 0, Errors: 0, Skipped: 0, Time elapsed: 0.938 sec - in org.openmrs.propertyeditor.LocationEditorTest
21-Sep-2017 20:29:53 Running org.openmrs.propertyeditor.ProgramWorkflowEditorTest
21-Sep-2017 20:29:54 Tests run: 1, Failures: 0, Errors: 0, Skipped: 0, Time elapsed: 0.901 sec - in org.openmrs.propertyeditor.ProgramWorkflowEditorTest
21-Sep-2017 20:29:54 Running org.openmrs.propertyeditor.RoleEditorTest
21-Sep-2017 20:29:55 Tests run: 2, Failures: 0, Errors: 0, Skipped: 0, Time elapsed: 1.031 sec - in org.openmrs.propertyeditor.RoleEditorTest
21-Sep-2017 20:29:55 Running org.openmrs.propertyeditor.ConceptNumericEditorTest
21-Sep-2017 20:29:58 Tests run: 2, Failures: 0, Errors: 0, Skipped: 0, Time elapsed: 2.079 sec - in org.openmrs.propertyeditor.ConceptNumericEditorTest
21-Sep-2017 20:29:58 Running org.openmrs.propertyeditor.EncounterTypeEditorTest
21-Sep-2017 20:29:58 Tests run: 2, Failures: 0, Errors: 0, Skipped: 0, Time elapsed: 0.941 sec - in org.openmrs.propertyeditor.EncounterTypeEditorTest
21-Sep-2017 20:29:58 Running org.openmrs.propertyeditor.VisitEditorTest
21-Sep-2017 20:29:59 Tests run: 2, Failures: 0, Errors: 0, Skipped: 0, Time elapsed: 0.878 sec - in org.openmrs.propertyeditor.VisitEditorTest
21-Sep-2017 20:29:59 Running org.openmrs.propertyeditor.ProgramWorkflowStateEditorTest
21-Sep-2017 20:30:00 Tests run: 1, Failures: 0, Errors: 0, Skipped: 0, Time elapsed: 0.706 sec - in org.openmrs.propertyeditor.ProgramWorkflowStateEditorTest
21-Sep-2017 20:30:00 Running org.openmrs.propertyeditor.EncounterEditorTest
21-Sep-2017 20:30:01 Tests run: 2, Failures: 0, Errors: 0, Skipped: 0, Time elapsed: 0.985 sec - in org.openmrs.propertyeditor.EncounterEditorTest
21-Sep-2017 20:30:01 Running org.openmrs.propertyeditor.UserEditorTest
21-Sep-2017 20:30:02 Tests run: 2, Failures: 0, Errors: 0, Skipped: 0, Time elapsed: 0.998 sec - in org.openmrs.propertyeditor.UserEditorTest
21-Sep-2017 20:30:02 Running org.openmrs.scheduler.SchedulerUtilTest
21-Sep-2017 20:30:02 Tests run: 1, Failures: 0, Errors: 0, Skipped: 0, Time elapsed: 0.079 sec - in org.openmrs.scheduler.SchedulerUtilTest
21-Sep-2017 20:30:02 Running org.openmrs.scheduler.timer.TimerSchedulerServiceImplTest
21-Sep-2017 20:30:03 Tests run: 1, Failures: 0, Errors: 0, Skipped: 0, Time elapsed: 1.251 sec - in org.openmrs.scheduler.timer.TimerSchedulerServiceImplTest
21-Sep-2017 20:30:03 Running org.openmrs.scheduler.SchedulerServiceTest
21-Sep-2017 20:30:03 Tests run: 1, Failures: 0, Errors: 0, Skipped: 1, Time elapsed: 0 sec - in org.openmrs.scheduler.SchedulerServiceTest
21-Sep-2017 20:30:03 Running org.openmrs.annotation.StartModuleAnnotationReuseTest
21-Sep-2017 20:30:05 Tests run: 1, Failures: 0, Errors: 0, Skipped: 0, Time elapsed: 1.539 sec - in org.openmrs.annotation.StartModuleAnnotationReuseTest
21-Sep-2017 20:30:05 Running org.openmrs.annotation.OpenmrsProfileIncludeFilterTest
21-Sep-2017 20:30:06 Tests run: 2, Failures: 0, Errors: 0, Skipped: 0, Time elapsed: 0.859 sec - in org.openmrs.annotation.OpenmrsProfileIncludeFilterTest
21-Sep-2017 20:30:06 Running org.openmrs.annotation.OpenmrsProfileExcludeFilterWithModulesTest
21-Sep-2017 20:30:08 Tests run: 1, Failures: 0, Errors: 0, Skipped: 0, Time elapsed: 1.88 sec - in org.openmrs.annotation.OpenmrsProfileExcludeFilterWithModulesTest
21-Sep-2017 20:30:08 Running org.openmrs.annotation.OpenmrsProfileExcludeFilterTest
21-Sep-2017 20:30:10 Tests run: 8, Failures: 0, Errors: 1, Skipped: 2, Time elapsed: 2.414 sec <<< FAILURE! - in org.openmrs.annotation.OpenmrsProfileExcludeFilterTest
21-Sep-2017 20:30:10 match_shouldIncludeBeanIfModuleMissing(org.openmrs.annotation.OpenmrsProfileExcludeFilterTest)  Time elapsed: 0.054 sec  <<< ERROR!
21-Sep-2017 20:30:10 org.springframework.beans.factory.NoSuchBeanDefinitionException: No qualifying bean of type [org.openmrs.annotation.OpenmrsProfileWithoutTest1Module] is defined
21-Sep-2017 20:30:10         at org.springframework.beans.factory.support.DefaultListableBeanFactory.getBean(DefaultListableBeanFactory.java:371)
21-Sep-2017 20:30:10         at org.springframework.beans.factory.support.DefaultListableBeanFactory.getBean(DefaultListableBeanFactory.java:331)
21-Sep-2017 20:30:10         at org.springframework.context.support.AbstractApplicationContext.getBean(AbstractApplicationContext.java:968)
21-Sep-2017 20:30:10         at org.openmrs.annotation.OpenmrsProfileExcludeFilterTest.match_shouldIncludeBeanIfModuleMissing(OpenmrsProfileExcludeFilterTest.java:87)
21-Sep-2017 20:30:10
21-Sep-2017 20:30:10 Running org.openmrs.EncounterProviderTest
21-Sep-2017 20:30:10 Tests run: 1, Failures: 0, Errors: 0, Skipped: 0, Time elapsed: 0.074 sec - in org.openmrs.EncounterProviderTest
21-Sep-2017 20:30:10 Running org.openmrs.order.OrderUtilTest
21-Sep-2017 20:30:11 Tests run: 15, Failures: 0, Errors: 0, Skipped: 0, Time elapsed: 1.151 sec - in org.openmrs.order.OrderUtilTest
21-Sep-2017 20:30:11 Running org.openmrs.OpenmrsTestAnnotationsTest
21-Sep-2017 20:30:12 Tests run: 2, Failures: 0, Errors: 0, Skipped: 0, Time elapsed: 1.055 sec - in org.openmrs.OpenmrsTestAnnotationsTest
21-Sep-2017 20:30:12 Running org.openmrs.UserTest
21-Sep-2017 20:30:13 Tests run: 9, Failures: 0, Errors: 0, Skipped: 0, Time elapsed: 0.724 sec - in org.openmrs.UserTest
21-Sep-2017 20:30:13 Running org.openmrs.LocationTest
21-Sep-2017 20:30:13 Tests run: 3, Failures: 0, Errors: 0, Skipped: 0, Time elapsed: 0.229 sec - in org.openmrs.LocationTest
21-Sep-2017 20:30:13 Running org.openmrs.EncounterTypeTest
21-Sep-2017 20:30:13 Tests run: 1, Failures: 0, Errors: 0, Skipped: 0, Time elapsed: 0.073 sec - in org.openmrs.EncounterTypeTest
21-Sep-2017 20:30:13 Running org.openmrs.AllergenTest
21-Sep-2017 20:30:15 Tests run: 6, Failures: 0, Errors: 0, Skipped: 0, Time elapsed: 2.118 sec - in org.openmrs.AllergenTest
21-Sep-2017 20:30:15 Running org.openmrs.FormTest
21-Sep-2017 20:30:16 Tests run: 1, Failures: 0, Errors: 0, Skipped: 0, Time elapsed: 0.086 sec - in org.openmrs.FormTest
21-Sep-2017 20:30:16 Running org.openmrs.ConceptComponentTest
21-Sep-2017 20:30:17 Tests run: 1, Failures: 0, Errors: 0, Skipped: 0, Time elapsed: 0.974 sec - in org.openmrs.ConceptComponentTest
21-Sep-2017 20:30:17 Running org.openmrs.notification.MessageTest
21-Sep-2017 20:30:17 Tests run: 4, Failures: 0, Errors: 0, Skipped: 0, Time elapsed: 0.38 sec - in org.openmrs.notification.MessageTest
21-Sep-2017 20:30:17 Running org.openmrs.notification.db.hibernate.HibernateAlertDAOTest
21-Sep-2017 20:30:18 Tests run: 1, Failures: 0, Errors: 0, Skipped: 0, Time elapsed: 0.879 sec - in org.openmrs.notification.db.hibernate.HibernateAlertDAOTest
21-Sep-2017 20:30:18 Running org.openmrs.notification.AlertServiceTest
21-Sep-2017 20:30:19 Tests run: 3, Failures: 0, Errors: 0, Skipped: 0, Time elapsed: 1.531 sec - in org.openmrs.notification.AlertServiceTest
21-Sep-2017 20:30:19 Running org.openmrs.layout.name.NameTemplateTest
21-Sep-2017 20:30:20 Tests run: 2, Failures: 0, Errors: 0, Skipped: 0, Time elapsed: 0.179 sec - in org.openmrs.layout.name.NameTemplateTest
21-Sep-2017 20:30:20 Running org.openmrs.OrderTypeTest
21-Sep-2017 20:30:20 Tests run: 3, Failures: 0, Errors: 0, Skipped: 0, Time elapsed: 0.244 sec - in org.openmrs.OrderTypeTest
21-Sep-2017 20:30:20 Running org.openmrs.OrderEntryIntegrationTest
21-Sep-2017 20:30:22 Tests run: 15, Failures: 0, Errors: 0, Skipped: 0, Time elapsed: 2.615 sec - in org.openmrs.OrderEntryIntegrationTest
21-Sep-2017 20:30:22 Running org.openmrs.ConceptReferenceTermTest
21-Sep-2017 20:30:23 Tests run: 3, Failures: 0, Errors: 0, Skipped: 0, Time elapsed: 0.245 sec - in org.openmrs.ConceptReferenceTermTest
21-Sep-2017 20:30:23 Running org.openmrs.comparator.PatientIdentifierTypeDefaultComparatorTest
21-Sep-2017 20:30:23 Tests run: 1, Failures: 0, Errors: 0, Skipped: 0, Time elapsed: 0.08 sec - in org.openmrs.comparator.PatientIdentifierTypeDefaultComparatorTest
21-Sep-2017 20:30:23 Running org.openmrs.PatientStateTest
21-Sep-2017 20:30:24 Tests run: 13, Failures: 0, Errors: 0, Skipped: 0, Time elapsed: 1.042 sec - in org.openmrs.PatientStateTest
21-Sep-2017 20:30:24 Running org.openmrs.PersonNameTest
21-Sep-2017 20:30:25 Tests run: 19, Failures: 0, Errors: 0, Skipped: 0, Time elapsed: 1.627 sec - in org.openmrs.PersonNameTest
21-Sep-2017 20:30:25 Running org.openmrs.messagesource.impl.DefaultMessageSourceServiceImplTest
21-Sep-2017 20:30:25 Tests run: 1, Failures: 0, Errors: 0, Skipped: 0, Time elapsed: 0.081 sec - in org.openmrs.messagesource.impl.DefaultMessageSourceServiceImplTest
21-Sep-2017 20:30:25 Running org.openmrs.messagesource.impl.CachedMessageSourceTest
21-Sep-2017 20:30:26 Tests run: 2, Failures: 0, Errors: 0, Skipped: 0, Time elapsed: 0.297 sec - in org.openmrs.messagesource.impl.CachedMessageSourceTest
21-Sep-2017 20:30:26 Running org.openmrs.messagesource.PresentationMessageMapTest
21-Sep-2017 20:30:26 Tests run: 2, Failures: 0, Errors: 0, Skipped: 0, Time elapsed: 0.171 sec - in org.openmrs.messagesource.PresentationMessageMapTest
21-Sep-2017 20:30:26 Running org.openmrs.messagesource.MessageSourceServiceTest
21-Sep-2017 20:30:28 Tests run: 1, Failures: 0, Errors: 0, Skipped: 0, Time elapsed: 2.328 sec - in org.openmrs.messagesource.MessageSourceServiceTest
21-Sep-2017 20:30:28 Running org.openmrs.customdatatype.datatype.BaseOpenmrsDatatypeTest
21-Sep-2017 20:30:28 Tests run: 1, Failures: 0, Errors: 0, Skipped: 0, Time elapsed: 0.084 sec - in org.openmrs.customdatatype.datatype.BaseOpenmrsDatatypeTest
21-Sep-2017 20:30:28 Running org.openmrs.customdatatype.datatype.DateDatatypeTest
21-Sep-2017 20:30:29 Tests run: 2, Failures: 0, Errors: 0, Skipped: 0, Time elapsed: 0.169 sec - in org.openmrs.customdatatype.datatype.DateDatatypeTest
21-Sep-2017 20:30:29 Running org.openmrs.customdatatype.datatype.BaseMetadataDatatypeTest
21-Sep-2017 20:30:29 Tests run: 1, Failures: 0, Errors: 0, Skipped: 0, Time elapsed: 0.08 sec - in org.openmrs.customdatatype.datatype.BaseMetadataDatatypeTest
21-Sep-2017 20:30:29 Running org.openmrs.customdatatype.datatype.RegexValidatedTextTest
21-Sep-2017 20:30:29 Tests run: 3, Failures: 0, Errors: 0, Skipped: 0, Time elapsed: 0.241 sec - in org.openmrs.customdatatype.datatype.RegexValidatedTextTest
21-Sep-2017 20:30:29 Running org.openmrs.customdatatype.CustomDatatypeUtilTest
21-Sep-2017 20:30:30 Tests run: 1, Failures: 0, Errors: 0, Skipped: 0, Time elapsed: 0.928 sec - in org.openmrs.customdatatype.CustomDatatypeUtilTest
21-Sep-2017 20:30:30 Running org.openmrs.PersonAttributeTest
21-Sep-2017 20:30:31 Tests run: 6, Failures: 0, Errors: 0, Skipped: 0, Time elapsed: 1.406 sec - in org.openmrs.PersonAttributeTest
21-Sep-2017 20:30:31 Running org.openmrs.PersonTest
21-Sep-2017 20:30:35 Tests run: 27, Failures: 0, Errors: 0, Skipped: 0, Time elapsed: 4.26 sec - in org.openmrs.PersonTest
21-Sep-2017 20:30:35 Running org.openmrs.aop.RequiredDataAdviceTest
21-Sep-2017 20:30:39 Tests run: 26, Failures: 0, Errors: 0, Skipped: 0, Time elapsed: 3.143 sec - in org.openmrs.aop.RequiredDataAdviceTest
21-Sep-2017 20:30:39 Running org.openmrs.aop.AuthorizationAdviceTest
21-Sep-2017 20:30:40 Tests run: 1, Failures: 0, Errors: 0, Skipped: 0, Time elapsed: 1.503 sec - in org.openmrs.aop.AuthorizationAdviceTest
21-Sep-2017 20:30:40 Running org.openmrs.AllergiesTest
21-Sep-2017 20:30:44 Tests run: 26, Failures: 0, Errors: 0, Skipped: 0, Time elapsed: 3.594 sec - in org.openmrs.AllergiesTest
21-Sep-2017 20:30:44
21-Sep-2017 20:30:44 Results :
21-Sep-2017 20:30:44
21-Sep-2017 20:30:44 Tests in error:
21-Sep-2017 20:30:44   OpenmrsProfileExcludeFilterTest.match_shouldIncludeBeanIfModuleMissing:87 » NoSuchBeanDefinition
21-Sep-2017 20:30:44
21-Sep-2017 20:30:44 Tests run: 3264, Failures: 0, Errors: 1, Skipped: 31
21-Sep-2017 20:30:44
21-Sep-2017 20:30:44 [INFO] ------------------------------------------------------------------------
21-Sep-2017 20:30:44 [INFO] Reactor Summary:
21-Sep-2017 20:30:44 [INFO]
21-Sep-2017 20:30:44 [INFO] OpenMRS ............................................ SUCCESS [  3.213 s]
21-Sep-2017 20:30:44 [INFO] openmrs-tools ...................................... SUCCESS [  2.210 s]
21-Sep-2017 20:30:44 [INFO] openmrs-test ....................................... SUCCESS [  0.204 s]
21-Sep-2017 20:30:44 [INFO] openmrs-api ........................................ FAILURE [11:15 min]
21-Sep-2017 20:30:44 [INFO] openmrs-web ........................................ SKIPPED
21-Sep-2017 20:30:44 [INFO] openmrs-webapp ..................................... SKIPPED
21-Sep-2017 20:30:44 [INFO] ------------------------------------------------------------------------
21-Sep-2017 20:30:44 [INFO] BUILD FAILURE
21-Sep-2017 20:30:44 [INFO] ------------------------------------------------------------------------
21-Sep-2017 20:30:44 [INFO] Total time: 11:21 min
21-Sep-2017 20:30:44 [INFO] Finished at: 2017-09-21T20:30:44+00:00
21-Sep-2017 20:30:44 [INFO] Final Memory: 58M/584M
21-Sep-2017 20:30:44 [INFO] ------------------------------------------------------------------------
21-Sep-2017 20:30:44 [ERROR] Failed to execute goal org.apache.maven.plugins:maven-surefire-plugin:2.18.1:test (default-test) on project openmrs-api: There are test failures.
21-Sep-2017 20:30:44 [ERROR]
21-Sep-2017 20:30:44 [ERROR] Please refer to /home/bamboo-agent-1/bamboo-agent/xml-data/build-dir/TRUNK-OC2-JOB1/api/target/surefire-reports for the individual test results.
21-Sep-2017 20:30:44 [ERROR] -> [Help 1]
21-Sep-2017 20:30:44 [ERROR]
21-Sep-2017 20:30:44 [ERROR] To see the full stack trace of the errors, re-run Maven with the -e switch.
21-Sep-2017 20:30:44 [ERROR] Re-run Maven using the -X switch to enable full debug logging.
21-Sep-2017 20:30:44 [ERROR]
21-Sep-2017 20:30:44 [ERROR] For more information about the errors and possible solutions, please read the following articles:
21-Sep-2017 20:30:44 [ERROR] [Help 1] http://cwiki.apache.org/confluence/display/MAVEN/MojoFailureException
21-Sep-2017 20:30:44 [ERROR]
21-Sep-2017 20:30:44 [ERROR] After correcting the problems, you can resume the build with the command
21-Sep-2017 20:30:44 [ERROR]   mvn <goals> -rf :openmrs-api
21-Sep-2017 20:30:45 Failing task since return code of [/usr/share/apache-maven-3.2.3/bin/mvn --batch-mode -Djava.io.tmpdir=/home/bamboo-agent-1/bamboo-agent/.agent_tmp/TRUNK-OC2-JOB1 clean package -Psonar] was 1 while expected 0
21-Sep-2017 20:30:45 Parsing test results under /home/bamboo-agent-1/bamboo-agent/xml-data/build-dir/TRUNK-OC2-JOB1...
21-Sep-2017 20:30:45 Finished task 'Build' with result: Failed
21-Sep-2017 20:30:45 Running post build plugin 'Docker Container Cleanup'
21-Sep-2017 20:30:45 Running post build plugin 'NCover Results Collector'
21-Sep-2017 20:30:45 Running post build plugin 'Clover Results Collector'
21-Sep-2017 20:30:45 Running post build plugin 'npm Cache Cleanup'
21-Sep-2017 20:30:45 Running post build plugin 'Artifact Copier'
21-Sep-2017 20:30:45 Publishing an artifact: openmrs-war
21-Sep-2017 20:30:45 Unable to publish artifact [openmrs-war]: the source directory /home/bamboo-agent-1/bamboo-agent/xml-data/build-dir/TRUNK-OC2-JOB1/webapp/target does not exist.
21-Sep-2017 20:30:45 The artifact hasn't been successfully published after 2.286 ms
21-Sep-2017 20:30:45 Publishing an artifact: openmrs-api
21-Sep-2017 20:30:45 Unable to publish artifact [openmrs-api]: the source directory /home/bamboo-agent-1/bamboo-agent/xml-data/build-dir/TRUNK-OC2-JOB1/webapp/target/openmrs/WEB-INF/lib does not exist.
21-Sep-2017 20:30:45 The artifact hasn't been successfully published after 141.8 μs
21-Sep-2017 20:30:45 Publishing an artifact: sonar-issues
21-Sep-2017 20:30:45 Unable to publish artifact [sonar-issues]: the source directory /home/bamboo-agent-1/bamboo-agent/xml-data/build-dir/TRUNK-OC2-JOB1/target/sonar/issues-report does not exist.
21-Sep-2017 20:30:45 The artifact hasn't been successfully published after 135.5 μs
21-Sep-2017 20:30:45 Finalising the build...
21-Sep-2017 20:30:45 Stopping timer.
21-Sep-2017 20:30:45 Build TRUNK-OC2-JOB1-196 completed.
21-Sep-2017 20:30:45 Running on server: post build plugin 'NCover Results Collector'
21-Sep-2017 20:30:45 Running on server: post build plugin 'Build Hanging Detection Configuration'
21-Sep-2017 20:30:45 Running on server: post build plugin 'Clover Delta Calculator'
21-Sep-2017 20:30:45 Running on server: post build plugin 'Maven Dependencies Postprocessor'
21-Sep-2017 20:30:45 All post build plugins have finished
21-Sep-2017 20:30:45 Generating build results summary...
21-Sep-2017 20:30:47 Saving build results to disk...
21-Sep-2017 20:30:47 Logging substituted variables...
21-Sep-2017 20:30:47 Indexing build results...
21-Sep-2017 20:30:47 Finished building TRUNK-OC2-JOB1-196.