Plan for OpenMRS Core 2.0.x

Build: #221 was successful

Job: Build and Test was successful

Stages & jobs

  1. Build and Test

  2. Deploy

  3. Release

    Requires a user to start manually

Build log

The build generated 1,196 lines of output.The output is too long and has been truncated to the last 1,000 lines. Download or view full build log

22-Feb-2019 18:35:52 Running org.openmrs.patient.impl.VerhoeffIdentifierValidatorTest
22-Feb-2019 18:35:52 Tests run: 2, Failures: 0, Errors: 0, Skipped: 0, Time elapsed: 0.002 sec - in org.openmrs.patient.impl.VerhoeffIdentifierValidatorTest
22-Feb-2019 18:35:52 Running org.openmrs.FormTest
22-Feb-2019 18:35:52 Tests run: 1, Failures: 0, Errors: 0, Skipped: 0, Time elapsed: 0 sec - in org.openmrs.FormTest
22-Feb-2019 18:35:52 Running org.openmrs.PersonTest
22-Feb-2019 18:35:52 Tests run: 27, Failures: 0, Errors: 0, Skipped: 0, Time elapsed: 0.381 sec - in org.openmrs.PersonTest
22-Feb-2019 18:35:52 Running org.openmrs.ConceptComponentTest
22-Feb-2019 18:35:52 Tests run: 1, Failures: 0, Errors: 0, Skipped: 0, Time elapsed: 0.027 sec - in org.openmrs.ConceptComponentTest
22-Feb-2019 18:35:52 Running org.openmrs.OrderTest
22-Feb-2019 18:35:53 Tests run: 56, Failures: 0, Errors: 0, Skipped: 0, Time elapsed: 0.473 sec - in org.openmrs.OrderTest
22-Feb-2019 18:35:53 Running org.openmrs.annotation.OpenmrsProfileExcludeFilterWithModulesTest
22-Feb-2019 18:35:54 Tests run: 1, Failures: 0, Errors: 0, Skipped: 0, Time elapsed: 1.005 sec - in org.openmrs.annotation.OpenmrsProfileExcludeFilterWithModulesTest
22-Feb-2019 18:35:54 Running org.openmrs.annotation.OpenmrsProfileIncludeFilterTest
22-Feb-2019 18:35:54 Tests run: 2, Failures: 0, Errors: 0, Skipped: 0, Time elapsed: 0.714 sec - in org.openmrs.annotation.OpenmrsProfileIncludeFilterTest
22-Feb-2019 18:35:54 Running org.openmrs.annotation.OpenmrsProfileExcludeFilterTest
22-Feb-2019 18:35:55 Tests run: 8, Failures: 0, Errors: 0, Skipped: 2, Time elapsed: 0.424 sec - in org.openmrs.annotation.OpenmrsProfileExcludeFilterTest
22-Feb-2019 18:35:55 Running org.openmrs.annotation.StartModuleAnnotationReuseTest
22-Feb-2019 18:35:56 Tests run: 1, Failures: 0, Errors: 0, Skipped: 0, Time elapsed: 1.23 sec - in org.openmrs.annotation.StartModuleAnnotationReuseTest
22-Feb-2019 18:35:56 Running org.openmrs.OrderTypeTest
22-Feb-2019 18:35:56 Tests run: 3, Failures: 0, Errors: 0, Skipped: 0, Time elapsed: 0.005 sec - in org.openmrs.OrderTypeTest
22-Feb-2019 18:35:56 Running org.openmrs.TestOrderTest
22-Feb-2019 18:35:56 Tests run: 4, Failures: 0, Errors: 0, Skipped: 0, Time elapsed: 0.005 sec - in org.openmrs.TestOrderTest
22-Feb-2019 18:35:56 Running org.openmrs.PersonAddressTest
22-Feb-2019 18:35:56 Tests run: 15, Failures: 0, Errors: 0, Skipped: 0, Time elapsed: 0.007 sec - in org.openmrs.PersonAddressTest
22-Feb-2019 18:35:56 Running org.openmrs.validator.PatientProgramValidatorTest
22-Feb-2019 18:35:57 Tests run: 22, Failures: 0, Errors: 0, Skipped: 0, Time elapsed: 1.078 sec - in org.openmrs.validator.PatientProgramValidatorTest
22-Feb-2019 18:35:57 Running org.openmrs.validator.PatientIdentifierTypeValidatorTest
22-Feb-2019 18:35:58 Tests run: 9, Failures: 0, Errors: 0, Skipped: 0, Time elapsed: 0.901 sec - in org.openmrs.validator.PatientIdentifierTypeValidatorTest
22-Feb-2019 18:35:58 Running org.openmrs.validator.ImplementationIdValidatorTest
22-Feb-2019 18:35:58 Tests run: 8, Failures: 0, Errors: 0, Skipped: 0, Time elapsed: 0.361 sec - in org.openmrs.validator.ImplementationIdValidatorTest
22-Feb-2019 18:35:58 Running org.openmrs.validator.UserValidatorTest
22-Feb-2019 18:35:59 Tests run: 21, Failures: 0, Errors: 0, Skipped: 0, Time elapsed: 0.518 sec - in org.openmrs.validator.UserValidatorTest
22-Feb-2019 18:35:59 Running org.openmrs.validator.ObsValidatorTest
22-Feb-2019 18:35:59 Tests run: 21, Failures: 0, Errors: 0, Skipped: 0, Time elapsed: 0.591 sec - in org.openmrs.validator.ObsValidatorTest
22-Feb-2019 18:35:59 Running org.openmrs.validator.DrugOrderValidatorTest
22-Feb-2019 18:36:01 Tests run: 36, Failures: 0, Errors: 0, Skipped: 0, Time elapsed: 1.926 sec - in org.openmrs.validator.DrugOrderValidatorTest
22-Feb-2019 18:36:01 Running org.openmrs.validator.PersonValidatorTest
22-Feb-2019 18:36:02 Tests run: 8, Failures: 0, Errors: 0, Skipped: 0, Time elapsed: 0.451 sec - in org.openmrs.validator.PersonValidatorTest
22-Feb-2019 18:36:02 Running org.openmrs.validator.ConceptDrugValidatorTest
22-Feb-2019 18:36:02 Tests run: 3, Failures: 0, Errors: 0, Skipped: 0, Time elapsed: 0.002 sec - in org.openmrs.validator.ConceptDrugValidatorTest
22-Feb-2019 18:36:02 Running org.openmrs.validator.VisitTypeValidatorTest
22-Feb-2019 18:36:02 Tests run: 2, Failures: 0, Errors: 0, Skipped: 0, Time elapsed: 0.305 sec - in org.openmrs.validator.VisitTypeValidatorTest
22-Feb-2019 18:36:02 Running org.openmrs.validator.AlertValidatorTest
22-Feb-2019 18:36:03 Tests run: 4, Failures: 0, Errors: 0, Skipped: 0, Time elapsed: 0.459 sec - in org.openmrs.validator.AlertValidatorTest
22-Feb-2019 18:36:03 Running org.openmrs.validator.PersonAttributeTypeValidatorTest
22-Feb-2019 18:36:03 Tests run: 7, Failures: 0, Errors: 0, Skipped: 0, Time elapsed: 0.48 sec - in org.openmrs.validator.PersonAttributeTypeValidatorTest
22-Feb-2019 18:36:03 Running org.openmrs.validator.PersonAddressValidatorTest
22-Feb-2019 18:36:04 Tests run: 10, Failures: 0, Errors: 0, Skipped: 0, Time elapsed: 0.586 sec - in org.openmrs.validator.PersonAddressValidatorTest
22-Feb-2019 18:36:04 Running org.openmrs.validator.ConceptAttributeTypeValidatorTest
22-Feb-2019 18:36:04 Tests run: 6, Failures: 0, Errors: 0, Skipped: 0, Time elapsed: 0.443 sec - in org.openmrs.validator.ConceptAttributeTypeValidatorTest
22-Feb-2019 18:36:04 Running org.openmrs.validator.DrugValidatorTest
22-Feb-2019 18:36:04 Tests run: 9, Failures: 0, Errors: 0, Skipped: 0, Time elapsed: 0.367 sec - in org.openmrs.validator.DrugValidatorTest
22-Feb-2019 18:36:04 Running org.openmrs.validator.SchedulerFormValidatorTest
22-Feb-2019 18:36:05 Tests run: 10, Failures: 0, Errors: 0, Skipped: 0, Time elapsed: 0.355 sec - in org.openmrs.validator.SchedulerFormValidatorTest
22-Feb-2019 18:36:05 Running org.openmrs.validator.TestOrderValidatorTest
22-Feb-2019 18:36:05 Tests run: 2, Failures: 0, Errors: 0, Skipped: 0, Time elapsed: 0.303 sec - in org.openmrs.validator.TestOrderValidatorTest
22-Feb-2019 18:36:05 Running org.openmrs.validator.PersonMergeLogValidatorTest
22-Feb-2019 18:36:06 Tests run: 6, Failures: 0, Errors: 0, Skipped: 0, Time elapsed: 0.586 sec - in org.openmrs.validator.PersonMergeLogValidatorTest
22-Feb-2019 18:36:06 Running org.openmrs.validator.RelationshipValidatorTest
22-Feb-2019 18:36:06 Tests run: 7, Failures: 0, Errors: 0, Skipped: 0, Time elapsed: 0.485 sec - in org.openmrs.validator.RelationshipValidatorTest
22-Feb-2019 18:36:06 Running org.openmrs.validator.LocationValidatorTest
22-Feb-2019 18:36:07 Tests run: 9, Failures: 0, Errors: 0, Skipped: 0, Time elapsed: 0.342 sec - in org.openmrs.validator.LocationValidatorTest
22-Feb-2019 18:36:07 Running org.openmrs.validator.PatientIdentifierValidatorTest
22-Feb-2019 18:36:07 Tests run: 20, Failures: 0, Errors: 0, Skipped: 0, Time elapsed: 0.828 sec - in org.openmrs.validator.PatientIdentifierValidatorTest
22-Feb-2019 18:36:07 Running org.openmrs.validator.PrivilegeValidatorTest
22-Feb-2019 18:36:08 Tests run: 5, Failures: 0, Errors: 0, Skipped: 0, Time elapsed: 0.436 sec - in org.openmrs.validator.PrivilegeValidatorTest
22-Feb-2019 18:36:08 Running org.openmrs.validator.PatientValidatorTest
22-Feb-2019 18:36:08 Tests run: 12, Failures: 0, Errors: 0, Skipped: 0, Time elapsed: 0.538 sec - in org.openmrs.validator.PatientValidatorTest
22-Feb-2019 18:36:08 Running org.openmrs.validator.AllergyValidatorTest
22-Feb-2019 18:36:09 Tests run: 9, Failures: 0, Errors: 0, Skipped: 0, Time elapsed: 0.625 sec - in org.openmrs.validator.AllergyValidatorTest
22-Feb-2019 18:36:09 Running org.openmrs.validator.PersonNameValidatorTest
22-Feb-2019 18:36:10 Tests run: 50, Failures: 0, Errors: 0, Skipped: 0, Time elapsed: 1.021 sec - in org.openmrs.validator.PersonNameValidatorTest
22-Feb-2019 18:36:10 Running org.openmrs.validator.OrderTypeValidatorTest
22-Feb-2019 18:36:11 Tests run: 14, Failures: 0, Errors: 0, Skipped: 0, Time elapsed: 1.033 sec - in org.openmrs.validator.OrderTypeValidatorTest
22-Feb-2019 18:36:11 Running org.openmrs.validator.VisitValidatorTest
22-Feb-2019 18:36:12 Tests run: 20, Failures: 0, Errors: 0, Skipped: 1, Time elapsed: 1.468 sec - in org.openmrs.validator.VisitValidatorTest
22-Feb-2019 18:36:12 Running org.openmrs.validator.FormValidatorTest
22-Feb-2019 18:36:13 Tests run: 8, Failures: 0, Errors: 0, Skipped: 0, Time elapsed: 0.622 sec - in org.openmrs.validator.FormValidatorTest
22-Feb-2019 18:36:13 Running org.openmrs.validator.LocationTagValidatorTest
22-Feb-2019 18:36:14 Tests run: 2, Failures: 0, Errors: 0, Skipped: 0, Time elapsed: 0.455 sec - in org.openmrs.validator.LocationTagValidatorTest
22-Feb-2019 18:36:14 Running org.openmrs.validator.EncounterValidatorTest
22-Feb-2019 18:36:14 Tests run: 10, Failures: 0, Errors: 0, Skipped: 0, Time elapsed: 0.466 sec - in org.openmrs.validator.EncounterValidatorTest
22-Feb-2019 18:36:14 Running org.openmrs.validator.FieldValidatorTest
22-Feb-2019 18:36:15 Tests run: 8, Failures: 0, Errors: 0, Skipped: 0, Time elapsed: 0.52 sec - in org.openmrs.validator.FieldValidatorTest
22-Feb-2019 18:36:15 Running org.openmrs.validator.ConceptDatatypeValidatorTest
22-Feb-2019 18:36:15 Tests run: 5, Failures: 0, Errors: 0, Skipped: 0, Time elapsed: 0.537 sec - in org.openmrs.validator.ConceptDatatypeValidatorTest
22-Feb-2019 18:36:15 Running org.openmrs.validator.ConceptMapTypeValidatorTest
22-Feb-2019 18:36:16 Tests run: 8, Failures: 0, Errors: 0, Skipped: 0, Time elapsed: 0.481 sec - in org.openmrs.validator.ConceptMapTypeValidatorTest
22-Feb-2019 18:36:16 Running org.openmrs.validator.ProviderValidatorTest
22-Feb-2019 18:36:16 Tests run: 13, Failures: 0, Errors: 0, Skipped: 0, Time elapsed: 0.524 sec - in org.openmrs.validator.ProviderValidatorTest
22-Feb-2019 18:36:16 Running org.openmrs.validator.StateConversionValidatorTest
22-Feb-2019 18:36:16 Tests run: 4, Failures: 0, Errors: 0, Skipped: 0, Time elapsed: 0.322 sec - in org.openmrs.validator.StateConversionValidatorTest
22-Feb-2019 18:36:16 Running org.openmrs.validator.ProgramValidatorTest
22-Feb-2019 18:36:17 Tests run: 8, Failures: 0, Errors: 0, Skipped: 0, Time elapsed: 0.713 sec - in org.openmrs.validator.ProgramValidatorTest
22-Feb-2019 18:36:17 Running org.openmrs.validator.BaseAttributeTypeValidatorTest
22-Feb-2019 18:36:19 Tests run: 9, Failures: 0, Errors: 0, Skipped: 0, Time elapsed: 2.116 sec - in org.openmrs.validator.BaseAttributeTypeValidatorTest
22-Feb-2019 18:36:19 Running org.openmrs.validator.OrderFrequencyValidatorTest
22-Feb-2019 18:36:20 Tests run: 9, Failures: 0, Errors: 0, Skipped: 0, Time elapsed: 0.687 sec - in org.openmrs.validator.OrderFrequencyValidatorTest
22-Feb-2019 18:36:20 Running org.openmrs.validator.EncounterTypeValidatorTest
22-Feb-2019 18:36:21 Tests run: 7, Failures: 0, Errors: 0, Skipped: 0, Time elapsed: 0.567 sec - in org.openmrs.validator.EncounterTypeValidatorTest
22-Feb-2019 18:36:21 Running org.openmrs.validator.ConceptValidatorTest
22-Feb-2019 18:36:21 Tests run: 30, Failures: 0, Errors: 0, Skipped: 0, Time elapsed: 0.913 sec - in org.openmrs.validator.ConceptValidatorTest
22-Feb-2019 18:36:21 Running org.openmrs.validator.ValidateUtilTest
22-Feb-2019 18:36:22 Tests run: 8, Failures: 0, Errors: 0, Skipped: 0, Time elapsed: 0.667 sec - in org.openmrs.validator.ValidateUtilTest
22-Feb-2019 18:36:22 Running org.openmrs.validator.ConceptNameTagValidatorTest
22-Feb-2019 18:36:23 Tests run: 7, Failures: 0, Errors: 0, Skipped: 0, Time elapsed: 0.426 sec - in org.openmrs.validator.ConceptNameTagValidatorTest
22-Feb-2019 18:36:23 Running org.openmrs.validator.FieldTypeValidatorTest
22-Feb-2019 18:36:23 Tests run: 5, Failures: 0, Errors: 0, Skipped: 0, Time elapsed: 0.758 sec - in org.openmrs.validator.FieldTypeValidatorTest
22-Feb-2019 18:36:23 Running org.openmrs.validator.RoleValidatorTest
22-Feb-2019 18:36:24 Tests run: 6, Failures: 0, Errors: 0, Skipped: 0, Time elapsed: 0.51 sec - in org.openmrs.validator.RoleValidatorTest
22-Feb-2019 18:36:24 Running org.openmrs.validator.VisitAttributeTypeValidatorTest
22-Feb-2019 18:36:24 Tests run: 2, Failures: 0, Errors: 0, Skipped: 0, Time elapsed: 0.327 sec - in org.openmrs.validator.VisitAttributeTypeValidatorTest
22-Feb-2019 18:36:24 Running org.openmrs.validator.LocationAttributeTypeValidatorTest
22-Feb-2019 18:36:25 Tests run: 6, Failures: 0, Errors: 0, Skipped: 0, Time elapsed: 0.523 sec - in org.openmrs.validator.LocationAttributeTypeValidatorTest
22-Feb-2019 18:36:25 Running org.openmrs.validator.RelationshipTypeValidatorTest
22-Feb-2019 18:36:25 Tests run: 7, Failures: 0, Errors: 0, Skipped: 0, Time elapsed: 0.502 sec - in org.openmrs.validator.RelationshipTypeValidatorTest
22-Feb-2019 18:36:25 Running org.openmrs.validator.ProviderAttributeTypeValidatorTest
22-Feb-2019 18:36:26 Tests run: 2, Failures: 0, Errors: 0, Skipped: 0, Time elapsed: 1.193 sec - in org.openmrs.validator.ProviderAttributeTypeValidatorTest
22-Feb-2019 18:36:26 Running org.openmrs.validator.OrderValidatorTest
22-Feb-2019 18:36:27 Tests run: 22, Failures: 0, Errors: 0, Skipped: 0, Time elapsed: 0.813 sec - in org.openmrs.validator.OrderValidatorTest
22-Feb-2019 18:36:27 Running org.openmrs.validator.ConceptSourceValidatorTest
22-Feb-2019 18:36:28 Tests run: 6, Failures: 0, Errors: 0, Skipped: 0, Time elapsed: 0.373 sec - in org.openmrs.validator.ConceptSourceValidatorTest
22-Feb-2019 18:36:28 Running org.openmrs.validator.EncounterRoleValidatorTest
22-Feb-2019 18:36:28 Tests run: 5, Failures: 0, Errors: 0, Skipped: 0, Time elapsed: 0.373 sec - in org.openmrs.validator.EncounterRoleValidatorTest
22-Feb-2019 18:36:28 Running org.openmrs.validator.RequireNameValidatorTest
22-Feb-2019 18:36:28 Tests run: 2, Failures: 0, Errors: 0, Skipped: 0, Time elapsed: 0.002 sec - in org.openmrs.validator.RequireNameValidatorTest
22-Feb-2019 18:36:28 Running org.openmrs.validator.ConceptReferenceTermValidatorTest
22-Feb-2019 18:36:28 [Field error in object 'term' on field 'conceptReferenceTermMaps[1].termB': rejected value [weight term(WGT234)]; codes [ConceptReferenceTerm.termToTerm.alreadyMapped.term.conceptReferenceTermMaps[1].termB,ConceptReferenceTerm.termToTerm.alreadyMapped.term.conceptReferenceTermMaps.termB,ConceptReferenceTerm.termToTerm.alreadyMapped.conceptReferenceTermMaps[1].termB,ConceptReferenceTerm.termToTerm.alreadyMapped.conceptReferenceTermMaps.termB,ConceptReferenceTerm.termToTerm.alreadyMapped.termB,ConceptReferenceTerm.termToTerm.alreadyMapped.org.openmrs.ConceptReferenceTerm,ConceptReferenceTerm.termToTerm.alreadyMapped]; arguments []; default message [Cannot map a reference term multiple times to the same concept reference term]]
22-Feb-2019 18:36:28 Tests run: 18, Failures: 0, Errors: 0, Skipped: 3, Time elapsed: 0.408 sec - in org.openmrs.validator.ConceptReferenceTermValidatorTest
22-Feb-2019 18:36:28 Running org.openmrs.validator.HL7SourceValidatorTest
22-Feb-2019 18:36:29 Tests run: 2, Failures: 0, Errors: 0, Skipped: 0, Time elapsed: 0.281 sec - in org.openmrs.validator.HL7SourceValidatorTest
22-Feb-2019 18:36:29 Running org.openmrs.validator.ConceptClassValidatorTest
22-Feb-2019 18:36:29 Tests run: 6, Failures: 0, Errors: 0, Skipped: 0, Time elapsed: 0.404 sec - in org.openmrs.validator.ConceptClassValidatorTest
22-Feb-2019 18:36:29 Running org.openmrs.BaseOpenmrsObjectTest
22-Feb-2019 18:36:29 Tests run: 20, Failures: 0, Errors: 0, Skipped: 0, Time elapsed: 0.455 sec - in org.openmrs.BaseOpenmrsObjectTest
22-Feb-2019 18:36:29 Running org.openmrs.EncounterTypeTest
22-Feb-2019 18:36:29 Tests run: 1, Failures: 0, Errors: 0, Skipped: 0, Time elapsed: 0.001 sec - in org.openmrs.EncounterTypeTest
22-Feb-2019 18:36:29 Running org.openmrs.DurationTest
22-Feb-2019 18:36:30 Tests run: 11, Failures: 0, Errors: 0, Skipped: 0, Time elapsed: 0.514 sec - in org.openmrs.DurationTest
22-Feb-2019 18:36:30 Running org.openmrs.LocationTest
22-Feb-2019 18:36:30 Tests run: 3, Failures: 0, Errors: 0, Skipped: 0, Time elapsed: 0.001 sec - in org.openmrs.LocationTest
22-Feb-2019 18:36:30 Running org.openmrs.comparator.PatientIdentifierTypeDefaultComparatorTest
22-Feb-2019 18:36:30 Tests run: 1, Failures: 0, Errors: 0, Skipped: 0, Time elapsed: 0.014 sec - in org.openmrs.comparator.PatientIdentifierTypeDefaultComparatorTest
22-Feb-2019 18:36:30 Running org.openmrs.ObsBehaviorTest
22-Feb-2019 18:36:30 Tests run: 3, Failures: 0, Errors: 0, Skipped: 1, Time elapsed: 0.44 sec - in org.openmrs.ObsBehaviorTest
22-Feb-2019 18:36:30 Running org.openmrs.ConceptReferenceTermTest
22-Feb-2019 18:36:30 Tests run: 3, Failures: 0, Errors: 0, Skipped: 0, Time elapsed: 0.001 sec - in org.openmrs.ConceptReferenceTermTest
22-Feb-2019 18:36:30 Running org.openmrs.aop.AuthorizationAdviceTest
22-Feb-2019 18:36:31 Tests run: 1, Failures: 0, Errors: 0, Skipped: 0, Time elapsed: 0.406 sec - in org.openmrs.aop.AuthorizationAdviceTest
22-Feb-2019 18:36:31 Running org.openmrs.aop.RequiredDataAdviceTest
22-Feb-2019 18:36:31 Tests run: 26, Failures: 0, Errors: 0, Skipped: 0, Time elapsed: 0.449 sec - in org.openmrs.aop.RequiredDataAdviceTest
22-Feb-2019 18:36:31 Running org.openmrs.PersonAttributeTest
22-Feb-2019 18:36:32 Tests run: 6, Failures: 0, Errors: 0, Skipped: 0, Time elapsed: 0.317 sec - in org.openmrs.PersonAttributeTest
22-Feb-2019 18:36:32 Running org.openmrs.RoleTest
22-Feb-2019 18:36:32 Tests run: 7, Failures: 0, Errors: 0, Skipped: 0, Time elapsed: 0 sec - in org.openmrs.RoleTest
22-Feb-2019 18:36:32 Running org.openmrs.messagesource.impl.DefaultMessageSourceServiceImplTest
22-Feb-2019 18:36:32 Tests run: 1, Failures: 0, Errors: 0, Skipped: 0, Time elapsed: 0 sec - in org.openmrs.messagesource.impl.DefaultMessageSourceServiceImplTest
22-Feb-2019 18:36:32 Running org.openmrs.messagesource.impl.CachedMessageSourceTest
22-Feb-2019 18:36:32 Tests run: 2, Failures: 0, Errors: 0, Skipped: 0, Time elapsed: 0.04 sec - in org.openmrs.messagesource.impl.CachedMessageSourceTest
22-Feb-2019 18:36:32 Running org.openmrs.messagesource.MessageSourceServiceTest
22-Feb-2019 18:36:32 Tests run: 1, Failures: 0, Errors: 0, Skipped: 0, Time elapsed: 0.572 sec - in org.openmrs.messagesource.MessageSourceServiceTest
22-Feb-2019 18:36:32 Running org.openmrs.messagesource.PresentationMessageMapTest
22-Feb-2019 18:36:32 Tests run: 2, Failures: 0, Errors: 0, Skipped: 0, Time elapsed: 0 sec - in org.openmrs.messagesource.PresentationMessageMapTest
22-Feb-2019 18:36:32 Running org.openmrs.util.DatabaseUpdaterTest
22-Feb-2019 18:36:33 INFO 2/22/19 6:36 PM:liquibase: Creating database history table with name: LIQUIBASECHANGELOG
22-Feb-2019 18:36:33 INFO 2/22/19 6:36 PM:liquibase: Reading from LIQUIBASECHANGELOG
22-Feb-2019 18:36:34 Tests run: 1, Failures: 0, Errors: 0, Skipped: 0, Time elapsed: 1.414 sec - in org.openmrs.util.DatabaseUpdaterTest
22-Feb-2019 18:36:34 Running org.openmrs.util.HttpClientTest
22-Feb-2019 18:36:34 Tests run: 1, Failures: 0, Errors: 0, Skipped: 0, Time elapsed: 0.013 sec - in org.openmrs.util.HttpClientTest
22-Feb-2019 18:36:34 Running org.openmrs.util.LocaleUtilityTest
22-Feb-2019 18:36:34 Tests run: 21, Failures: 0, Errors: 0, Skipped: 0, Time elapsed: 0.468 sec - in org.openmrs.util.LocaleUtilityTest
22-Feb-2019 18:36:34 Running org.openmrs.util.OpenmrsSecurityManagerTest
22-Feb-2019 18:36:34 Tests run: 2, Failures: 0, Errors: 0, Skipped: 0, Time elapsed: 0.001 sec - in org.openmrs.util.OpenmrsSecurityManagerTest
22-Feb-2019 18:36:34 Running org.openmrs.util.LocationUtilityTest
22-Feb-2019 18:36:35 Tests run: 2, Failures: 0, Errors: 0, Skipped: 0, Time elapsed: 0.449 sec - in org.openmrs.util.LocationUtilityTest
22-Feb-2019 18:36:35 Running org.openmrs.util.ProviderByPersonNameComparatorTest
22-Feb-2019 18:36:35 Tests run: 6, Failures: 0, Errors: 0, Skipped: 0, Time elapsed: 0.001 sec - in org.openmrs.util.ProviderByPersonNameComparatorTest
22-Feb-2019 18:36:35 Running org.openmrs.util.DoubleRangeTest
22-Feb-2019 18:36:35 Tests run: 28, Failures: 0, Errors: 0, Skipped: 0, Time elapsed: 0.005 sec - in org.openmrs.util.DoubleRangeTest
22-Feb-2019 18:36:35 Running org.openmrs.util.HttpUrlTest
22-Feb-2019 18:36:35 Tests run: 4, Failures: 0, Errors: 0, Skipped: 0, Time elapsed: 0.007 sec - in org.openmrs.util.HttpUrlTest
22-Feb-2019 18:36:35 Running org.openmrs.util.JavaVersionTest
22-Feb-2019 18:36:35 SLF4J: Class path contains multiple SLF4J bindings.
22-Feb-2019 18:36:35 SLF4J: Found binding in [jar:file:/home/bamboo-agent/.m2/repository/org/slf4j/slf4j-log4j12/1.6.0/slf4j-log4j12-1.6.0.jar!/org/slf4j/impl/StaticLoggerBinder.class]
22-Feb-2019 18:36:35 SLF4J: Found binding in [jar:file:/home/bamboo-agent/.m2/repository/org/slf4j/slf4j-log4j12/1.6.0/slf4j-log4j12-1.6.0.jar!/org/slf4j/impl/StaticLoggerBinder.class]
22-Feb-2019 18:36:35 SLF4J: See http://www.slf4j.org/codes.html#multiple_bindings for an explanation.
22-Feb-2019 18:36:36 Tests run: 2, Failures: 0, Errors: 0, Skipped: 0, Time elapsed: 0.955 sec - in org.openmrs.util.JavaVersionTest
22-Feb-2019 18:36:36 Running org.openmrs.util.ReflectTest
22-Feb-2019 18:36:36 Tests run: 18, Failures: 0, Errors: 0, Skipped: 0, Time elapsed: 0.006 sec - in org.openmrs.util.ReflectTest
22-Feb-2019 18:36:36 Running org.openmrs.util.UpgradeUtilTest
22-Feb-2019 18:36:36 Tests run: 2, Failures: 0, Errors: 0, Skipped: 0, Time elapsed: 0.467 sec - in org.openmrs.util.UpgradeUtilTest
22-Feb-2019 18:36:36 Running org.openmrs.util.DateUtilTest
22-Feb-2019 18:36:36 Tests run: 1, Failures: 0, Errors: 0, Skipped: 0, Time elapsed: 0.001 sec - in org.openmrs.util.DateUtilTest
22-Feb-2019 18:36:36 Running org.openmrs.util.ExceptionUtilTest
22-Feb-2019 18:36:36 Tests run: 1, Failures: 0, Errors: 0, Skipped: 0, Time elapsed: 0.008 sec - in org.openmrs.util.ExceptionUtilTest
22-Feb-2019 18:36:36 Running org.openmrs.util.PersonByNameComparatorTest
22-Feb-2019 18:36:36 Tests run: 4, Failures: 0, Errors: 0, Skipped: 0, Time elapsed: 0.003 sec - in org.openmrs.util.PersonByNameComparatorTest
22-Feb-2019 18:36:36 Running org.openmrs.util.UserByNameComparatorTest
22-Feb-2019 18:36:36 Tests run: 1, Failures: 0, Errors: 0, Skipped: 0, Time elapsed: 0.004 sec - in org.openmrs.util.UserByNameComparatorTest
22-Feb-2019 18:36:36 Running org.openmrs.util.DrugsByNameComparatorTest
22-Feb-2019 18:36:36 Tests run: 4, Failures: 0, Errors: 0, Skipped: 0, Time elapsed: 0 sec - in org.openmrs.util.DrugsByNameComparatorTest
22-Feb-2019 18:36:36 Running org.openmrs.util.OpenmrsUtilTest
22-Feb-2019 18:36:38 Tests run: 44, Failures: 0, Errors: 0, Skipped: 0, Time elapsed: 1.833 sec - in org.openmrs.util.OpenmrsUtilTest
22-Feb-2019 18:36:38 Running org.openmrs.util.GraphTest
22-Feb-2019 18:36:38 Tests run: 2, Failures: 0, Errors: 0, Skipped: 0, Time elapsed: 0.006 sec - in org.openmrs.util.GraphTest
22-Feb-2019 18:36:38 Running org.openmrs.util.HandlerUtilTest
22-Feb-2019 18:36:38 Tests run: 6, Failures: 0, Errors: 0, Skipped: 0, Time elapsed: 0.454 sec - in org.openmrs.util.HandlerUtilTest
22-Feb-2019 18:36:38 Running org.openmrs.util.SecurityTest
22-Feb-2019 18:36:38 Tests run: 7, Failures: 0, Errors: 0, Skipped: 0, Time elapsed: 0.081 sec - in org.openmrs.util.SecurityTest
22-Feb-2019 18:36:38 Running org.openmrs.DrugTest
22-Feb-2019 18:36:39 Tests run: 2, Failures: 0, Errors: 0, Skipped: 0, Time elapsed: 0.243 sec - in org.openmrs.DrugTest
22-Feb-2019 18:36:39 Running org.openmrs.ConceptNumericTest
22-Feb-2019 18:36:39 Tests run: 8, Failures: 0, Errors: 0, Skipped: 0, Time elapsed: 0.376 sec - in org.openmrs.ConceptNumericTest
22-Feb-2019 18:36:39 Running org.openmrs.OrderEntryIntegrationTest
22-Feb-2019 18:36:40 Tests run: 15, Failures: 0, Errors: 0, Skipped: 0, Time elapsed: 0.795 sec - in org.openmrs.OrderEntryIntegrationTest
22-Feb-2019 18:36:40 Running org.openmrs.api.LocationServiceTest
22-Feb-2019 18:36:41 Tests run: 70, Failures: 0, Errors: 0, Skipped: 0, Time elapsed: 1.259 sec - in org.openmrs.api.LocationServiceTest
22-Feb-2019 18:36:41 Running org.openmrs.api.AdministrationServiceTest
22-Feb-2019 18:36:42 Tests run: 53, Failures: 0, Errors: 0, Skipped: 4, Time elapsed: 0.923 sec - in org.openmrs.api.AdministrationServiceTest
22-Feb-2019 18:36:42 Running org.openmrs.api.FormServiceTest
22-Feb-2019 18:36:43 Tests run: 40, Failures: 0, Errors: 0, Skipped: 0, Time elapsed: 0.931 sec - in org.openmrs.api.FormServiceTest
22-Feb-2019 18:36:43 Running org.openmrs.api.ProviderServiceTest
22-Feb-2019 18:36:44 Tests run: 40, Failures: 0, Errors: 0, Skipped: 0, Time elapsed: 1.114 sec - in org.openmrs.api.ProviderServiceTest
22-Feb-2019 18:36:44 Running org.openmrs.api.OrderSetServiceTest
22-Feb-2019 18:36:45 Tests run: 12, Failures: 0, Errors: 0, Skipped: 0, Time elapsed: 0.451 sec - in org.openmrs.api.OrderSetServiceTest
22-Feb-2019 18:36:45 Running org.openmrs.api.PersonServiceTest
22-Feb-2019 18:36:47 Tests run: 119, Failures: 0, Errors: 0, Skipped: 0, Time elapsed: 2.264 sec - in org.openmrs.api.PersonServiceTest
22-Feb-2019 18:36:47 Running org.openmrs.api.EncounterServiceTest
22-Feb-2019 18:36:48 ERROR - ImageHandler.getObs(79) |2019-02-22 18:36:48,310| Trying to read file: /home/bamboo-agent/bamboo-agent/.agent_tmp/TRUNK-OC2-JOB1/appdir-for-unit-tests-6745564556920113321/complex_obs/file1.jpg
22-Feb-2019 18:36:48 javax.imageio.IIOException: Can't read input file!
22-Feb-2019 18:36:48         at javax.imageio.ImageIO.read(ImageIO.java:1301)
22-Feb-2019 18:36:48         at org.openmrs.obs.handler.ImageHandler.getObs(ImageHandler.java:76)
22-Feb-2019 18:36:48         at org.openmrs.api.impl.ObsServiceImpl.getObs(ObsServiceImpl.java:254)
22-Feb-2019 18:36:48         at sun.reflect.GeneratedMethodAccessor774.invoke(Unknown Source)
22-Feb-2019 18:36:48         at sun.reflect.DelegatingMethodAccessorImpl.invoke(DelegatingMethodAccessorImpl.java:43)
22-Feb-2019 18:36:48         at java.lang.reflect.Method.invoke(Method.java:498)
22-Feb-2019 18:36:48         at org.springframework.aop.support.AopUtils.invokeJoinpointUsingReflection(AopUtils.java:317)
22-Feb-2019 18:36:48         at org.springframework.aop.framework.ReflectiveMethodInvocation.invokeJoinpoint(ReflectiveMethodInvocation.java:190)
22-Feb-2019 18:36:48         at org.springframework.aop.framework.ReflectiveMethodInvocation.proceed(ReflectiveMethodInvocation.java:157)
22-Feb-2019 18:36:48         at org.springframework.transaction.interceptor.TransactionInterceptor$1.proceedWithInvocation(TransactionInterceptor.java:99)
22-Feb-2019 18:36:48         at org.springframework.transaction.interceptor.TransactionAspectSupport.invokeWithinTransaction(TransactionAspectSupport.java:281)
22-Feb-2019 18:36:48         at org.springframework.transaction.interceptor.TransactionInterceptor.invoke(TransactionInterceptor.java:96)
22-Feb-2019 18:36:48         at org.springframework.aop.framework.ReflectiveMethodInvocation.proceed(ReflectiveMethodInvocation.java:179)
22-Feb-2019 18:36:48         at org.springframework.aop.framework.JdkDynamicAopProxy.invoke(JdkDynamicAopProxy.java:207)
22-Feb-2019 18:36:48         at com.sun.proxy.$Proxy73.getObs(Unknown Source)
22-Feb-2019 18:36:48         at sun.reflect.GeneratedMethodAccessor774.invoke(Unknown Source)
22-Feb-2019 18:36:48         at sun.reflect.DelegatingMethodAccessorImpl.invoke(DelegatingMethodAccessorImpl.java:43)
22-Feb-2019 18:36:48         at java.lang.reflect.Method.invoke(Method.java:498)
22-Feb-2019 18:36:48         at org.springframework.aop.support.AopUtils.invokeJoinpointUsingReflection(AopUtils.java:317)
22-Feb-2019 18:36:48         at org.springframework.aop.framework.ReflectiveMethodInvocation.invokeJoinpoint(ReflectiveMethodInvocation.java:190)
22-Feb-2019 18:36:48         at org.springframework.aop.framework.ReflectiveMethodInvocation.proceed(ReflectiveMethodInvocation.java:157)
22-Feb-2019 18:36:48         at org.openmrs.aop.LoggingAdvice.invoke(LoggingAdvice.java:121)
22-Feb-2019 18:36:48         at org.springframework.aop.framework.ReflectiveMethodInvocation.proceed(ReflectiveMethodInvocation.java:179)
22-Feb-2019 18:36:48         at org.springframework.aop.framework.adapter.MethodBeforeAdviceInterceptor.invoke(MethodBeforeAdviceInterceptor.java:52)
22-Feb-2019 18:36:48         at org.springframework.aop.framework.ReflectiveMethodInvocation.proceed(ReflectiveMethodInvocation.java:179)
22-Feb-2019 18:36:48         at org.springframework.aop.framework.adapter.MethodBeforeAdviceInterceptor.invoke(MethodBeforeAdviceInterceptor.java:52)
22-Feb-2019 18:36:48         at org.springframework.aop.framework.ReflectiveMethodInvocation.proceed(ReflectiveMethodInvocation.java:179)
22-Feb-2019 18:36:48         at org.springframework.aop.framework.JdkDynamicAopProxy.invoke(JdkDynamicAopProxy.java:207)
22-Feb-2019 18:36:48         at com.sun.proxy.$Proxy74.getObs(Unknown Source)
22-Feb-2019 18:36:48         at org.openmrs.api.impl.EncounterServiceImpl.saveEncounter(EncounterServiceImpl.java:214)
22-Feb-2019 18:36:48         at sun.reflect.GeneratedMethodAccessor1144.invoke(Unknown Source)
22-Feb-2019 18:36:48         at sun.reflect.DelegatingMethodAccessorImpl.invoke(DelegatingMethodAccessorImpl.java:43)
22-Feb-2019 18:36:48         at java.lang.reflect.Method.invoke(Method.java:498)
22-Feb-2019 18:36:48         at org.springframework.aop.support.AopUtils.invokeJoinpointUsingReflection(AopUtils.java:317)
22-Feb-2019 18:36:48         at org.springframework.aop.framework.ReflectiveMethodInvocation.invokeJoinpoint(ReflectiveMethodInvocation.java:190)
22-Feb-2019 18:36:48         at org.springframework.aop.framework.ReflectiveMethodInvocation.proceed(ReflectiveMethodInvocation.java:157)
22-Feb-2019 18:36:48         at org.springframework.transaction.interceptor.TransactionInterceptor$1.proceedWithInvocation(TransactionInterceptor.java:99)
22-Feb-2019 18:36:48         at org.springframework.transaction.interceptor.TransactionAspectSupport.invokeWithinTransaction(TransactionAspectSupport.java:281)
22-Feb-2019 18:36:48         at org.springframework.transaction.interceptor.TransactionInterceptor.invoke(TransactionInterceptor.java:96)
22-Feb-2019 18:36:48         at org.springframework.aop.framework.ReflectiveMethodInvocation.proceed(ReflectiveMethodInvocation.java:179)
22-Feb-2019 18:36:48         at org.springframework.aop.framework.JdkDynamicAopProxy.invoke(JdkDynamicAopProxy.java:207)
22-Feb-2019 18:36:48         at com.sun.proxy.$Proxy75.saveEncounter(Unknown Source)
22-Feb-2019 18:36:48         at sun.reflect.GeneratedMethodAccessor1144.invoke(Unknown Source)
22-Feb-2019 18:36:48         at sun.reflect.DelegatingMethodAccessorImpl.invoke(DelegatingMethodAccessorImpl.java:43)
22-Feb-2019 18:36:48         at java.lang.reflect.Method.invoke(Method.java:498)
22-Feb-2019 18:36:48         at org.springframework.aop.support.AopUtils.invokeJoinpointUsingReflection(AopUtils.java:317)
22-Feb-2019 18:36:48         at org.springframework.aop.framework.ReflectiveMethodInvocation.invokeJoinpoint(ReflectiveMethodInvocation.java:190)
22-Feb-2019 18:36:48         at org.springframework.aop.framework.ReflectiveMethodInvocation.proceed(ReflectiveMethodInvocation.java:157)
22-Feb-2019 18:36:48         at org.openmrs.aop.LoggingAdvice.invoke(LoggingAdvice.java:121)
22-Feb-2019 18:36:48         at org.springframework.aop.framework.ReflectiveMethodInvocation.proceed(ReflectiveMethodInvocation.java:179)
22-Feb-2019 18:36:48         at org.springframework.aop.framework.adapter.MethodBeforeAdviceInterceptor.invoke(MethodBeforeAdviceInterceptor.java:52)
22-Feb-2019 18:36:48         at org.springframework.aop.framework.ReflectiveMethodInvocation.proceed(ReflectiveMethodInvocation.java:179)
22-Feb-2019 18:36:48         at org.springframework.aop.framework.adapter.MethodBeforeAdviceInterceptor.invoke(MethodBeforeAdviceInterceptor.java:52)
22-Feb-2019 18:36:48         at org.springframework.aop.framework.ReflectiveMethodInvocation.proceed(ReflectiveMethodInvocation.java:179)
22-Feb-2019 18:36:48         at org.springframework.aop.framework.JdkDynamicAopProxy.invoke(JdkDynamicAopProxy.java:207)
22-Feb-2019 18:36:48         at com.sun.proxy.$Proxy76.saveEncounter(Unknown Source)
22-Feb-2019 18:36:48         at org.openmrs.api.EncounterServiceTest.saveEncounter_shouldSaveEncounterWithComplexObs(EncounterServiceTest.java:385)
22-Feb-2019 18:36:48         at sun.reflect.NativeMethodAccessorImpl.invoke0(Native Method)
22-Feb-2019 18:36:48         at sun.reflect.NativeMethodAccessorImpl.invoke(NativeMethodAccessorImpl.java:62)
22-Feb-2019 18:36:48         at sun.reflect.DelegatingMethodAccessorImpl.invoke(DelegatingMethodAccessorImpl.java:43)
22-Feb-2019 18:36:48         at java.lang.reflect.Method.invoke(Method.java:498)
22-Feb-2019 18:36:48         at org.junit.runners.model.FrameworkMethod$1.runReflectiveCall(FrameworkMethod.java:47)
22-Feb-2019 18:36:48         at org.junit.internal.runners.model.ReflectiveCallable.run(ReflectiveCallable.java:12)
22-Feb-2019 18:36:48         at org.junit.runners.model.FrameworkMethod.invokeExplosively(FrameworkMethod.java:44)
22-Feb-2019 18:36:48         at org.junit.internal.runners.statements.InvokeMethod.evaluate(InvokeMethod.java:17)
22-Feb-2019 18:36:48         at org.junit.internal.runners.statements.RunBefores.evaluate(RunBefores.java:26)
22-Feb-2019 18:36:48         at org.springframework.test.context.junit4.statements.RunBeforeTestMethodCallbacks.evaluate(RunBeforeTestMethodCallbacks.java:73)
22-Feb-2019 18:36:48         at org.junit.internal.runners.statements.RunAfters.evaluate(RunAfters.java:27)
22-Feb-2019 18:36:48         at org.springframework.test.context.junit4.statements.RunAfterTestMethodCallbacks.evaluate(RunAfterTestMethodCallbacks.java:82)
22-Feb-2019 18:36:48         at org.springframework.test.context.junit4.statements.SpringRepeat.evaluate(SpringRepeat.java:73)
22-Feb-2019 18:36:48         at org.junit.runners.ParentRunner.runLeaf(ParentRunner.java:271)
22-Feb-2019 18:36:48         at org.springframework.test.context.junit4.SpringJUnit4ClassRunner.runChild(SpringJUnit4ClassRunner.java:217)
22-Feb-2019 18:36:48         at org.springframework.test.context.junit4.SpringJUnit4ClassRunner.runChild(SpringJUnit4ClassRunner.java:83)
22-Feb-2019 18:36:48         at org.junit.runners.ParentRunner$3.run(ParentRunner.java:238)
22-Feb-2019 18:36:48         at org.junit.runners.ParentRunner$1.schedule(ParentRunner.java:63)
22-Feb-2019 18:36:48         at org.junit.runners.ParentRunner.runChildren(ParentRunner.java:236)
22-Feb-2019 18:36:48         at org.junit.runners.ParentRunner.access$000(ParentRunner.java:53)
22-Feb-2019 18:36:48         at org.junit.runners.ParentRunner$2.evaluate(ParentRunner.java:229)
22-Feb-2019 18:36:48         at org.springframework.test.context.junit4.statements.RunBeforeTestClassCallbacks.evaluate(RunBeforeTestClassCallbacks.java:61)
22-Feb-2019 18:36:48         at org.junit.internal.runners.statements.RunAfters.evaluate(RunAfters.java:27)
22-Feb-2019 18:36:48         at org.springframework.test.context.junit4.statements.RunAfterTestClassCallbacks.evaluate(RunAfterTestClassCallbacks.java:68)
22-Feb-2019 18:36:48         at org.junit.runners.ParentRunner.run(ParentRunner.java:309)
22-Feb-2019 18:36:48         at org.springframework.test.context.junit4.SpringJUnit4ClassRunner.run(SpringJUnit4ClassRunner.java:163)
22-Feb-2019 18:36:48         at org.apache.maven.surefire.junit4.JUnit4Provider.execute(JUnit4Provider.java:283)
22-Feb-2019 18:36:48         at org.apache.maven.surefire.junit4.JUnit4Provider.executeWithRerun(JUnit4Provider.java:173)
22-Feb-2019 18:36:48         at org.apache.maven.surefire.junit4.JUnit4Provider.executeTestSet(JUnit4Provider.java:153)
22-Feb-2019 18:36:48         at org.apache.maven.surefire.junit4.JUnit4Provider.invoke(JUnit4Provider.java:128)
22-Feb-2019 18:36:48         at org.apache.maven.surefire.booter.ForkedBooter.invokeProviderInSameClassLoader(ForkedBooter.java:203)
22-Feb-2019 18:36:48         at org.apache.maven.surefire.booter.ForkedBooter.runSuitesInProcess(ForkedBooter.java:155)
22-Feb-2019 18:36:48         at org.apache.maven.surefire.booter.ForkedBooter.main(ForkedBooter.java:103)
22-Feb-2019 18:36:48 ERROR - ImageHandler.getObs(96) |2019-02-22 18:36:48,324| Image /home/bamboo-agent/bamboo-agent/.agent_tmp/TRUNK-OC2-JOB1/appdir-for-unit-tests-6745564556920113321/complex_obs/file1.jpg was not found
22-Feb-2019 18:36:48 java.io.FileNotFoundException: /home/bamboo-agent/bamboo-agent/.agent_tmp/TRUNK-OC2-JOB1/appdir-for-unit-tests-6745564556920113321/complex_obs/file1.jpg (No such file or directory)
22-Feb-2019 18:36:48         at java.io.RandomAccessFile.open0(Native Method)
22-Feb-2019 18:36:48         at java.io.RandomAccessFile.open(RandomAccessFile.java:316)
22-Feb-2019 18:36:48         at java.io.RandomAccessFile.<init>(RandomAccessFile.java:243)
22-Feb-2019 18:36:48         at javax.imageio.stream.FileImageInputStream.<init>(FileImageInputStream.java:73)
22-Feb-2019 18:36:48         at org.openmrs.obs.handler.ImageHandler.getObs(ImageHandler.java:86)
22-Feb-2019 18:36:48         at org.openmrs.api.impl.ObsServiceImpl.getObs(ObsServiceImpl.java:254)
22-Feb-2019 18:36:48         at sun.reflect.GeneratedMethodAccessor774.invoke(Unknown Source)
22-Feb-2019 18:36:48         at sun.reflect.DelegatingMethodAccessorImpl.invoke(DelegatingMethodAccessorImpl.java:43)
22-Feb-2019 18:36:48         at java.lang.reflect.Method.invoke(Method.java:498)
22-Feb-2019 18:36:48         at org.springframework.aop.support.AopUtils.invokeJoinpointUsingReflection(AopUtils.java:317)
22-Feb-2019 18:36:48         at org.springframework.aop.framework.ReflectiveMethodInvocation.invokeJoinpoint(ReflectiveMethodInvocation.java:190)
22-Feb-2019 18:36:48         at org.springframework.aop.framework.ReflectiveMethodInvocation.proceed(ReflectiveMethodInvocation.java:157)
22-Feb-2019 18:36:48         at org.springframework.transaction.interceptor.TransactionInterceptor$1.proceedWithInvocation(TransactionInterceptor.java:99)
22-Feb-2019 18:36:48         at org.springframework.transaction.interceptor.TransactionAspectSupport.invokeWithinTransaction(TransactionAspectSupport.java:281)
22-Feb-2019 18:36:48         at org.springframework.transaction.interceptor.TransactionInterceptor.invoke(TransactionInterceptor.java:96)
22-Feb-2019 18:36:48         at org.springframework.aop.framework.ReflectiveMethodInvocation.proceed(ReflectiveMethodInvocation.java:179)
22-Feb-2019 18:36:48         at org.springframework.aop.framework.JdkDynamicAopProxy.invoke(JdkDynamicAopProxy.java:207)
22-Feb-2019 18:36:48         at com.sun.proxy.$Proxy73.getObs(Unknown Source)
22-Feb-2019 18:36:48         at sun.reflect.GeneratedMethodAccessor774.invoke(Unknown Source)
22-Feb-2019 18:36:48         at sun.reflect.DelegatingMethodAccessorImpl.invoke(DelegatingMethodAccessorImpl.java:43)
22-Feb-2019 18:36:48         at java.lang.reflect.Method.invoke(Method.java:498)
22-Feb-2019 18:36:48         at org.springframework.aop.support.AopUtils.invokeJoinpointUsingReflection(AopUtils.java:317)
22-Feb-2019 18:36:48         at org.springframework.aop.framework.ReflectiveMethodInvocation.invokeJoinpoint(ReflectiveMethodInvocation.java:190)
22-Feb-2019 18:36:48         at org.springframework.aop.framework.ReflectiveMethodInvocation.proceed(ReflectiveMethodInvocation.java:157)
22-Feb-2019 18:36:48         at org.openmrs.aop.LoggingAdvice.invoke(LoggingAdvice.java:121)
22-Feb-2019 18:36:48         at org.springframework.aop.framework.ReflectiveMethodInvocation.proceed(ReflectiveMethodInvocation.java:179)
22-Feb-2019 18:36:48         at org.springframework.aop.framework.adapter.MethodBeforeAdviceInterceptor.invoke(MethodBeforeAdviceInterceptor.java:52)
22-Feb-2019 18:36:48         at org.springframework.aop.framework.ReflectiveMethodInvocation.proceed(ReflectiveMethodInvocation.java:179)
22-Feb-2019 18:36:48         at org.springframework.aop.framework.adapter.MethodBeforeAdviceInterceptor.invoke(MethodBeforeAdviceInterceptor.java:52)
22-Feb-2019 18:36:48         at org.springframework.aop.framework.ReflectiveMethodInvocation.proceed(ReflectiveMethodInvocation.java:179)
22-Feb-2019 18:36:48         at org.springframework.aop.framework.JdkDynamicAopProxy.invoke(JdkDynamicAopProxy.java:207)
22-Feb-2019 18:36:48         at com.sun.proxy.$Proxy74.getObs(Unknown Source)
22-Feb-2019 18:36:48         at org.openmrs.api.impl.EncounterServiceImpl.saveEncounter(EncounterServiceImpl.java:214)
22-Feb-2019 18:36:48         at sun.reflect.GeneratedMethodAccessor1144.invoke(Unknown Source)
22-Feb-2019 18:36:48         at sun.reflect.DelegatingMethodAccessorImpl.invoke(DelegatingMethodAccessorImpl.java:43)
22-Feb-2019 18:36:48         at java.lang.reflect.Method.invoke(Method.java:498)
22-Feb-2019 18:36:48         at org.springframework.aop.support.AopUtils.invokeJoinpointUsingReflection(AopUtils.java:317)
22-Feb-2019 18:36:48         at org.springframework.aop.framework.ReflectiveMethodInvocation.invokeJoinpoint(ReflectiveMethodInvocation.java:190)
22-Feb-2019 18:36:48         at org.springframework.aop.framework.ReflectiveMethodInvocation.proceed(ReflectiveMethodInvocation.java:157)
22-Feb-2019 18:36:48         at org.springframework.transaction.interceptor.TransactionInterceptor$1.proceedWithInvocation(TransactionInterceptor.java:99)
22-Feb-2019 18:36:48         at org.springframework.transaction.interceptor.TransactionAspectSupport.invokeWithinTransaction(TransactionAspectSupport.java:281)
22-Feb-2019 18:36:48         at org.springframework.transaction.interceptor.TransactionInterceptor.invoke(TransactionInterceptor.java:96)
22-Feb-2019 18:36:48         at org.springframework.aop.framework.ReflectiveMethodInvocation.proceed(ReflectiveMethodInvocation.java:179)
22-Feb-2019 18:36:48         at org.springframework.aop.framework.JdkDynamicAopProxy.invoke(JdkDynamicAopProxy.java:207)
22-Feb-2019 18:36:48         at com.sun.proxy.$Proxy75.saveEncounter(Unknown Source)
22-Feb-2019 18:36:48         at sun.reflect.GeneratedMethodAccessor1144.invoke(Unknown Source)
22-Feb-2019 18:36:48         at sun.reflect.DelegatingMethodAccessorImpl.invoke(DelegatingMethodAccessorImpl.java:43)
22-Feb-2019 18:36:48         at java.lang.reflect.Method.invoke(Method.java:498)
22-Feb-2019 18:36:48         at org.springframework.aop.support.AopUtils.invokeJoinpointUsingReflection(AopUtils.java:317)
22-Feb-2019 18:36:48         at org.springframework.aop.framework.ReflectiveMethodInvocation.invokeJoinpoint(ReflectiveMethodInvocation.java:190)
22-Feb-2019 18:36:48         at org.springframework.aop.framework.ReflectiveMethodInvocation.proceed(ReflectiveMethodInvocation.java:157)
22-Feb-2019 18:36:48         at org.openmrs.aop.LoggingAdvice.invoke(LoggingAdvice.java:121)
22-Feb-2019 18:36:48         at org.springframework.aop.framework.ReflectiveMethodInvocation.proceed(ReflectiveMethodInvocation.java:179)
22-Feb-2019 18:36:48         at org.springframework.aop.framework.adapter.MethodBeforeAdviceInterceptor.invoke(MethodBeforeAdviceInterceptor.java:52)
22-Feb-2019 18:36:48         at org.springframework.aop.framework.ReflectiveMethodInvocation.proceed(ReflectiveMethodInvocation.java:179)
22-Feb-2019 18:36:48         at org.springframework.aop.framework.adapter.MethodBeforeAdviceInterceptor.invoke(MethodBeforeAdviceInterceptor.java:52)
22-Feb-2019 18:36:48         at org.springframework.aop.framework.ReflectiveMethodInvocation.proceed(ReflectiveMethodInvocation.java:179)
22-Feb-2019 18:36:48         at org.springframework.aop.framework.JdkDynamicAopProxy.invoke(JdkDynamicAopProxy.java:207)
22-Feb-2019 18:36:48         at com.sun.proxy.$Proxy76.saveEncounter(Unknown Source)
22-Feb-2019 18:36:48         at org.openmrs.api.EncounterServiceTest.saveEncounter_shouldSaveEncounterWithComplexObs(EncounterServiceTest.java:385)
22-Feb-2019 18:36:48         at sun.reflect.NativeMethodAccessorImpl.invoke0(Native Method)
22-Feb-2019 18:36:48         at sun.reflect.NativeMethodAccessorImpl.invoke(NativeMethodAccessorImpl.java:62)
22-Feb-2019 18:36:48         at sun.reflect.DelegatingMethodAccessorImpl.invoke(DelegatingMethodAccessorImpl.java:43)
22-Feb-2019 18:36:48         at java.lang.reflect.Method.invoke(Method.java:498)
22-Feb-2019 18:36:48         at org.junit.runners.model.FrameworkMethod$1.runReflectiveCall(FrameworkMethod.java:47)
22-Feb-2019 18:36:48         at org.junit.internal.runners.model.ReflectiveCallable.run(ReflectiveCallable.java:12)
22-Feb-2019 18:36:48         at org.junit.runners.model.FrameworkMethod.invokeExplosively(FrameworkMethod.java:44)
22-Feb-2019 18:36:48         at org.junit.internal.runners.statements.InvokeMethod.evaluate(InvokeMethod.java:17)
22-Feb-2019 18:36:48         at org.junit.internal.runners.statements.RunBefores.evaluate(RunBefores.java:26)
22-Feb-2019 18:36:48         at org.springframework.test.context.junit4.statements.RunBeforeTestMethodCallbacks.evaluate(RunBeforeTestMethodCallbacks.java:73)
22-Feb-2019 18:36:48         at org.junit.internal.runners.statements.RunAfters.evaluate(RunAfters.java:27)
22-Feb-2019 18:36:48         at org.springframework.test.context.junit4.statements.RunAfterTestMethodCallbacks.evaluate(RunAfterTestMethodCallbacks.java:82)
22-Feb-2019 18:36:48         at org.springframework.test.context.junit4.statements.SpringRepeat.evaluate(SpringRepeat.java:73)
22-Feb-2019 18:36:48         at org.junit.runners.ParentRunner.runLeaf(ParentRunner.java:271)
22-Feb-2019 18:36:48         at org.springframework.test.context.junit4.SpringJUnit4ClassRunner.runChild(SpringJUnit4ClassRunner.java:217)
22-Feb-2019 18:36:48         at org.springframework.test.context.junit4.SpringJUnit4ClassRunner.runChild(SpringJUnit4ClassRunner.java:83)
22-Feb-2019 18:36:48         at org.junit.runners.ParentRunner$3.run(ParentRunner.java:238)
22-Feb-2019 18:36:48         at org.junit.runners.ParentRunner$1.schedule(ParentRunner.java:63)
22-Feb-2019 18:36:48         at org.junit.runners.ParentRunner.runChildren(ParentRunner.java:236)
22-Feb-2019 18:36:48         at org.junit.runners.ParentRunner.access$000(ParentRunner.java:53)
22-Feb-2019 18:36:48         at org.junit.runners.ParentRunner$2.evaluate(ParentRunner.java:229)
22-Feb-2019 18:36:48         at org.springframework.test.context.junit4.statements.RunBeforeTestClassCallbacks.evaluate(RunBeforeTestClassCallbacks.java:61)
22-Feb-2019 18:36:48         at org.junit.internal.runners.statements.RunAfters.evaluate(RunAfters.java:27)
22-Feb-2019 18:36:48         at org.springframework.test.context.junit4.statements.RunAfterTestClassCallbacks.evaluate(RunAfterTestClassCallbacks.java:68)
22-Feb-2019 18:36:48         at org.junit.runners.ParentRunner.run(ParentRunner.java:309)
22-Feb-2019 18:36:48         at org.springframework.test.context.junit4.SpringJUnit4ClassRunner.run(SpringJUnit4ClassRunner.java:163)
22-Feb-2019 18:36:48         at org.apache.maven.surefire.junit4.JUnit4Provider.execute(JUnit4Provider.java:283)
22-Feb-2019 18:36:48         at org.apache.maven.surefire.junit4.JUnit4Provider.executeWithRerun(JUnit4Provider.java:173)
22-Feb-2019 18:36:48         at org.apache.maven.surefire.junit4.JUnit4Provider.executeTestSet(JUnit4Provider.java:153)
22-Feb-2019 18:36:48         at org.apache.maven.surefire.junit4.JUnit4Provider.invoke(JUnit4Provider.java:128)
22-Feb-2019 18:36:48         at org.apache.maven.surefire.booter.ForkedBooter.invokeProviderInSameClassLoader(ForkedBooter.java:203)
22-Feb-2019 18:36:48         at org.apache.maven.surefire.booter.ForkedBooter.runSuitesInProcess(ForkedBooter.java:155)
22-Feb-2019 18:36:48         at org.apache.maven.surefire.booter.ForkedBooter.main(ForkedBooter.java:103)
22-Feb-2019 18:36:53 Tests run: 141, Failures: 0, Errors: 0, Skipped: 2, Time elapsed: 5.701 sec - in org.openmrs.api.EncounterServiceTest
22-Feb-2019 18:36:53 Running org.openmrs.api.NoteServiceTest
22-Feb-2019 18:36:53 Tests run: 1, Failures: 0, Errors: 0, Skipped: 1, Time elapsed: 0 sec - in org.openmrs.api.NoteServiceTest
22-Feb-2019 18:36:53 Running org.openmrs.api.impl.SerializationServiceImplTest
22-Feb-2019 18:36:53 Tests run: 1, Failures: 0, Errors: 0, Skipped: 0, Time elapsed: 0 sec - in org.openmrs.api.impl.SerializationServiceImplTest
22-Feb-2019 18:36:53 Running org.openmrs.api.impl.ConceptServiceImplTest
22-Feb-2019 18:36:53 Tests run: 8, Failures: 0, Errors: 0, Skipped: 0, Time elapsed: 0.302 sec - in org.openmrs.api.impl.ConceptServiceImplTest
22-Feb-2019 18:36:53 Running org.openmrs.api.ProgramWorkflowServiceTest
22-Feb-2019 18:36:54 Tests run: 25, Failures: 0, Errors: 0, Skipped: 0, Time elapsed: 0.772 sec - in org.openmrs.api.ProgramWorkflowServiceTest
22-Feb-2019 18:36:54 Running org.openmrs.api.CohortServiceTest
22-Feb-2019 18:36:54 Tests run: 24, Failures: 0, Errors: 0, Skipped: 0, Time elapsed: 0.612 sec - in org.openmrs.api.CohortServiceTest
22-Feb-2019 18:36:54 Running org.openmrs.api.db.VisitDAOTest
22-Feb-2019 18:36:55 Tests run: 3, Failures: 0, Errors: 0, Skipped: 0, Time elapsed: 0.462 sec - in org.openmrs.api.db.VisitDAOTest
22-Feb-2019 18:36:55 Running org.openmrs.api.db.hibernate.ImmutableEntityInterceptorTest
22-Feb-2019 18:36:55 Tests run: 4, Failures: 0, Errors: 0, Skipped: 0, Time elapsed: 0.384 sec - in org.openmrs.api.db.hibernate.ImmutableEntityInterceptorTest
22-Feb-2019 18:36:55 Running org.openmrs.api.db.hibernate.HibernatePersonDAOTest
22-Feb-2019 18:36:56 Tests run: 41, Failures: 0, Errors: 0, Skipped: 0, Time elapsed: 0.979 sec - in org.openmrs.api.db.hibernate.HibernatePersonDAOTest
22-Feb-2019 18:36:56 Running org.openmrs.api.db.hibernate.DropMillisecondsHibernateInterceptorTest
22-Feb-2019 18:36:56 Tests run: 3, Failures: 0, Errors: 0, Skipped: 0, Time elapsed: 0.304 sec - in org.openmrs.api.db.hibernate.DropMillisecondsHibernateInterceptorTest
22-Feb-2019 18:36:56 Running org.openmrs.api.db.hibernate.ProviderDAOTest
22-Feb-2019 18:36:57 Tests run: 3, Failures: 0, Errors: 0, Skipped: 0, Time elapsed: 0.348 sec - in org.openmrs.api.db.hibernate.ProviderDAOTest
22-Feb-2019 18:36:57 Running org.openmrs.api.db.hibernate.HibernateConceptDAOTest
22-Feb-2019 18:36:58 Tests run: 11, Failures: 0, Errors: 0, Skipped: 0, Time elapsed: 1.556 sec - in org.openmrs.api.db.hibernate.HibernateConceptDAOTest
22-Feb-2019 18:36:58 Running org.openmrs.api.db.hibernate.HibernateLocationDAOTest
22-Feb-2019 18:36:59 Tests run: 3, Failures: 0, Errors: 0, Skipped: 0, Time elapsed: 0.311 sec - in org.openmrs.api.db.hibernate.HibernateLocationDAOTest
22-Feb-2019 18:36:59 Running org.openmrs.api.db.hibernate.HibernateProviderDAOTest
22-Feb-2019 18:36:59 Tests run: 3, Failures: 0, Errors: 0, Skipped: 0, Time elapsed: 0.276 sec - in org.openmrs.api.db.hibernate.HibernateProviderDAOTest
22-Feb-2019 18:36:59 Running org.openmrs.api.db.hibernate.PersonAttributeHelperTest
22-Feb-2019 18:36:59 Tests run: 5, Failures: 0, Errors: 0, Skipped: 0, Time elapsed: 0.398 sec - in org.openmrs.api.db.hibernate.PersonAttributeHelperTest
22-Feb-2019 18:36:59 Running org.openmrs.api.db.hibernate.HibernateOrderDAOTest
22-Feb-2019 18:37:00 Tests run: 1, Failures: 0, Errors: 0, Skipped: 0, Time elapsed: 0.266 sec - in org.openmrs.api.db.hibernate.HibernateOrderDAOTest
22-Feb-2019 18:37:00 Running org.openmrs.api.db.hibernate.PatientSearchCriteriaTest
22-Feb-2019 18:37:00 Tests run: 18, Failures: 0, Errors: 0, Skipped: 0, Time elapsed: 0.389 sec - in org.openmrs.api.db.hibernate.PatientSearchCriteriaTest
22-Feb-2019 18:37:00 Running org.openmrs.api.db.hibernate.HibernateObsDAOTest
22-Feb-2019 18:37:00 Tests run: 1, Failures: 0, Errors: 0, Skipped: 0, Time elapsed: 0.22 sec - in org.openmrs.api.db.hibernate.HibernateObsDAOTest
22-Feb-2019 18:37:00 Running org.openmrs.api.db.hibernate.AuditableInterceptorTest
22-Feb-2019 18:37:01 Tests run: 15, Failures: 0, Errors: 0, Skipped: 0, Time elapsed: 0.384 sec - in org.openmrs.api.db.hibernate.AuditableInterceptorTest
22-Feb-2019 18:37:01 Running org.openmrs.api.db.EncounterDAOTest
22-Feb-2019 18:37:01 Tests run: 4, Failures: 0, Errors: 0, Skipped: 0, Time elapsed: 0.33 sec - in org.openmrs.api.db.EncounterDAOTest
22-Feb-2019 18:37:01 Running org.openmrs.api.db.PatientDAOTest
22-Feb-2019 18:37:03 WARN - HibernatePatientDAO.getDuplicatePatientsSQLString(556) |2019-02-22 18:37:03,442| Unidentified attribute: abcDef
22-Feb-2019 18:37:06 WARN - HibernatePatientDAO.getDuplicatePatientsSQLString(556) |2019-02-22 18:37:06,919| Unidentified attribute: abcDef
22-Feb-2019 18:37:07 Tests run: 141, Failures: 0, Errors: 0, Skipped: 0, Time elapsed: 5.722 sec - in org.openmrs.api.db.PatientDAOTest
22-Feb-2019 18:37:07 Running org.openmrs.api.db.SerializedObjectDAOTest
22-Feb-2019 18:37:07 Tests run: 1, Failures: 0, Errors: 0, Skipped: 1, Time elapsed: 0.001 sec - in org.openmrs.api.db.SerializedObjectDAOTest
22-Feb-2019 18:37:07 Running org.openmrs.api.db.ProgramWorkflowDAOTest
22-Feb-2019 18:37:07 Tests run: 4, Failures: 0, Errors: 0, Skipped: 0, Time elapsed: 0.267 sec - in org.openmrs.api.db.ProgramWorkflowDAOTest
22-Feb-2019 18:37:07 Running org.openmrs.api.db.ConceptDAOTest
22-Feb-2019 18:37:07 Tests run: 13, Failures: 0, Errors: 0, Skipped: 2, Time elapsed: 0.35 sec - in org.openmrs.api.db.ConceptDAOTest
22-Feb-2019 18:37:07 Running org.openmrs.api.db.ContextDAOTest
22-Feb-2019 18:37:07 ERROR - HibernateContextDAO.authenticate(184) |2019-02-22 18:37:07,884| Unable to convert the global property security.allowedFailedLoginsBeforeLockoutto a valid integer. Using default value of 7
22-Feb-2019 18:37:07 ERROR - HibernateContextDAO.authenticate(184) |2019-02-22 18:37:07,911| Unable to convert the global property security.allowedFailedLoginsBeforeLockoutto a valid integer. Using default value of 7
22-Feb-2019 18:37:07 ERROR - HibernateContextDAO.authenticate(184) |2019-02-22 18:37:07,913| Unable to convert the global property security.allowedFailedLoginsBeforeLockoutto a valid integer. Using default value of 7
22-Feb-2019 18:37:07 ERROR - HibernateContextDAO.authenticate(184) |2019-02-22 18:37:07,914| Unable to convert the global property security.allowedFailedLoginsBeforeLockoutto a valid integer. Using default value of 7
22-Feb-2019 18:37:07 ERROR - HibernateContextDAO.authenticate(184) |2019-02-22 18:37:07,917| Unable to convert the global property security.allowedFailedLoginsBeforeLockoutto a valid integer. Using default value of 7
22-Feb-2019 18:37:07 ERROR - HibernateContextDAO.authenticate(184) |2019-02-22 18:37:07,919| Unable to convert the global property security.allowedFailedLoginsBeforeLockoutto a valid integer. Using default value of 7
22-Feb-2019 18:37:07 ERROR - HibernateContextDAO.authenticate(184) |2019-02-22 18:37:07,920| Unable to convert the global property security.allowedFailedLoginsBeforeLockoutto a valid integer. Using default value of 7
22-Feb-2019 18:37:07 ERROR - HibernateContextDAO.authenticate(184) |2019-02-22 18:37:07,921| Unable to convert the global property security.allowedFailedLoginsBeforeLockoutto a valid integer. Using default value of 7
22-Feb-2019 18:37:07 ERROR - HibernateContextDAO.authenticate(184) |2019-02-22 18:37:07,923| Unable to convert the global property security.allowedFailedLoginsBeforeLockoutto a valid integer. Using default value of 7
22-Feb-2019 18:37:07 ERROR - HibernateContextDAO.authenticate(184) |2019-02-22 18:37:07,924| Unable to convert the global property security.allowedFailedLoginsBeforeLockoutto a valid integer. Using default value of 7
22-Feb-2019 18:37:07 ERROR - HibernateContextDAO.authenticate(184) |2019-02-22 18:37:07,946| Unable to convert the global property security.allowedFailedLoginsBeforeLockoutto a valid integer. Using default value of 7
22-Feb-2019 18:37:07 ERROR - HibernateContextDAO.authenticate(184) |2019-02-22 18:37:07,958| Unable to convert the global property security.allowedFailedLoginsBeforeLockoutto a valid integer. Using default value of 7
22-Feb-2019 18:37:08 ERROR - HibernateContextDAO.authenticate(184) |2019-02-22 18:37:07,999| Unable to convert the global property security.allowedFailedLoginsBeforeLockoutto a valid integer. Using default value of 7
22-Feb-2019 18:37:08 ERROR - HibernateContextDAO.authenticate(184) |2019-02-22 18:37:08,002| Unable to convert the global property security.allowedFailedLoginsBeforeLockoutto a valid integer. Using default value of 7
22-Feb-2019 18:37:08 ERROR - HibernateContextDAO.authenticate(184) |2019-02-22 18:37:08,003| Unable to convert the global property security.allowedFailedLoginsBeforeLockoutto a valid integer. Using default value of 7
22-Feb-2019 18:37:08 ERROR - HibernateContextDAO.authenticate(184) |2019-02-22 18:37:08,004| Unable to convert the global property security.allowedFailedLoginsBeforeLockoutto a valid integer. Using default value of 7
22-Feb-2019 18:37:08 ERROR - HibernateContextDAO.authenticate(184) |2019-02-22 18:37:08,005| Unable to convert the global property security.allowedFailedLoginsBeforeLockoutto a valid integer. Using default value of 7
22-Feb-2019 18:37:08 ERROR - HibernateContextDAO.authenticate(184) |2019-02-22 18:37:08,007| Unable to convert the global property security.allowedFailedLoginsBeforeLockoutto a valid integer. Using default value of 7
22-Feb-2019 18:37:08 ERROR - HibernateContextDAO.authenticate(184) |2019-02-22 18:37:08,008| Unable to convert the global property security.allowedFailedLoginsBeforeLockoutto a valid integer. Using default value of 7
22-Feb-2019 18:37:08 ERROR - HibernateContextDAO.authenticate(184) |2019-02-22 18:37:08,017| Unable to convert the global property security.allowedFailedLoginsBeforeLockoutto a valid integer. Using default value of 7
22-Feb-2019 18:37:08 ERROR - HibernateContextDAO.authenticate(184) |2019-02-22 18:37:08,026| Unable to convert the global property security.allowedFailedLoginsBeforeLockoutto a valid integer. Using default value of 7
22-Feb-2019 18:37:08 Tests run: 21, Failures: 0, Errors: 0, Skipped: 0, Time elapsed: 0.453 sec - in org.openmrs.api.db.ContextDAOTest
22-Feb-2019 18:37:08 Running org.openmrs.api.db.PersonDAOTest
22-Feb-2019 18:37:08 Tests run: 3, Failures: 0, Errors: 0, Skipped: 0, Time elapsed: 0.291 sec - in org.openmrs.api.db.PersonDAOTest
22-Feb-2019 18:37:08 Running org.openmrs.api.db.UserDAOTest
22-Feb-2019 18:37:08 Tests run: 8, Failures: 0, Errors: 0, Skipped: 0, Time elapsed: 0.349 sec - in org.openmrs.api.db.UserDAOTest
22-Feb-2019 18:37:08 Running org.openmrs.api.OrderServiceTest
22-Feb-2019 18:37:11 Tests run: 169, Failures: 0, Errors: 0, Skipped: 3, Time elapsed: 2.529 sec - in org.openmrs.api.OrderServiceTest
22-Feb-2019 18:37:11 Running org.openmrs.api.PatientServiceTest
22-Feb-2019 18:37:18 Tests run: 163, Failures: 0, Errors: 0, Skipped: 2, Time elapsed: 6.733 sec - in org.openmrs.api.PatientServiceTest
22-Feb-2019 18:37:18 Running org.openmrs.api.OpenmrsServiceTest
22-Feb-2019 18:37:18 Tests run: 1, Failures: 0, Errors: 0, Skipped: 1, Time elapsed: 0 sec - in org.openmrs.api.OpenmrsServiceTest
22-Feb-2019 18:37:18 Running org.openmrs.api.handler.RequiredReasonVoidSaveHandlerTest
22-Feb-2019 18:37:18 Tests run: 5, Failures: 0, Errors: 0, Skipped: 0, Time elapsed: 0.309 sec - in org.openmrs.api.handler.RequiredReasonVoidSaveHandlerTest
22-Feb-2019 18:37:18 Running org.openmrs.api.handler.PersonVoidHandlerTest
22-Feb-2019 18:37:19 Tests run: 8, Failures: 0, Errors: 0, Skipped: 0, Time elapsed: 0.645 sec - in org.openmrs.api.handler.PersonVoidHandlerTest
22-Feb-2019 18:37:19 Running org.openmrs.api.handler.OpenmrsMetadataSaveHandlerTest
22-Feb-2019 18:37:19 Tests run: 2, Failures: 0, Errors: 0, Skipped: 0, Time elapsed: 0 sec - in org.openmrs.api.handler.OpenmrsMetadataSaveHandlerTest
22-Feb-2019 18:37:19 Running org.openmrs.api.handler.BaseUnretireHandlerTest
22-Feb-2019 18:37:19 Tests run: 6, Failures: 0, Errors: 0, Skipped: 0, Time elapsed: 0 sec - in org.openmrs.api.handler.BaseUnretireHandlerTest
22-Feb-2019 18:37:19 Running org.openmrs.api.handler.ExistingVisitAssignmentHandlerTest
22-Feb-2019 18:37:19 Tests run: 3, Failures: 0, Errors: 0, Skipped: 0, Time elapsed: 0.335 sec - in org.openmrs.api.handler.ExistingVisitAssignmentHandlerTest
22-Feb-2019 18:37:19 Running org.openmrs.api.handler.RequireVoidReasonVoidHandlerTest
22-Feb-2019 18:37:19 Tests run: 5, Failures: 0, Errors: 0, Skipped: 0, Time elapsed: 0.435 sec - in org.openmrs.api.handler.RequireVoidReasonVoidHandlerTest
22-Feb-2019 18:37:19 Running org.openmrs.api.handler.OpenmrsObjectSaveHandlerTest
22-Feb-2019 18:37:19 Tests run: 5, Failures: 0, Errors: 0, Skipped: 0, Time elapsed: 0.004 sec - in org.openmrs.api.handler.OpenmrsObjectSaveHandlerTest
22-Feb-2019 18:37:19 Running org.openmrs.api.handler.ConceptNameSaveHandlerTest
22-Feb-2019 18:37:20 Tests run: 4, Failures: 0, Errors: 0, Skipped: 0, Time elapsed: 0.282 sec - in org.openmrs.api.handler.ConceptNameSaveHandlerTest
22-Feb-2019 18:37:20 Running org.openmrs.api.handler.PatientDataVoidHandlerTest
22-Feb-2019 18:37:20 Tests run: 1, Failures: 0, Errors: 0, Skipped: 0, Time elapsed: 0.478 sec - in org.openmrs.api.handler.PatientDataVoidHandlerTest
22-Feb-2019 18:37:20 Running org.openmrs.api.handler.BaseVoidHandlerTest
22-Feb-2019 18:37:20 Tests run: 8, Failures: 0, Errors: 0, Skipped: 0, Time elapsed: 0 sec - in org.openmrs.api.handler.BaseVoidHandlerTest
22-Feb-2019 18:37:20 Running org.openmrs.api.handler.BaseRetireHandlerTest
22-Feb-2019 18:37:20 Tests run: 8, Failures: 0, Errors: 0, Skipped: 0, Time elapsed: 0 sec - in org.openmrs.api.handler.BaseRetireHandlerTest
22-Feb-2019 18:37:20 Running org.openmrs.api.handler.ExistingOrNewVisitAssignmentHandlerTest
22-Feb-2019 18:37:20 Tests run: 5, Failures: 0, Errors: 0, Skipped: 0, Time elapsed: 0.423 sec - in org.openmrs.api.handler.ExistingOrNewVisitAssignmentHandlerTest
22-Feb-2019 18:37:20 Running org.openmrs.api.handler.PatientDataUnvoidHandlerTest
22-Feb-2019 18:37:23 Tests run: 2, Failures: 0, Errors: 0, Skipped: 0, Time elapsed: 2.261 sec - in org.openmrs.api.handler.PatientDataUnvoidHandlerTest
22-Feb-2019 18:37:23 Running org.openmrs.api.handler.BaseUnvoidHandlerTest
22-Feb-2019 18:37:23 Tests run: 6, Failures: 0, Errors: 0, Skipped: 0, Time elapsed: 0.004 sec - in org.openmrs.api.handler.BaseUnvoidHandlerTest
22-Feb-2019 18:37:23 Running org.openmrs.api.handler.PersonUnvoidHandlerTest
22-Feb-2019 18:37:23 Tests run: 6, Failures: 0, Errors: 0, Skipped: 0, Time elapsed: 0.001 sec - in org.openmrs.api.handler.PersonUnvoidHandlerTest
22-Feb-2019 18:37:23 Running org.openmrs.api.UserServiceTest
22-Feb-2019 18:37:26 Tests run: 85, Failures: 0, Errors: 0, Skipped: 1, Time elapsed: 2.912 sec - in org.openmrs.api.UserServiceTest
22-Feb-2019 18:37:26 Running org.openmrs.api.context.ContextTest
22-Feb-2019 18:37:26 Tests run: 16, Failures: 0, Errors: 0, Skipped: 0, Time elapsed: 0.38 sec - in org.openmrs.api.context.ContextTest
22-Feb-2019 18:37:26 Running org.openmrs.api.context.ContextWithModuleTest
22-Feb-2019 18:37:26 Tests run: 1, Failures: 0, Errors: 0, Skipped: 0, Time elapsed: 0.31 sec - in org.openmrs.api.context.ContextWithModuleTest
22-Feb-2019 18:37:26 Running org.openmrs.api.context.DaemonTest
22-Feb-2019 18:37:27 Tests run: 7, Failures: 0, Errors: 0, Skipped: 0, Time elapsed: 0.309 sec - in org.openmrs.api.context.DaemonTest
22-Feb-2019 18:37:27 Running org.openmrs.api.ObsServiceTest
22-Feb-2019 18:37:28 ERROR - ImageHandler.getObs(79) |2019-02-22 18:37:28,263| Trying to read file: /home/bamboo-agent/bamboo-agent/.agent_tmp/TRUNK-OC2-JOB1/appdir-for-unit-tests-5551687223445155696/complex_obs/openmrs_logo_small.gif
22-Feb-2019 18:37:28 javax.imageio.IIOException: Can't read input file!
22-Feb-2019 18:37:28         at javax.imageio.ImageIO.read(ImageIO.java:1301)
22-Feb-2019 18:37:28         at org.openmrs.obs.handler.ImageHandler.getObs(ImageHandler.java:76)
22-Feb-2019 18:37:28         at org.openmrs.api.impl.ObsServiceImpl.getComplexObs(ObsServiceImpl.java:480)
22-Feb-2019 18:37:28         at sun.reflect.NativeMethodAccessorImpl.invoke0(Native Method)
22-Feb-2019 18:37:28         at sun.reflect.NativeMethodAccessorImpl.invoke(NativeMethodAccessorImpl.java:62)
22-Feb-2019 18:37:28         at sun.reflect.DelegatingMethodAccessorImpl.invoke(DelegatingMethodAccessorImpl.java:43)
22-Feb-2019 18:37:28         at java.lang.reflect.Method.invoke(Method.java:498)
22-Feb-2019 18:37:28         at org.springframework.aop.support.AopUtils.invokeJoinpointUsingReflection(AopUtils.java:317)
22-Feb-2019 18:37:28         at org.springframework.aop.framework.ReflectiveMethodInvocation.invokeJoinpoint(ReflectiveMethodInvocation.java:190)
22-Feb-2019 18:37:28         at org.springframework.aop.framework.ReflectiveMethodInvocation.proceed(ReflectiveMethodInvocation.java:157)
22-Feb-2019 18:37:28         at org.springframework.transaction.interceptor.TransactionInterceptor$1.proceedWithInvocation(TransactionInterceptor.java:99)
22-Feb-2019 18:37:28         at org.springframework.transaction.interceptor.TransactionAspectSupport.invokeWithinTransaction(TransactionAspectSupport.java:281)
22-Feb-2019 18:37:28         at org.springframework.transaction.interceptor.TransactionInterceptor.invoke(TransactionInterceptor.java:96)
22-Feb-2019 18:37:28         at org.springframework.aop.framework.ReflectiveMethodInvocation.proceed(ReflectiveMethodInvocation.java:179)
22-Feb-2019 18:37:28         at org.springframework.aop.framework.JdkDynamicAopProxy.invoke(JdkDynamicAopProxy.java:207)
22-Feb-2019 18:37:28         at com.sun.proxy.$Proxy73.getComplexObs(Unknown Source)
22-Feb-2019 18:37:28         at sun.reflect.NativeMethodAccessorImpl.invoke0(Native Method)
22-Feb-2019 18:37:28         at sun.reflect.NativeMethodAccessorImpl.invoke(NativeMethodAccessorImpl.java:62)
22-Feb-2019 18:37:28         at sun.reflect.DelegatingMethodAccessorImpl.invoke(DelegatingMethodAccessorImpl.java:43)
22-Feb-2019 18:37:28         at java.lang.reflect.Method.invoke(Method.java:498)
22-Feb-2019 18:37:28         at org.springframework.aop.support.AopUtils.invokeJoinpointUsingReflection(AopUtils.java:317)
22-Feb-2019 18:37:28         at org.springframework.aop.framework.ReflectiveMethodInvocation.invokeJoinpoint(ReflectiveMethodInvocation.java:190)
22-Feb-2019 18:37:28         at org.springframework.aop.framework.ReflectiveMethodInvocation.proceed(ReflectiveMethodInvocation.java:157)
22-Feb-2019 18:37:28         at org.openmrs.aop.LoggingAdvice.invoke(LoggingAdvice.java:121)
22-Feb-2019 18:37:28         at org.springframework.aop.framework.ReflectiveMethodInvocation.proceed(ReflectiveMethodInvocation.java:179)
22-Feb-2019 18:37:28         at org.springframework.aop.framework.adapter.MethodBeforeAdviceInterceptor.invoke(MethodBeforeAdviceInterceptor.java:52)
22-Feb-2019 18:37:28         at org.springframework.aop.framework.ReflectiveMethodInvocation.proceed(ReflectiveMethodInvocation.java:179)
22-Feb-2019 18:37:28         at org.springframework.aop.framework.adapter.MethodBeforeAdviceInterceptor.invoke(MethodBeforeAdviceInterceptor.java:52)
22-Feb-2019 18:37:28         at org.springframework.aop.framework.ReflectiveMethodInvocation.proceed(ReflectiveMethodInvocation.java:179)
22-Feb-2019 18:37:28         at org.springframework.aop.framework.JdkDynamicAopProxy.invoke(JdkDynamicAopProxy.java:207)
22-Feb-2019 18:37:28         at com.sun.proxy.$Proxy74.getComplexObs(Unknown Source)
22-Feb-2019 18:37:28         at org.openmrs.api.ObsServiceTest.purgeObs_shouldDeleteTheGivenObsFromTheDatabase(ObsServiceTest.java:1353)
22-Feb-2019 18:37:28         at sun.reflect.NativeMethodAccessorImpl.invoke0(Native Method)
22-Feb-2019 18:37:28         at sun.reflect.NativeMethodAccessorImpl.invoke(NativeMethodAccessorImpl.java:62)
22-Feb-2019 18:37:28         at sun.reflect.DelegatingMethodAccessorImpl.invoke(DelegatingMethodAccessorImpl.java:43)
22-Feb-2019 18:37:28         at java.lang.reflect.Method.invoke(Method.java:498)
22-Feb-2019 18:37:28         at org.junit.runners.model.FrameworkMethod$1.runReflectiveCall(FrameworkMethod.java:47)
22-Feb-2019 18:37:28         at org.junit.internal.runners.model.ReflectiveCallable.run(ReflectiveCallable.java:12)
22-Feb-2019 18:37:28         at org.junit.runners.model.FrameworkMethod.invokeExplosively(FrameworkMethod.java:44)
22-Feb-2019 18:37:28         at org.junit.internal.runners.statements.InvokeMethod.evaluate(InvokeMethod.java:17)
22-Feb-2019 18:37:28         at org.junit.internal.runners.statements.RunBefores.evaluate(RunBefores.java:26)
22-Feb-2019 18:37:28         at org.springframework.test.context.junit4.statements.RunBeforeTestMethodCallbacks.evaluate(RunBeforeTestMethodCallbacks.java:73)
22-Feb-2019 18:37:28         at org.junit.internal.runners.statements.RunAfters.evaluate(RunAfters.java:27)
22-Feb-2019 18:37:28         at org.springframework.test.context.junit4.statements.RunAfterTestMethodCallbacks.evaluate(RunAfterTestMethodCallbacks.java:82)
22-Feb-2019 18:37:28         at org.junit.rules.ExpectedException$ExpectedExceptionStatement.evaluate(ExpectedException.java:168)
22-Feb-2019 18:37:28         at org.junit.rules.RunRules.evaluate(RunRules.java:20)
22-Feb-2019 18:37:28         at org.springframework.test.context.junit4.statements.SpringRepeat.evaluate(SpringRepeat.java:73)
22-Feb-2019 18:37:28         at org.junit.runners.ParentRunner.runLeaf(ParentRunner.java:271)
22-Feb-2019 18:37:28         at org.springframework.test.context.junit4.SpringJUnit4ClassRunner.runChild(SpringJUnit4ClassRunner.java:217)
22-Feb-2019 18:37:28         at org.springframework.test.context.junit4.SpringJUnit4ClassRunner.runChild(SpringJUnit4ClassRunner.java:83)
22-Feb-2019 18:37:28         at org.junit.runners.ParentRunner$3.run(ParentRunner.java:238)
22-Feb-2019 18:37:28         at org.junit.runners.ParentRunner$1.schedule(ParentRunner.java:63)
22-Feb-2019 18:37:28         at org.junit.runners.ParentRunner.runChildren(ParentRunner.java:236)
22-Feb-2019 18:37:28         at org.junit.runners.ParentRunner.access$000(ParentRunner.java:53)
22-Feb-2019 18:37:28         at org.junit.runners.ParentRunner$2.evaluate(ParentRunner.java:229)
22-Feb-2019 18:37:28         at org.springframework.test.context.junit4.statements.RunBeforeTestClassCallbacks.evaluate(RunBeforeTestClassCallbacks.java:61)
22-Feb-2019 18:37:28         at org.junit.internal.runners.statements.RunAfters.evaluate(RunAfters.java:27)
22-Feb-2019 18:37:28         at org.springframework.test.context.junit4.statements.RunAfterTestClassCallbacks.evaluate(RunAfterTestClassCallbacks.java:68)
22-Feb-2019 18:37:28         at org.junit.runners.ParentRunner.run(ParentRunner.java:309)
22-Feb-2019 18:37:28         at org.springframework.test.context.junit4.SpringJUnit4ClassRunner.run(SpringJUnit4ClassRunner.java:163)
22-Feb-2019 18:37:28         at org.apache.maven.surefire.junit4.JUnit4Provider.execute(JUnit4Provider.java:283)
22-Feb-2019 18:37:28         at org.apache.maven.surefire.junit4.JUnit4Provider.executeWithRerun(JUnit4Provider.java:173)
22-Feb-2019 18:37:28         at org.apache.maven.surefire.junit4.JUnit4Provider.executeTestSet(JUnit4Provider.java:153)
22-Feb-2019 18:37:28         at org.apache.maven.surefire.junit4.JUnit4Provider.invoke(JUnit4Provider.java:128)
22-Feb-2019 18:37:28         at org.apache.maven.surefire.booter.ForkedBooter.invokeProviderInSameClassLoader(ForkedBooter.java:203)
22-Feb-2019 18:37:28         at org.apache.maven.surefire.booter.ForkedBooter.runSuitesInProcess(ForkedBooter.java:155)
22-Feb-2019 18:37:28         at org.apache.maven.surefire.booter.ForkedBooter.main(ForkedBooter.java:103)
22-Feb-2019 18:37:28 ERROR - ImageHandler.getObs(96) |2019-02-22 18:37:28,268| Image /home/bamboo-agent/bamboo-agent/.agent_tmp/TRUNK-OC2-JOB1/appdir-for-unit-tests-5551687223445155696/complex_obs/openmrs_logo_small.gif was not found
22-Feb-2019 18:37:28 java.io.FileNotFoundException: /home/bamboo-agent/bamboo-agent/.agent_tmp/TRUNK-OC2-JOB1/appdir-for-unit-tests-5551687223445155696/complex_obs/openmrs_logo_small.gif (No such file or directory)
22-Feb-2019 18:37:28         at java.io.RandomAccessFile.open0(Native Method)
22-Feb-2019 18:37:28         at java.io.RandomAccessFile.open(RandomAccessFile.java:316)
22-Feb-2019 18:37:28         at java.io.RandomAccessFile.<init>(RandomAccessFile.java:243)
22-Feb-2019 18:37:28         at javax.imageio.stream.FileImageInputStream.<init>(FileImageInputStream.java:73)
22-Feb-2019 18:37:28         at org.openmrs.obs.handler.ImageHandler.getObs(ImageHandler.java:86)
22-Feb-2019 18:37:28         at org.openmrs.api.impl.ObsServiceImpl.getComplexObs(ObsServiceImpl.java:480)
22-Feb-2019 18:37:28         at sun.reflect.NativeMethodAccessorImpl.invoke0(Native Method)
22-Feb-2019 18:37:28         at sun.reflect.NativeMethodAccessorImpl.invoke(NativeMethodAccessorImpl.java:62)
22-Feb-2019 18:37:28         at sun.reflect.DelegatingMethodAccessorImpl.invoke(DelegatingMethodAccessorImpl.java:43)
22-Feb-2019 18:37:28         at java.lang.reflect.Method.invoke(Method.java:498)
22-Feb-2019 18:37:28         at org.springframework.aop.support.AopUtils.invokeJoinpointUsingReflection(AopUtils.java:317)
22-Feb-2019 18:37:28         at org.springframework.aop.framework.ReflectiveMethodInvocation.invokeJoinpoint(ReflectiveMethodInvocation.java:190)
22-Feb-2019 18:37:28         at org.springframework.aop.framework.ReflectiveMethodInvocation.proceed(ReflectiveMethodInvocation.java:157)
22-Feb-2019 18:37:28         at org.springframework.transaction.interceptor.TransactionInterceptor$1.proceedWithInvocation(TransactionInterceptor.java:99)
22-Feb-2019 18:37:28         at org.springframework.transaction.interceptor.TransactionAspectSupport.invokeWithinTransaction(TransactionAspectSupport.java:281)
22-Feb-2019 18:37:28         at org.springframework.transaction.interceptor.TransactionInterceptor.invoke(TransactionInterceptor.java:96)
22-Feb-2019 18:37:28         at org.springframework.aop.framework.ReflectiveMethodInvocation.proceed(ReflectiveMethodInvocation.java:179)
22-Feb-2019 18:37:28         at org.springframework.aop.framework.JdkDynamicAopProxy.invoke(JdkDynamicAopProxy.java:207)
22-Feb-2019 18:37:28         at com.sun.proxy.$Proxy73.getComplexObs(Unknown Source)
22-Feb-2019 18:37:28         at sun.reflect.NativeMethodAccessorImpl.invoke0(Native Method)
22-Feb-2019 18:37:28         at sun.reflect.NativeMethodAccessorImpl.invoke(NativeMethodAccessorImpl.java:62)
22-Feb-2019 18:37:28         at sun.reflect.DelegatingMethodAccessorImpl.invoke(DelegatingMethodAccessorImpl.java:43)
22-Feb-2019 18:37:28         at java.lang.reflect.Method.invoke(Method.java:498)
22-Feb-2019 18:37:28         at org.springframework.aop.support.AopUtils.invokeJoinpointUsingReflection(AopUtils.java:317)
22-Feb-2019 18:37:28         at org.springframework.aop.framework.ReflectiveMethodInvocation.invokeJoinpoint(ReflectiveMethodInvocation.java:190)
22-Feb-2019 18:37:28         at org.springframework.aop.framework.ReflectiveMethodInvocation.proceed(ReflectiveMethodInvocation.java:157)
22-Feb-2019 18:37:28         at org.openmrs.aop.LoggingAdvice.invoke(LoggingAdvice.java:121)
22-Feb-2019 18:37:28         at org.springframework.aop.framework.ReflectiveMethodInvocation.proceed(ReflectiveMethodInvocation.java:179)
22-Feb-2019 18:37:28         at org.springframework.aop.framework.adapter.MethodBeforeAdviceInterceptor.invoke(MethodBeforeAdviceInterceptor.java:52)
22-Feb-2019 18:37:28         at org.springframework.aop.framework.ReflectiveMethodInvocation.proceed(ReflectiveMethodInvocation.java:179)
22-Feb-2019 18:37:28         at org.springframework.aop.framework.adapter.MethodBeforeAdviceInterceptor.invoke(MethodBeforeAdviceInterceptor.java:52)
22-Feb-2019 18:37:28         at org.springframework.aop.framework.ReflectiveMethodInvocation.proceed(ReflectiveMethodInvocation.java:179)
22-Feb-2019 18:37:28         at org.springframework.aop.framework.JdkDynamicAopProxy.invoke(JdkDynamicAopProxy.java:207)
22-Feb-2019 18:37:28         at com.sun.proxy.$Proxy74.getComplexObs(Unknown Source)
22-Feb-2019 18:37:28         at org.openmrs.api.ObsServiceTest.purgeObs_shouldDeleteTheGivenObsFromTheDatabase(ObsServiceTest.java:1353)
22-Feb-2019 18:37:28         at sun.reflect.NativeMethodAccessorImpl.invoke0(Native Method)
22-Feb-2019 18:37:28         at sun.reflect.NativeMethodAccessorImpl.invoke(NativeMethodAccessorImpl.java:62)
22-Feb-2019 18:37:28         at sun.reflect.DelegatingMethodAccessorImpl.invoke(DelegatingMethodAccessorImpl.java:43)
22-Feb-2019 18:37:28         at java.lang.reflect.Method.invoke(Method.java:498)
22-Feb-2019 18:37:28         at org.junit.runners.model.FrameworkMethod$1.runReflectiveCall(FrameworkMethod.java:47)
22-Feb-2019 18:37:28         at org.junit.internal.runners.model.ReflectiveCallable.run(ReflectiveCallable.java:12)
22-Feb-2019 18:37:28         at org.junit.runners.model.FrameworkMethod.invokeExplosively(FrameworkMethod.java:44)
22-Feb-2019 18:37:28         at org.junit.internal.runners.statements.InvokeMethod.evaluate(InvokeMethod.java:17)
22-Feb-2019 18:37:28         at org.junit.internal.runners.statements.RunBefores.evaluate(RunBefores.java:26)
22-Feb-2019 18:37:28         at org.springframework.test.context.junit4.statements.RunBeforeTestMethodCallbacks.evaluate(RunBeforeTestMethodCallbacks.java:73)
22-Feb-2019 18:37:28         at org.junit.internal.runners.statements.RunAfters.evaluate(RunAfters.java:27)
22-Feb-2019 18:37:28         at org.springframework.test.context.junit4.statements.RunAfterTestMethodCallbacks.evaluate(RunAfterTestMethodCallbacks.java:82)
22-Feb-2019 18:37:28         at org.junit.rules.ExpectedException$ExpectedExceptionStatement.evaluate(ExpectedException.java:168)
22-Feb-2019 18:37:28         at org.junit.rules.RunRules.evaluate(RunRules.java:20)
22-Feb-2019 18:37:28         at org.springframework.test.context.junit4.statements.SpringRepeat.evaluate(SpringRepeat.java:73)
22-Feb-2019 18:37:28         at org.junit.runners.ParentRunner.runLeaf(ParentRunner.java:271)
22-Feb-2019 18:37:28         at org.springframework.test.context.junit4.SpringJUnit4ClassRunner.runChild(SpringJUnit4ClassRunner.java:217)
22-Feb-2019 18:37:28         at org.springframework.test.context.junit4.SpringJUnit4ClassRunner.runChild(SpringJUnit4ClassRunner.java:83)
22-Feb-2019 18:37:28         at org.junit.runners.ParentRunner$3.run(ParentRunner.java:238)
22-Feb-2019 18:37:28         at org.junit.runners.ParentRunner$1.schedule(ParentRunner.java:63)
22-Feb-2019 18:37:28         at org.junit.runners.ParentRunner.runChildren(ParentRunner.java:236)
22-Feb-2019 18:37:28         at org.junit.runners.ParentRunner.access$000(ParentRunner.java:53)
22-Feb-2019 18:37:28         at org.junit.runners.ParentRunner$2.evaluate(ParentRunner.java:229)
22-Feb-2019 18:37:28         at org.springframework.test.context.junit4.statements.RunBeforeTestClassCallbacks.evaluate(RunBeforeTestClassCallbacks.java:61)
22-Feb-2019 18:37:28         at org.junit.internal.runners.statements.RunAfters.evaluate(RunAfters.java:27)
22-Feb-2019 18:37:28         at org.springframework.test.context.junit4.statements.RunAfterTestClassCallbacks.evaluate(RunAfterTestClassCallbacks.java:68)
22-Feb-2019 18:37:28         at org.junit.runners.ParentRunner.run(ParentRunner.java:309)
22-Feb-2019 18:37:28         at org.springframework.test.context.junit4.SpringJUnit4ClassRunner.run(SpringJUnit4ClassRunner.java:163)
22-Feb-2019 18:37:28         at org.apache.maven.surefire.junit4.JUnit4Provider.execute(JUnit4Provider.java:283)
22-Feb-2019 18:37:28         at org.apache.maven.surefire.junit4.JUnit4Provider.executeWithRerun(JUnit4Provider.java:173)
22-Feb-2019 18:37:28         at org.apache.maven.surefire.junit4.JUnit4Provider.executeTestSet(JUnit4Provider.java:153)
22-Feb-2019 18:37:28         at org.apache.maven.surefire.junit4.JUnit4Provider.invoke(JUnit4Provider.java:128)
22-Feb-2019 18:37:28         at org.apache.maven.surefire.booter.ForkedBooter.invokeProviderInSameClassLoader(ForkedBooter.java:203)
22-Feb-2019 18:37:28         at org.apache.maven.surefire.booter.ForkedBooter.runSuitesInProcess(ForkedBooter.java:155)
22-Feb-2019 18:37:28         at org.apache.maven.surefire.booter.ForkedBooter.main(ForkedBooter.java:103)
22-Feb-2019 18:37:28 Tests run: 75, Failures: 0, Errors: 0, Skipped: 0, Time elapsed: 1.327 sec - in org.openmrs.api.ObsServiceTest
22-Feb-2019 18:37:28 Running org.openmrs.api.ConceptServiceTest
22-Feb-2019 18:38:05 Tests run: 236, Failures: 0, Errors: 0, Skipped: 1, Time elapsed: 37.189 sec - in org.openmrs.api.ConceptServiceTest
22-Feb-2019 18:38:05 Running org.openmrs.api.PatientServiceAllergyTest
22-Feb-2019 18:38:06 Tests run: 16, Failures: 0, Errors: 0, Skipped: 0, Time elapsed: 0.577 sec - in org.openmrs.api.PatientServiceAllergyTest
22-Feb-2019 18:38:06 Running org.openmrs.api.DatatypeServiceTest
22-Feb-2019 18:38:06 Tests run: 2, Failures: 0, Errors: 0, Skipped: 0, Time elapsed: 0.268 sec - in org.openmrs.api.DatatypeServiceTest
22-Feb-2019 18:38:06 Running org.openmrs.api.ProgramWorkflowServiceUnitTest
22-Feb-2019 18:38:06 Tests run: 3, Failures: 0, Errors: 0, Skipped: 0, Time elapsed: 0.012 sec - in org.openmrs.api.ProgramWorkflowServiceUnitTest
22-Feb-2019 18:38:06 Running org.openmrs.api.VisitServiceTest
22-Feb-2019 18:38:07 ERROR - AbstractBatchImpl.clearBatch(183) |2019-02-22 18:38:07,264| HHH000352: Unable to release batch statement...
22-Feb-2019 18:38:07 Tests run: 60, Failures: 0, Errors: 0, Skipped: 0, Time elapsed: 0.842 sec - in org.openmrs.api.VisitServiceTest
22-Feb-2019 18:38:07 Running org.openmrs.order.OrderUtilTest
22-Feb-2019 18:38:07 Tests run: 15, Failures: 0, Errors: 0, Skipped: 0, Time elapsed: 0.005 sec - in org.openmrs.order.OrderUtilTest
22-Feb-2019 18:38:07 Running org.openmrs.PatientProgramTest
22-Feb-2019 18:38:07 Tests run: 2, Failures: 0, Errors: 0, Skipped: 0, Time elapsed: 0.001 sec - in org.openmrs.PatientProgramTest
22-Feb-2019 18:38:07 Running org.openmrs.PatientStateTest
22-Feb-2019 18:38:07 Tests run: 13, Failures: 0, Errors: 0, Skipped: 0, Time elapsed: 0.002 sec - in org.openmrs.PatientStateTest
22-Feb-2019 18:38:07 Running org.openmrs.attribute.AttributeIntegrationTest
22-Feb-2019 18:38:07 Tests run: 1, Failures: 0, Errors: 0, Skipped: 0, Time elapsed: 0.324 sec - in org.openmrs.attribute.AttributeIntegrationTest
22-Feb-2019 18:38:07 Running org.openmrs.EncounterRoleTest
22-Feb-2019 18:38:07 Tests run: 1, Failures: 0, Errors: 0, Skipped: 0, Time elapsed: 0 sec - in org.openmrs.EncounterRoleTest
22-Feb-2019 18:38:07 Running org.openmrs.ProviderTest
22-Feb-2019 18:38:07 Tests run: 2, Failures: 0, Errors: 0, Skipped: 0, Time elapsed: 0 sec - in org.openmrs.ProviderTest
22-Feb-2019 18:38:07 Running org.openmrs.serialization.SimpleXStreamSerializerTest
22-Feb-2019 18:38:07 Tests run: 5, Failures: 0, Errors: 0, Skipped: 0, Time elapsed: 0.038 sec - in org.openmrs.serialization.SimpleXStreamSerializerTest
22-Feb-2019 18:38:07 Running org.openmrs.serialization.JavaSerializationTest
22-Feb-2019 18:38:07 Tests run: 2, Failures: 0, Errors: 0, Skipped: 0, Time elapsed: 0.039 sec - in org.openmrs.serialization.JavaSerializationTest
22-Feb-2019 18:38:07 Running org.openmrs.BaseCustomizableMetadataTest
22-Feb-2019 18:38:08 Tests run: 2, Failures: 0, Errors: 0, Skipped: 0, Time elapsed: 0.356 sec - in org.openmrs.BaseCustomizableMetadataTest
22-Feb-2019 18:38:08 Running org.openmrs.UserTest
22-Feb-2019 18:38:08 Tests run: 9, Failures: 0, Errors: 0, Skipped: 0, Time elapsed: 0.001 sec - in org.openmrs.UserTest
22-Feb-2019 18:38:08 Running org.openmrs.logic.result.EmptyResultTest
22-Feb-2019 18:38:08 Tests run: 2, Failures: 0, Errors: 0, Skipped: 0, Time elapsed: 0.002 sec - in org.openmrs.logic.result.EmptyResultTest
22-Feb-2019 18:38:08 Running org.openmrs.logic.result.ResultTest
22-Feb-2019 18:38:08 Tests run: 17, Failures: 0, Errors: 0, Skipped: 0, Time elapsed: 0.003 sec - in org.openmrs.logic.result.ResultTest
22-Feb-2019 18:38:08 Running org.openmrs.PatientTest
22-Feb-2019 18:38:08 Tests run: 8, Failures: 0, Errors: 0, Skipped: 0, Time elapsed: 0 sec - in org.openmrs.PatientTest
22-Feb-2019 18:38:08 Running org.openmrs.notification.db.hibernate.HibernateAlertDAOTest
22-Feb-2019 18:38:08 Tests run: 1, Failures: 0, Errors: 0, Skipped: 0, Time elapsed: 0.291 sec - in org.openmrs.notification.db.hibernate.HibernateAlertDAOTest
22-Feb-2019 18:38:08 Running org.openmrs.notification.AlertServiceTest
22-Feb-2019 18:38:08 Tests run: 3, Failures: 0, Errors: 0, Skipped: 0, Time elapsed: 0.321 sec - in org.openmrs.notification.AlertServiceTest
22-Feb-2019 18:38:08 Running org.openmrs.notification.MessageTest
22-Feb-2019 18:38:08 Tests run: 4, Failures: 0, Errors: 0, Skipped: 0, Time elapsed: 0.004 sec - in org.openmrs.notification.MessageTest
22-Feb-2019 18:38:08 Running org.openmrs.PersonNameTest
22-Feb-2019 18:38:08 Tests run: 19, Failures: 0, Errors: 0, Skipped: 0, Time elapsed: 0.001 sec - in org.openmrs.PersonNameTest
22-Feb-2019 18:38:08 Running org.openmrs.EncounterProviderTest
22-Feb-2019 18:38:08 Tests run: 1, Failures: 0, Errors: 0, Skipped: 0, Time elapsed: 0 sec - in org.openmrs.EncounterProviderTest
22-Feb-2019 18:38:08 Running org.openmrs.hl7.HL7UtilTest
22-Feb-2019 18:38:08 Tests run: 5, Failures: 0, Errors: 0, Skipped: 0, Time elapsed: 0.008 sec - in org.openmrs.hl7.HL7UtilTest
22-Feb-2019 18:38:08 Running org.openmrs.hl7.HL7ServiceTest
22-Feb-2019 18:38:09 ERROR - HL7ServiceImpl.setFatalError(742) |2019-02-22 18:38:09,398| ca.uhn.hl7v2.HL7Exception: HL7 encoding not supported
22-Feb-2019 18:38:09 Tests run: 26, Failures: 0, Errors: 0, Skipped: 2, Time elapsed: 0.924 sec - in org.openmrs.hl7.HL7ServiceTest
22-Feb-2019 18:38:09 Running org.openmrs.hl7.handler.ORUR01HandlerTest
22-Feb-2019 18:38:11 Tests run: 37, Failures: 0, Errors: 0, Skipped: 0, Time elapsed: 1.664 sec - in org.openmrs.hl7.handler.ORUR01HandlerTest
22-Feb-2019 18:38:11 Running org.openmrs.OpenmrsTestsTest
22-Feb-2019 18:38:11 Tests run: 4, Failures: 0, Errors: 0, Skipped: 0, Time elapsed: 0.081 sec - in org.openmrs.OpenmrsTestsTest
22-Feb-2019 18:38:11 Running org.openmrs.propertyeditor.UserEditorTest
22-Feb-2019 18:38:11 Tests run: 2, Failures: 0, Errors: 0, Skipped: 0, Time elapsed: 0.222 sec - in org.openmrs.propertyeditor.UserEditorTest
22-Feb-2019 18:38:11 Running org.openmrs.propertyeditor.PersonAttributeTypeEditorTest
22-Feb-2019 18:38:12 Tests run: 2, Failures: 0, Errors: 0, Skipped: 0, Time elapsed: 0.305 sec - in org.openmrs.propertyeditor.PersonAttributeTypeEditorTest
22-Feb-2019 18:38:12 Running org.openmrs.propertyeditor.ConceptNumericEditorTest
22-Feb-2019 18:38:12 Tests run: 2, Failures: 0, Errors: 0, Skipped: 0, Time elapsed: 0.281 sec - in org.openmrs.propertyeditor.ConceptNumericEditorTest
22-Feb-2019 18:38:12 Running org.openmrs.propertyeditor.ConceptSourceEditorTest
22-Feb-2019 18:38:12 Tests run: 2, Failures: 0, Errors: 0, Skipped: 0, Time elapsed: 0.208 sec - in org.openmrs.propertyeditor.ConceptSourceEditorTest
22-Feb-2019 18:38:12 Running org.openmrs.propertyeditor.ProgramWorkflowEditorTest
22-Feb-2019 18:38:12 Tests run: 1, Failures: 0, Errors: 0, Skipped: 0, Time elapsed: 0.24 sec - in org.openmrs.propertyeditor.ProgramWorkflowEditorTest
22-Feb-2019 18:38:12 Running org.openmrs.propertyeditor.CohortEditorTest
22-Feb-2019 18:38:13 Tests run: 2, Failures: 0, Errors: 0, Skipped: 0, Time elapsed: 0.244 sec - in org.openmrs.propertyeditor.CohortEditorTest
22-Feb-2019 18:38:13 Running org.openmrs.propertyeditor.ProviderEditorTest
22-Feb-2019 18:38:13 Tests run: 2, Failures: 0, Errors: 0, Skipped: 0, Time elapsed: 0.236 sec - in org.openmrs.propertyeditor.ProviderEditorTest
22-Feb-2019 18:38:13 Running org.openmrs.propertyeditor.EncounterTypeEditorTest
22-Feb-2019 18:38:13 Tests run: 2, Failures: 0, Errors: 0, Skipped: 0, Time elapsed: 0.332 sec - in org.openmrs.propertyeditor.EncounterTypeEditorTest
22-Feb-2019 18:38:13 Running org.openmrs.propertyeditor.ConceptNameEditorTest
22-Feb-2019 18:38:13 Tests run: 2, Failures: 0, Errors: 0, Skipped: 0, Time elapsed: 0.308 sec - in org.openmrs.propertyeditor.ConceptNameEditorTest
22-Feb-2019 18:38:13 Running org.openmrs.propertyeditor.PatientIdentifierTypeEditorTest
22-Feb-2019 18:38:14 Tests run: 2, Failures: 0, Errors: 0, Skipped: 0, Time elapsed: 0.285 sec - in org.openmrs.propertyeditor.PatientIdentifierTypeEditorTest
22-Feb-2019 18:38:14 Running org.openmrs.propertyeditor.LocationTagEditorTest
22-Feb-2019 18:38:14 Tests run: 2, Failures: 0, Errors: 0, Skipped: 0, Time elapsed: 0.284 sec - in org.openmrs.propertyeditor.LocationTagEditorTest
22-Feb-2019 18:38:14 Running org.openmrs.propertyeditor.ConceptDatatypeEditorTest
22-Feb-2019 18:38:14 Tests run: 2, Failures: 0, Errors: 0, Skipped: 0, Time elapsed: 0.25 sec - in org.openmrs.propertyeditor.ConceptDatatypeEditorTest
22-Feb-2019 18:38:14 Running org.openmrs.propertyeditor.ConceptAnswerEditorTest
22-Feb-2019 18:38:14 Tests run: 2, Failures: 0, Errors: 0, Skipped: 0, Time elapsed: 0.25 sec - in org.openmrs.propertyeditor.ConceptAnswerEditorTest
22-Feb-2019 18:38:14 Running org.openmrs.propertyeditor.ConceptClassEditorTest
22-Feb-2019 18:38:15 Tests run: 2, Failures: 0, Errors: 0, Skipped: 0, Time elapsed: 0.425 sec - in org.openmrs.propertyeditor.ConceptClassEditorTest
22-Feb-2019 18:38:15 Running org.openmrs.propertyeditor.ProgramWorkflowStateEditorTest
22-Feb-2019 18:38:15 Tests run: 1, Failures: 0, Errors: 0, Skipped: 0, Time elapsed: 0.294 sec - in org.openmrs.propertyeditor.ProgramWorkflowStateEditorTest
22-Feb-2019 18:38:15 Running org.openmrs.propertyeditor.ProgramEditorTest
22-Feb-2019 18:38:15 Tests run: 4, Failures: 0, Errors: 0, Skipped: 0, Time elapsed: 0.288 sec - in org.openmrs.propertyeditor.ProgramEditorTest
22-Feb-2019 18:38:15 Running org.openmrs.propertyeditor.DateOrDatetimeEditorTest
22-Feb-2019 18:38:15 Tests run: 6, Failures: 0, Errors: 0, Skipped: 0, Time elapsed: 0.015 sec - in org.openmrs.propertyeditor.DateOrDatetimeEditorTest
22-Feb-2019 18:38:15 Running org.openmrs.propertyeditor.VisitEditorTest
22-Feb-2019 18:38:16 Tests run: 2, Failures: 0, Errors: 0, Skipped: 0, Time elapsed: 0.302 sec - in org.openmrs.propertyeditor.VisitEditorTest
22-Feb-2019 18:38:16 Running org.openmrs.propertyeditor.VisitTypeEditorTest
22-Feb-2019 18:38:16 Tests run: 2, Failures: 0, Errors: 0, Skipped: 0, Time elapsed: 0.232 sec - in org.openmrs.propertyeditor.VisitTypeEditorTest
22-Feb-2019 18:38:16 Running org.openmrs.propertyeditor.RoleEditorTest
22-Feb-2019 18:38:16 Tests run: 2, Failures: 0, Errors: 0, Skipped: 0, Time elapsed: 0.327 sec - in org.openmrs.propertyeditor.RoleEditorTest
22-Feb-2019 18:38:16 Running org.openmrs.propertyeditor.ConceptEditorTest
22-Feb-2019 18:38:17 Tests run: 2, Failures: 0, Errors: 0, Skipped: 0, Time elapsed: 0.231 sec - in org.openmrs.propertyeditor.ConceptEditorTest
22-Feb-2019 18:38:17 Running org.openmrs.propertyeditor.WorkflowCollectionEditorTest
22-Feb-2019 18:38:17 Tests run: 1, Failures: 0, Errors: 0, Skipped: 0, Time elapsed: 0.239 sec - in org.openmrs.propertyeditor.WorkflowCollectionEditorTest
22-Feb-2019 18:38:17 Running org.openmrs.propertyeditor.PersonAttributeEditorTest
22-Feb-2019 18:38:17 Tests run: 2, Failures: 0, Errors: 0, Skipped: 0, Time elapsed: 0.228 sec - in org.openmrs.propertyeditor.PersonAttributeEditorTest
22-Feb-2019 18:38:17 Running org.openmrs.propertyeditor.FormEditorTest
22-Feb-2019 18:38:18 Tests run: 2, Failures: 0, Errors: 0, Skipped: 0, Time elapsed: 0.475 sec - in org.openmrs.propertyeditor.FormEditorTest
22-Feb-2019 18:38:18 Running org.openmrs.propertyeditor.OrderEditorTest
22-Feb-2019 18:38:18 Tests run: 2, Failures: 0, Errors: 0, Skipped: 0, Time elapsed: 0.237 sec - in org.openmrs.propertyeditor.OrderEditorTest
22-Feb-2019 18:38:18 Running org.openmrs.propertyeditor.PrivilegeEditorTest
22-Feb-2019 18:38:18 Tests run: 2, Failures: 0, Errors: 0, Skipped: 0, Time elapsed: 0.31 sec - in org.openmrs.propertyeditor.PrivilegeEditorTest
22-Feb-2019 18:38:18 Running org.openmrs.propertyeditor.EncounterEditorTest
22-Feb-2019 18:38:18 Tests run: 2, Failures: 0, Errors: 0, Skipped: 0, Time elapsed: 0.254 sec - in org.openmrs.propertyeditor.EncounterEditorTest
22-Feb-2019 18:38:18 Running org.openmrs.propertyeditor.DrugEditorTest
22-Feb-2019 18:38:19 Tests run: 2, Failures: 0, Errors: 0, Skipped: 0, Time elapsed: 0.291 sec - in org.openmrs.propertyeditor.DrugEditorTest
22-Feb-2019 18:38:19 Running org.openmrs.propertyeditor.PersonEditorTest
22-Feb-2019 18:38:19 Tests run: 2, Failures: 0, Errors: 0, Skipped: 0, Time elapsed: 0.3 sec - in org.openmrs.propertyeditor.PersonEditorTest
22-Feb-2019 18:38:19 Running org.openmrs.propertyeditor.LocationEditorTest
22-Feb-2019 18:38:19 Tests run: 2, Failures: 0, Errors: 0, Skipped: 0, Time elapsed: 0.328 sec - in org.openmrs.propertyeditor.LocationEditorTest
22-Feb-2019 18:38:19 Running org.openmrs.propertyeditor.PatientEditorTest
22-Feb-2019 18:38:20 Tests run: 2, Failures: 0, Errors: 0, Skipped: 0, Time elapsed: 0.401 sec - in org.openmrs.propertyeditor.PatientEditorTest
22-Feb-2019 18:38:20 Running org.openmrs.propertyeditor.ConceptAnswersEditorTest
22-Feb-2019 18:38:20 Tests run: 1, Failures: 0, Errors: 0, Skipped: 0, Time elapsed: 0.282 sec - in org.openmrs.propertyeditor.ConceptAnswersEditorTest
22-Feb-2019 18:38:20 Running org.openmrs.EncounterTest
22-Feb-2019 18:38:21 Tests run: 56, Failures: 0, Errors: 0, Skipped: 0, Time elapsed: 0.697 sec - in org.openmrs.EncounterTest
22-Feb-2019 18:38:21 Running org.openmrs.AllergenTest
22-Feb-2019 18:38:21 Tests run: 6, Failures: 0, Errors: 0, Skipped: 0, Time elapsed: 0.313 sec - in org.openmrs.AllergenTest
22-Feb-2019 18:38:21 Running org.openmrs.customdatatype.datatype.DateDatatypeTest
22-Feb-2019 18:38:21 Tests run: 2, Failures: 0, Errors: 0, Skipped: 0, Time elapsed: 0 sec - in org.openmrs.customdatatype.datatype.DateDatatypeTest
22-Feb-2019 18:38:21 Running org.openmrs.customdatatype.datatype.RegexValidatedTextTest
22-Feb-2019 18:38:21 Tests run: 3, Failures: 0, Errors: 0, Skipped: 0, Time elapsed: 0.001 sec - in org.openmrs.customdatatype.datatype.RegexValidatedTextTest
22-Feb-2019 18:38:21 Running org.openmrs.customdatatype.datatype.BaseOpenmrsDatatypeTest
22-Feb-2019 18:38:21 Tests run: 1, Failures: 0, Errors: 0, Skipped: 0, Time elapsed: 0 sec - in org.openmrs.customdatatype.datatype.BaseOpenmrsDatatypeTest
22-Feb-2019 18:38:21 Running org.openmrs.customdatatype.datatype.BaseMetadataDatatypeTest
22-Feb-2019 18:38:21 Tests run: 1, Failures: 0, Errors: 0, Skipped: 0, Time elapsed: 0 sec - in org.openmrs.customdatatype.datatype.BaseMetadataDatatypeTest
22-Feb-2019 18:38:21 Running org.openmrs.customdatatype.CustomDatatypeUtilTest
22-Feb-2019 18:38:21 Tests run: 1, Failures: 0, Errors: 0, Skipped: 0, Time elapsed: 0.354 sec - in org.openmrs.customdatatype.CustomDatatypeUtilTest
22-Feb-2019 18:38:21 Running org.openmrs.module.ModuleActivatorTest
22-Feb-2019 18:38:21 Tests run: 1, Failures: 0, Errors: 0, Skipped: 1, Time elapsed: 0 sec - in org.openmrs.module.ModuleActivatorTest
22-Feb-2019 18:38:21 Running org.openmrs.module.ModuleUtilTest
22-Feb-2019 18:38:22 Tests run: 43, Failures: 0, Errors: 0, Skipped: 0, Time elapsed: 0.543 sec - in org.openmrs.module.ModuleUtilTest
22-Feb-2019 18:38:22 Running org.openmrs.module.VersionComparatorTest
22-Feb-2019 18:38:22 Tests run: 1, Failures: 0, Errors: 0, Skipped: 0, Time elapsed: 0 sec - in org.openmrs.module.VersionComparatorTest
22-Feb-2019 18:38:22 Running org.openmrs.module.ModuleInteroperabilityTest
22-Feb-2019 18:38:22 Tests run: 1, Failures: 0, Errors: 0, Skipped: 0, Time elapsed: 0.341 sec - in org.openmrs.module.ModuleInteroperabilityTest
22-Feb-2019 18:38:22 Running org.openmrs.module.ModuleClassLoaderTest
22-Feb-2019 18:38:22 Tests run: 10, Failures: 0, Errors: 0, Skipped: 0, Time elapsed: 0.28 sec - in org.openmrs.module.ModuleClassLoaderTest
22-Feb-2019 18:38:22 Running org.openmrs.module.ModuleFileParserTest
22-Feb-2019 18:38:22 Tests run: 5, Failures: 0, Errors: 0, Skipped: 0, Time elapsed: 0.006 sec - in org.openmrs.module.ModuleFileParserTest
22-Feb-2019 18:38:23
22-Feb-2019 18:38:23 Results :
22-Feb-2019 18:38:23
22-Feb-2019 18:38:23 Tests run: 3265, Failures: 0, Errors: 0, Skipped: 29
22-Feb-2019 18:38:23
22-Feb-2019 18:38:23 [INFO]
22-Feb-2019 18:38:23 [INFO] --- maven-jar-plugin:2.3.2:jar (default-jar) @ openmrs-api ---
22-Feb-2019 18:38:23 [INFO] Building jar: /home/bamboo-agent/bamboo-agent/xml-data/build-dir/TRUNK-OC2-JOB1/api/target/openmrs-api-2.0.8-SNAPSHOT.jar
22-Feb-2019 18:38:23 [INFO]
22-Feb-2019 18:38:23 [INFO] --- maven-jar-plugin:2.3.2:test-jar (default) @ openmrs-api ---
22-Feb-2019 18:38:23 [INFO] Building jar: /home/bamboo-agent/bamboo-agent/xml-data/build-dir/TRUNK-OC2-JOB1/api/target/openmrs-api-2.0.8-SNAPSHOT-tests.jar
22-Feb-2019 18:38:24 [INFO]                                                                         
22-Feb-2019 18:38:24 [INFO] ------------------------------------------------------------------------
22-Feb-2019 18:38:24 [INFO] Building openmrs-web 2.0.8-SNAPSHOT
22-Feb-2019 18:38:24 [INFO] ------------------------------------------------------------------------
22-Feb-2019 18:38:24 [INFO]
22-Feb-2019 18:38:24 [INFO] --- maven-clean-plugin:2.5:clean (default-clean) @ openmrs-web ---
22-Feb-2019 18:38:24 [INFO]
22-Feb-2019 18:38:24 [INFO] --- buildnumber-maven-plugin:1.1:create (default) @ openmrs-web ---
22-Feb-2019 18:38:24 [INFO]
22-Feb-2019 18:38:24 [INFO] --- build-helper-maven-plugin:1.5:parse-version (parse-version) @ openmrs-web ---
22-Feb-2019 18:38:24 [INFO]
22-Feb-2019 18:38:24 [INFO] --- maven-java-formatter-plugin:0.3:format (default) @ openmrs-web ---
22-Feb-2019 18:38:24 [INFO] Using 'UTF-8' encoding to format source files.
22-Feb-2019 18:38:24 [INFO] Number of files to be formatted: 50
22-Feb-2019 18:38:24 [INFO] Successfully formatted: 0 file(s)
22-Feb-2019 18:38:24 [INFO] Fail to format        : 0 file(s)
22-Feb-2019 18:38:24 [INFO] Skipped               : 50 file(s)
22-Feb-2019 18:38:24 [INFO] Approximate time taken: 0s
22-Feb-2019 18:38:24 [INFO]
22-Feb-2019 18:38:24 [INFO] --- maven-resources-plugin:2.4:resources (default-resources) @ openmrs-web ---
22-Feb-2019 18:38:24 [INFO] Using 'UTF-8' encoding to copy filtered resources.
22-Feb-2019 18:38:24 [INFO] Copying 22 resources
22-Feb-2019 18:38:24 [INFO]
22-Feb-2019 18:38:24 [INFO] --- maven-compiler-plugin:2.1:compile (default-compile) @ openmrs-web ---
22-Feb-2019 18:38:24 [INFO] Compiling 39 source files to /home/bamboo-agent/bamboo-agent/xml-data/build-dir/TRUNK-OC2-JOB1/web/target/classes
22-Feb-2019 18:38:26 [INFO]
22-Feb-2019 18:38:26 [INFO] --- maven-resources-plugin:2.4:testResources (default-testResources) @ openmrs-web ---
22-Feb-2019 18:38:26 [INFO] Using 'UTF-8' encoding to copy filtered resources.
22-Feb-2019 18:38:26 [INFO] skip non existing resourceDirectory /home/bamboo-agent/bamboo-agent/xml-data/build-dir/TRUNK-OC2-JOB1/web/src/test/resources
22-Feb-2019 18:38:26 [INFO]
22-Feb-2019 18:38:26 [INFO] --- maven-compiler-plugin:2.1:testCompile (default-testCompile) @ openmrs-web ---
22-Feb-2019 18:38:26 [INFO] Compiling 11 source files to /home/bamboo-agent/bamboo-agent/xml-data/build-dir/TRUNK-OC2-JOB1/web/target/test-classes
22-Feb-2019 18:38:27 [INFO]
22-Feb-2019 18:38:27 [INFO] --- maven-surefire-plugin:2.18.1:test (default-test) @ openmrs-web ---
22-Feb-2019 18:38:27 [INFO] Surefire report directory: /home/bamboo-agent/bamboo-agent/xml-data/build-dir/TRUNK-OC2-JOB1/web/target/surefire-reports
22-Feb-2019 18:38:27
22-Feb-2019 18:38:27 -------------------------------------------------------
22-Feb-2019 18:38:27 T E S T S
22-Feb-2019 18:38:27 -------------------------------------------------------
22-Feb-2019 18:38:29 Running org.openmrs.web.filter.update.UpdateFilterTest
22-Feb-2019 18:38:40 Tests run: 5, Failures: 0, Errors: 0, Skipped: 0, Time elapsed: 10.465 sec - in org.openmrs.web.filter.update.UpdateFilterTest
22-Feb-2019 18:38:40 Running org.openmrs.web.filter.update.util.FilterUtilTest
22-Feb-2019 18:38:40 Tests run: 2, Failures: 0, Errors: 0, Skipped: 2, Time elapsed: 0 sec - in org.openmrs.web.filter.update.util.FilterUtilTest
22-Feb-2019 18:38:40 Running org.openmrs.web.filter.update.GZIPFilterTest
22-Feb-2019 18:38:40 Tests run: 1, Failures: 0, Errors: 0, Skipped: 0, Time elapsed: 0.243 sec - in org.openmrs.web.filter.update.GZIPFilterTest
22-Feb-2019 18:38:40 Running org.openmrs.web.WebUtilTest
22-Feb-2019 18:38:40 Tests run: 10, Failures: 0, Errors: 0, Skipped: 0, Time elapsed: 0.005 sec - in org.openmrs.web.WebUtilTest
22-Feb-2019 18:38:40 Running org.openmrs.module.web.WebModuleUtilTest
22-Feb-2019 18:38:40 SLF4J: Class path contains multiple SLF4J bindings.
22-Feb-2019 18:38:40 SLF4J: Found binding in [jar:file:/home/bamboo-agent/.m2/repository/org/slf4j/slf4j-log4j12/1.6.0/slf4j-log4j12-1.6.0.jar!/org/slf4j/impl/StaticLoggerBinder.class]
22-Feb-2019 18:38:40 SLF4J: Found binding in [jar:file:/home/bamboo-agent/.m2/repository/org/slf4j/slf4j-log4j12/1.6.0/slf4j-log4j12-1.6.0.jar!/org/slf4j/impl/StaticLoggerBinder.class]
22-Feb-2019 18:38:40 SLF4J: See http://www.slf4j.org/codes.html#multiple_bindings for an explanation.
22-Feb-2019 18:38:41 Tests run: 9, Failures: 0, Errors: 0, Skipped: 0, Time elapsed: 1.153 sec - in org.openmrs.module.web.WebModuleUtilTest
22-Feb-2019 18:38:41
22-Feb-2019 18:38:41 Results :
22-Feb-2019 18:38:41
22-Feb-2019 18:38:41 Tests run: 27, Failures: 0, Errors: 0, Skipped: 2
22-Feb-2019 18:38:41
22-Feb-2019 18:38:41 [INFO]
22-Feb-2019 18:38:41 [INFO] --- maven-jar-plugin:2.3.2:jar (default-jar) @ openmrs-web ---
22-Feb-2019 18:38:41 [INFO] Building jar: /home/bamboo-agent/bamboo-agent/xml-data/build-dir/TRUNK-OC2-JOB1/web/target/openmrs-web-2.0.8-SNAPSHOT.jar
22-Feb-2019 18:38:41 [INFO]
22-Feb-2019 18:38:41 [INFO] --- maven-jar-plugin:2.3.2:test-jar (default) @ openmrs-web ---
22-Feb-2019 18:38:41 [INFO] Building jar: /home/bamboo-agent/bamboo-agent/xml-data/build-dir/TRUNK-OC2-JOB1/web/target/openmrs-web-2.0.8-SNAPSHOT-tests.jar
22-Feb-2019 18:38:41 [INFO]                                                                         
22-Feb-2019 18:38:41 [INFO] ------------------------------------------------------------------------
22-Feb-2019 18:38:41 [INFO] Building openmrs-webapp 2.0.8-SNAPSHOT
22-Feb-2019 18:38:41 [INFO] ------------------------------------------------------------------------
22-Feb-2019 18:38:41 [INFO]
22-Feb-2019 18:38:41 [INFO] --- maven-clean-plugin:2.5:clean (default-clean) @ openmrs-webapp ---
22-Feb-2019 18:38:41 [INFO]
22-Feb-2019 18:38:41 [INFO] --- buildnumber-maven-plugin:1.1:create (default) @ openmrs-webapp ---
22-Feb-2019 18:38:41 [INFO]
22-Feb-2019 18:38:41 [INFO] --- build-helper-maven-plugin:1.5:parse-version (parse-version) @ openmrs-webapp ---
22-Feb-2019 18:38:41 [INFO]
22-Feb-2019 18:38:41 [INFO] --- maven-resources-plugin:2.4:resources (default-resources) @ openmrs-webapp ---
22-Feb-2019 18:38:41 [INFO] Using 'UTF-8' encoding to copy filtered resources.
22-Feb-2019 18:38:41 [INFO] Copying 2 resources
22-Feb-2019 18:38:41 [INFO] Copying 1 resource to ../jetty
22-Feb-2019 18:38:41 [INFO]
22-Feb-2019 18:38:41 [INFO] --- maven-antrun-plugin:1.4:run (default) @ openmrs-webapp ---
22-Feb-2019 18:38:42 project.artifactId
22-Feb-2019 18:38:42 [INFO] Executing tasks
22-Feb-2019 18:38:42     [unzip] Expanding: /home/bamboo-agent/bamboo-agent/xml-data/build-dir/TRUNK-OC2-JOB1/webapp/src/main/resources/liquibase-demo-data.zip into /home/bamboo-agent/bamboo-agent/xml-data/build-dir/TRUNK-OC2-JOB1/webapp/target/classes
22-Feb-2019 18:38:42 [INFO] Executed tasks
22-Feb-2019 18:38:42 [INFO]
22-Feb-2019 18:38:42 [INFO] --- maven-compiler-plugin:2.1:compile (default-compile) @ openmrs-webapp ---
22-Feb-2019 18:38:42 [INFO] No sources to compile
22-Feb-2019 18:38:42 [INFO]
22-Feb-2019 18:38:42 [INFO] --- maven-resources-plugin:2.4:testResources (default-testResources) @ openmrs-webapp ---
22-Feb-2019 18:38:42 [INFO] Using 'UTF-8' encoding to copy filtered resources.
22-Feb-2019 18:38:42 [INFO] Copying 1 resource
22-Feb-2019 18:38:42 [INFO]
22-Feb-2019 18:38:42 [INFO] --- maven-compiler-plugin:2.1:testCompile (default-testCompile) @ openmrs-webapp ---
22-Feb-2019 18:38:42 [INFO] Compiling 3 source files to /home/bamboo-agent/bamboo-agent/xml-data/build-dir/TRUNK-OC2-JOB1/webapp/target/test-classes
22-Feb-2019 18:38:43 [INFO]
22-Feb-2019 18:38:43 [INFO] --- maven-surefire-plugin:2.18.1:test (default-test) @ openmrs-webapp ---
22-Feb-2019 18:38:43 [INFO] Surefire report directory: /home/bamboo-agent/bamboo-agent/xml-data/build-dir/TRUNK-OC2-JOB1/webapp/target/surefire-reports
22-Feb-2019 18:38:43
22-Feb-2019 18:38:43 -------------------------------------------------------
22-Feb-2019 18:38:43 T E S T S
22-Feb-2019 18:38:43 -------------------------------------------------------
22-Feb-2019 18:38:43 Running org.openmrs.MessagePropertiesFilesTest
22-Feb-2019 18:38:43 Tests run: 0, Failures: 0, Errors: 0, Skipped: 0, Time elapsed: 0.006 sec - in org.openmrs.MessagePropertiesFilesTest
22-Feb-2019 18:38:43
22-Feb-2019 18:38:43 Results :
22-Feb-2019 18:38:43
22-Feb-2019 18:38:43 Tests run: 0, Failures: 0, Errors: 0, Skipped: 0
22-Feb-2019 18:38:43
22-Feb-2019 18:38:43 [INFO]
22-Feb-2019 18:38:43 [INFO] --- maven-war-plugin:2.4:war (default-war) @ openmrs-webapp ---
22-Feb-2019 18:38:43 [INFO] Packaging webapp
22-Feb-2019 18:38:43 [INFO] Assembling webapp [openmrs-webapp] in [/home/bamboo-agent/bamboo-agent/xml-data/build-dir/TRUNK-OC2-JOB1/webapp/target/openmrs]
22-Feb-2019 18:38:43 [INFO] Processing war project
22-Feb-2019 18:38:43 [INFO] Copying webapp webResources [/home/bamboo-agent/bamboo-agent/xml-data/build-dir/TRUNK-OC2-JOB1/webapp/src/main/webapp] to [/home/bamboo-agent/bamboo-agent/xml-data/build-dir/TRUNK-OC2-JOB1/webapp/target/openmrs]
22-Feb-2019 18:38:43 [INFO] Copying webapp resources [/home/bamboo-agent/bamboo-agent/xml-data/build-dir/TRUNK-OC2-JOB1/webapp/src/main/webapp]
22-Feb-2019 18:38:44 [INFO] Webapp assembled in [401 msecs]
22-Feb-2019 18:38:44 [INFO] Building war: /home/bamboo-agent/bamboo-agent/xml-data/build-dir/TRUNK-OC2-JOB1/webapp/target/openmrs.war
22-Feb-2019 18:38:46 [INFO]
22-Feb-2019 18:38:46 [INFO] --- maven-jar-plugin:2.3.2:test-jar (default) @ openmrs-webapp ---
22-Feb-2019 18:38:46 [INFO] Building jar: /home/bamboo-agent/bamboo-agent/xml-data/build-dir/TRUNK-OC2-JOB1/webapp/target/openmrs-tests.jar
22-Feb-2019 18:38:46 [INFO] ------------------------------------------------------------------------
22-Feb-2019 18:38:46 [INFO] Reactor Summary:
22-Feb-2019 18:38:46 [INFO]
22-Feb-2019 18:38:46 [INFO] OpenMRS ............................................ SUCCESS [  0.973 s]
22-Feb-2019 18:38:46 [INFO] openmrs-tools ...................................... SUCCESS [  0.920 s]
22-Feb-2019 18:38:46 [INFO] openmrs-test ....................................... SUCCESS [  0.099 s]
22-Feb-2019 18:38:46 [INFO] openmrs-api ........................................ SUCCESS [03:02 min]
22-Feb-2019 18:38:46 [INFO] openmrs-web ........................................ SUCCESS [ 17.596 s]
22-Feb-2019 18:38:46 [INFO] openmrs-webapp ..................................... SUCCESS [  4.621 s]
22-Feb-2019 18:38:46 [INFO] ------------------------------------------------------------------------
22-Feb-2019 18:38:46 [INFO] BUILD SUCCESS
22-Feb-2019 18:38:46 [INFO] ------------------------------------------------------------------------
22-Feb-2019 18:38:46 [INFO] Total time: 03:27 min
22-Feb-2019 18:38:46 [INFO] Finished at: 2019-02-22T18:38:46+00:00
22-Feb-2019 18:38:46 [INFO] Final Memory: 103M/669M
22-Feb-2019 18:38:46 [INFO] ------------------------------------------------------------------------
22-Feb-2019 18:38:47 Parsing test results under /home/bamboo-agent/bamboo-agent/xml-data/build-dir/TRUNK-OC2-JOB1...
22-Feb-2019 18:38:47 Finished task 'Build' with result: Success
22-Feb-2019 18:38:47 Running post build plugin 'Docker Container Cleanup'
22-Feb-2019 18:38:47 Running post build plugin 'NCover Results Collector'
22-Feb-2019 18:38:47 Running post build plugin 'Clover Results Collector'
22-Feb-2019 18:38:47 Running post build plugin 'Sauce OnDemand Post Runner'
22-Feb-2019 18:38:47 Running post build plugin 'npm Cache Cleanup'
22-Feb-2019 18:38:47 Running post build plugin 'Artifact Copier'
22-Feb-2019 18:38:47 Publishing an artifact: openmrs-war
22-Feb-2019 18:38:51 Finished publishing of artifact Non required shared artifact: [openmrs-war], pattern: [**/openmrs.war] anchored at: [webapp/target] in 4.381 s
22-Feb-2019 18:38:51 Publishing an artifact: openmrs-api
22-Feb-2019 18:38:52 Finished publishing of artifact Non required shared artifact: [openmrs-api], pattern: [**/openmrs-api*.jar] anchored at: [webapp/target/openmrs/WEB-INF/lib] in 744.3 ms
22-Feb-2019 18:38:52 Publishing an artifact: sonar-issues
22-Feb-2019 18:38:52 Unable to publish artifact [sonar-issues]: the source directory /home/bamboo-agent/bamboo-agent/xml-data/build-dir/TRUNK-OC2-JOB1/target/sonar/issues-report does not exist.
22-Feb-2019 18:38:52 The artifact hasn't been successfully published after 632.3 μs
22-Feb-2019 18:38:52 Finalising the build...
22-Feb-2019 18:38:52 Stopping timer.
22-Feb-2019 18:38:52 Build TRUNK-OC2-JOB1-221 completed.
22-Feb-2019 18:38:52 Running on server: post build plugin 'NCover Results Collector'
22-Feb-2019 18:38:52 Running on server: post build plugin 'Build Hanging Detection Configuration'
22-Feb-2019 18:38:52 Running on server: post build plugin 'Clover Delta Calculator'
22-Feb-2019 18:38:52 Running on server: post build plugin 'Maven Dependencies Postprocessor'
22-Feb-2019 18:38:52 All post build plugins have finished
22-Feb-2019 18:38:52 Generating build results summary...
22-Feb-2019 18:38:55 Saving build results to disk...
22-Feb-2019 18:38:55 Logging substituted variables...
22-Feb-2019 18:38:55 Indexing build results...
22-Feb-2019 18:38:55 Finished building TRUNK-OC2-JOB1-221.