Plan for OpenMRS Core 2.0.x

Build: #242 was successful

Job: Build and Test was successful

Stages & jobs

  1. Build and Test

  2. Deploy

  3. Release

    Requires a user to start manually

Build log

The build generated 5,823 lines of output.The output is too long and has been truncated to the last 1,000 lines. Download or view full build log

03-Nov-2020 11:19:08 Running org.openmrs.patient.impl.VerhoeffIdentifierValidatorTest
03-Nov-2020 11:19:08 Tests run: 2, Failures: 0, Errors: 0, Skipped: 0, Time elapsed: 0.002 sec - in org.openmrs.patient.impl.VerhoeffIdentifierValidatorTest
03-Nov-2020 11:19:08 Running org.openmrs.FormTest
03-Nov-2020 11:19:08 Tests run: 1, Failures: 0, Errors: 0, Skipped: 0, Time elapsed: 0 sec - in org.openmrs.FormTest
03-Nov-2020 11:19:08 Running org.openmrs.PersonTest
03-Nov-2020 11:19:08 Tests run: 27, Failures: 0, Errors: 0, Skipped: 0, Time elapsed: 0.311 sec - in org.openmrs.PersonTest
03-Nov-2020 11:19:08 Running org.openmrs.ConceptComponentTest
03-Nov-2020 11:19:08 Tests run: 1, Failures: 0, Errors: 0, Skipped: 0, Time elapsed: 0.023 sec - in org.openmrs.ConceptComponentTest
03-Nov-2020 11:19:08 Running org.openmrs.OrderTest
03-Nov-2020 11:19:09 Tests run: 56, Failures: 0, Errors: 0, Skipped: 0, Time elapsed: 0.533 sec - in org.openmrs.OrderTest
03-Nov-2020 11:19:09 Running org.openmrs.annotation.OpenmrsProfileExcludeFilterWithModulesTest
03-Nov-2020 11:19:09 Tests run: 1, Failures: 0, Errors: 0, Skipped: 0, Time elapsed: 0.569 sec - in org.openmrs.annotation.OpenmrsProfileExcludeFilterWithModulesTest
03-Nov-2020 11:19:09 Running org.openmrs.annotation.OpenmrsProfileIncludeFilterTest
03-Nov-2020 11:19:10 Tests run: 2, Failures: 0, Errors: 0, Skipped: 0, Time elapsed: 0.418 sec - in org.openmrs.annotation.OpenmrsProfileIncludeFilterTest
03-Nov-2020 11:19:10 Running org.openmrs.annotation.OpenmrsProfileExcludeFilterTest
03-Nov-2020 11:19:10 Tests run: 8, Failures: 0, Errors: 0, Skipped: 2, Time elapsed: 0.506 sec - in org.openmrs.annotation.OpenmrsProfileExcludeFilterTest
03-Nov-2020 11:19:10 Running org.openmrs.annotation.StartModuleAnnotationReuseTest
03-Nov-2020 11:19:11 Tests run: 1, Failures: 0, Errors: 0, Skipped: 0, Time elapsed: 0.668 sec - in org.openmrs.annotation.StartModuleAnnotationReuseTest
03-Nov-2020 11:19:11 Running org.openmrs.OrderTypeTest
03-Nov-2020 11:19:11 Tests run: 3, Failures: 0, Errors: 0, Skipped: 0, Time elapsed: 0 sec - in org.openmrs.OrderTypeTest
03-Nov-2020 11:19:11 Running org.openmrs.TestOrderTest
03-Nov-2020 11:19:11 Tests run: 4, Failures: 0, Errors: 0, Skipped: 0, Time elapsed: 0.005 sec - in org.openmrs.TestOrderTest
03-Nov-2020 11:19:11 Running org.openmrs.PersonAddressTest
03-Nov-2020 11:19:11 Tests run: 15, Failures: 0, Errors: 0, Skipped: 0, Time elapsed: 0.001 sec - in org.openmrs.PersonAddressTest
03-Nov-2020 11:19:11 Running org.openmrs.validator.PatientProgramValidatorTest
03-Nov-2020 11:19:12 Tests run: 22, Failures: 0, Errors: 0, Skipped: 0, Time elapsed: 0.648 sec - in org.openmrs.validator.PatientProgramValidatorTest
03-Nov-2020 11:19:12 Running org.openmrs.validator.PatientIdentifierTypeValidatorTest
03-Nov-2020 11:19:12 Tests run: 9, Failures: 0, Errors: 0, Skipped: 0, Time elapsed: 0.704 sec - in org.openmrs.validator.PatientIdentifierTypeValidatorTest
03-Nov-2020 11:19:12 Running org.openmrs.validator.ImplementationIdValidatorTest
03-Nov-2020 11:19:13 Tests run: 8, Failures: 0, Errors: 0, Skipped: 0, Time elapsed: 0.756 sec - in org.openmrs.validator.ImplementationIdValidatorTest
03-Nov-2020 11:19:13 Running org.openmrs.validator.UserValidatorTest
03-Nov-2020 11:19:13 Tests run: 21, Failures: 0, Errors: 0, Skipped: 0, Time elapsed: 0.411 sec - in org.openmrs.validator.UserValidatorTest
03-Nov-2020 11:19:13 Running org.openmrs.validator.ObsValidatorTest
03-Nov-2020 11:19:14 Tests run: 21, Failures: 0, Errors: 0, Skipped: 0, Time elapsed: 0.768 sec - in org.openmrs.validator.ObsValidatorTest
03-Nov-2020 11:19:14 Running org.openmrs.validator.DrugOrderValidatorTest
03-Nov-2020 11:19:15 Tests run: 36, Failures: 0, Errors: 0, Skipped: 0, Time elapsed: 1.215 sec - in org.openmrs.validator.DrugOrderValidatorTest
03-Nov-2020 11:19:15 Running org.openmrs.validator.PersonValidatorTest
03-Nov-2020 11:19:16 Tests run: 8, Failures: 0, Errors: 0, Skipped: 0, Time elapsed: 0.447 sec - in org.openmrs.validator.PersonValidatorTest
03-Nov-2020 11:19:16 Running org.openmrs.validator.ConceptDrugValidatorTest
03-Nov-2020 11:19:16 Tests run: 3, Failures: 0, Errors: 0, Skipped: 0, Time elapsed: 0.003 sec - in org.openmrs.validator.ConceptDrugValidatorTest
03-Nov-2020 11:19:16 Running org.openmrs.validator.VisitTypeValidatorTest
03-Nov-2020 11:19:16 Tests run: 2, Failures: 0, Errors: 0, Skipped: 0, Time elapsed: 0.344 sec - in org.openmrs.validator.VisitTypeValidatorTest
03-Nov-2020 11:19:16 Running org.openmrs.validator.AlertValidatorTest
03-Nov-2020 11:19:17 Tests run: 4, Failures: 0, Errors: 0, Skipped: 0, Time elapsed: 0.334 sec - in org.openmrs.validator.AlertValidatorTest
03-Nov-2020 11:19:17 Running org.openmrs.validator.PersonAttributeTypeValidatorTest
03-Nov-2020 11:19:17 Tests run: 7, Failures: 0, Errors: 0, Skipped: 0, Time elapsed: 0.337 sec - in org.openmrs.validator.PersonAttributeTypeValidatorTest
03-Nov-2020 11:19:17 Running org.openmrs.validator.PersonAddressValidatorTest
03-Nov-2020 11:19:18 Tests run: 10, Failures: 0, Errors: 0, Skipped: 0, Time elapsed: 0.645 sec - in org.openmrs.validator.PersonAddressValidatorTest
03-Nov-2020 11:19:18 Running org.openmrs.validator.ConceptAttributeTypeValidatorTest
03-Nov-2020 11:19:18 Tests run: 6, Failures: 0, Errors: 0, Skipped: 0, Time elapsed: 0.357 sec - in org.openmrs.validator.ConceptAttributeTypeValidatorTest
03-Nov-2020 11:19:18 Running org.openmrs.validator.DrugValidatorTest
03-Nov-2020 11:19:18 Tests run: 9, Failures: 0, Errors: 0, Skipped: 0, Time elapsed: 0.41 sec - in org.openmrs.validator.DrugValidatorTest
03-Nov-2020 11:19:18 Running org.openmrs.validator.SchedulerFormValidatorTest
03-Nov-2020 11:19:19 Tests run: 10, Failures: 0, Errors: 0, Skipped: 0, Time elapsed: 0.328 sec - in org.openmrs.validator.SchedulerFormValidatorTest
03-Nov-2020 11:19:19 Running org.openmrs.validator.TestOrderValidatorTest
03-Nov-2020 11:19:19 Tests run: 2, Failures: 0, Errors: 0, Skipped: 0, Time elapsed: 0.275 sec - in org.openmrs.validator.TestOrderValidatorTest
03-Nov-2020 11:19:19 Running org.openmrs.validator.PersonMergeLogValidatorTest
03-Nov-2020 11:19:19 Tests run: 6, Failures: 0, Errors: 0, Skipped: 0, Time elapsed: 0.288 sec - in org.openmrs.validator.PersonMergeLogValidatorTest
03-Nov-2020 11:19:19 Running org.openmrs.validator.RelationshipValidatorTest
03-Nov-2020 11:19:20 Tests run: 7, Failures: 0, Errors: 0, Skipped: 0, Time elapsed: 0.543 sec - in org.openmrs.validator.RelationshipValidatorTest
03-Nov-2020 11:19:20 Running org.openmrs.validator.LocationValidatorTest
03-Nov-2020 11:19:20 Tests run: 9, Failures: 0, Errors: 0, Skipped: 0, Time elapsed: 0.357 sec - in org.openmrs.validator.LocationValidatorTest
03-Nov-2020 11:19:20 Running org.openmrs.validator.PatientIdentifierValidatorTest
03-Nov-2020 11:19:21 Tests run: 20, Failures: 0, Errors: 0, Skipped: 0, Time elapsed: 0.54 sec - in org.openmrs.validator.PatientIdentifierValidatorTest
03-Nov-2020 11:19:21 Running org.openmrs.validator.PrivilegeValidatorTest
03-Nov-2020 11:19:21 Tests run: 5, Failures: 0, Errors: 0, Skipped: 0, Time elapsed: 0.375 sec - in org.openmrs.validator.PrivilegeValidatorTest
03-Nov-2020 11:19:21 Running org.openmrs.validator.PatientValidatorTest
03-Nov-2020 11:19:21 Tests run: 12, Failures: 0, Errors: 0, Skipped: 0, Time elapsed: 0.419 sec - in org.openmrs.validator.PatientValidatorTest
03-Nov-2020 11:19:21 Running org.openmrs.validator.AllergyValidatorTest
03-Nov-2020 11:19:22 Tests run: 9, Failures: 0, Errors: 0, Skipped: 0, Time elapsed: 0.502 sec - in org.openmrs.validator.AllergyValidatorTest
03-Nov-2020 11:19:22 Running org.openmrs.validator.PersonNameValidatorTest
03-Nov-2020 11:19:23 Tests run: 50, Failures: 0, Errors: 0, Skipped: 0, Time elapsed: 0.905 sec - in org.openmrs.validator.PersonNameValidatorTest
03-Nov-2020 11:19:23 Running org.openmrs.validator.OrderTypeValidatorTest
03-Nov-2020 11:19:23 Tests run: 14, Failures: 0, Errors: 0, Skipped: 0, Time elapsed: 0.442 sec - in org.openmrs.validator.OrderTypeValidatorTest
03-Nov-2020 11:19:23 Running org.openmrs.validator.VisitValidatorTest
03-Nov-2020 11:19:24 Tests run: 20, Failures: 0, Errors: 0, Skipped: 1, Time elapsed: 0.889 sec - in org.openmrs.validator.VisitValidatorTest
03-Nov-2020 11:19:24 Running org.openmrs.validator.FormValidatorTest
03-Nov-2020 11:19:24 Tests run: 8, Failures: 0, Errors: 0, Skipped: 0, Time elapsed: 0.306 sec - in org.openmrs.validator.FormValidatorTest
03-Nov-2020 11:19:24 Running org.openmrs.validator.LocationTagValidatorTest
03-Nov-2020 11:19:25 Tests run: 2, Failures: 0, Errors: 0, Skipped: 0, Time elapsed: 0.274 sec - in org.openmrs.validator.LocationTagValidatorTest
03-Nov-2020 11:19:25 Running org.openmrs.validator.EncounterValidatorTest
03-Nov-2020 11:19:25 Tests run: 10, Failures: 0, Errors: 0, Skipped: 0, Time elapsed: 0.425 sec - in org.openmrs.validator.EncounterValidatorTest
03-Nov-2020 11:19:25 Running org.openmrs.validator.FieldValidatorTest
03-Nov-2020 11:19:26 Tests run: 8, Failures: 0, Errors: 0, Skipped: 0, Time elapsed: 0.476 sec - in org.openmrs.validator.FieldValidatorTest
03-Nov-2020 11:19:26 Running org.openmrs.validator.ConceptDatatypeValidatorTest
03-Nov-2020 11:19:26 Tests run: 5, Failures: 0, Errors: 0, Skipped: 0, Time elapsed: 0.334 sec - in org.openmrs.validator.ConceptDatatypeValidatorTest
03-Nov-2020 11:19:26 Running org.openmrs.validator.ConceptMapTypeValidatorTest
03-Nov-2020 11:19:26 Tests run: 8, Failures: 0, Errors: 0, Skipped: 0, Time elapsed: 0.275 sec - in org.openmrs.validator.ConceptMapTypeValidatorTest
03-Nov-2020 11:19:26 Running org.openmrs.validator.ProviderValidatorTest
03-Nov-2020 11:19:27 Tests run: 13, Failures: 0, Errors: 0, Skipped: 0, Time elapsed: 0.445 sec - in org.openmrs.validator.ProviderValidatorTest
03-Nov-2020 11:19:27 Running org.openmrs.validator.StateConversionValidatorTest
03-Nov-2020 11:19:27 Tests run: 4, Failures: 0, Errors: 0, Skipped: 0, Time elapsed: 0.639 sec - in org.openmrs.validator.StateConversionValidatorTest
03-Nov-2020 11:19:27 Running org.openmrs.validator.ProgramValidatorTest
03-Nov-2020 11:19:28 Tests run: 8, Failures: 0, Errors: 0, Skipped: 0, Time elapsed: 0.604 sec - in org.openmrs.validator.ProgramValidatorTest
03-Nov-2020 11:19:28 Running org.openmrs.validator.BaseAttributeTypeValidatorTest
03-Nov-2020 11:19:31 Tests run: 9, Failures: 0, Errors: 0, Skipped: 0, Time elapsed: 3.011 sec - in org.openmrs.validator.BaseAttributeTypeValidatorTest
03-Nov-2020 11:19:31 Running org.openmrs.validator.OrderFrequencyValidatorTest
03-Nov-2020 11:19:32 Tests run: 9, Failures: 0, Errors: 0, Skipped: 0, Time elapsed: 0.556 sec - in org.openmrs.validator.OrderFrequencyValidatorTest
03-Nov-2020 11:19:32 Running org.openmrs.validator.EncounterTypeValidatorTest
03-Nov-2020 11:19:32 Tests run: 7, Failures: 0, Errors: 0, Skipped: 0, Time elapsed: 0.341 sec - in org.openmrs.validator.EncounterTypeValidatorTest
03-Nov-2020 11:19:32 Running org.openmrs.validator.ConceptValidatorTest
03-Nov-2020 11:19:33 Tests run: 30, Failures: 0, Errors: 0, Skipped: 0, Time elapsed: 0.777 sec - in org.openmrs.validator.ConceptValidatorTest
03-Nov-2020 11:19:33 Running org.openmrs.validator.ValidateUtilTest
03-Nov-2020 11:19:33 Tests run: 8, Failures: 0, Errors: 0, Skipped: 0, Time elapsed: 0.361 sec - in org.openmrs.validator.ValidateUtilTest
03-Nov-2020 11:19:33 Running org.openmrs.validator.ConceptNameTagValidatorTest
03-Nov-2020 11:19:33 Tests run: 7, Failures: 0, Errors: 0, Skipped: 0, Time elapsed: 0.324 sec - in org.openmrs.validator.ConceptNameTagValidatorTest
03-Nov-2020 11:19:33 Running org.openmrs.validator.FieldTypeValidatorTest
03-Nov-2020 11:19:34 Tests run: 5, Failures: 0, Errors: 0, Skipped: 0, Time elapsed: 0.307 sec - in org.openmrs.validator.FieldTypeValidatorTest
03-Nov-2020 11:19:34 Running org.openmrs.validator.RoleValidatorTest
03-Nov-2020 11:19:34 Tests run: 6, Failures: 0, Errors: 0, Skipped: 0, Time elapsed: 0.318 sec - in org.openmrs.validator.RoleValidatorTest
03-Nov-2020 11:19:34 Running org.openmrs.validator.VisitAttributeTypeValidatorTest
03-Nov-2020 11:19:34 Tests run: 2, Failures: 0, Errors: 0, Skipped: 0, Time elapsed: 0.31 sec - in org.openmrs.validator.VisitAttributeTypeValidatorTest
03-Nov-2020 11:19:34 Running org.openmrs.validator.LocationAttributeTypeValidatorTest
03-Nov-2020 11:19:35 Tests run: 6, Failures: 0, Errors: 0, Skipped: 0, Time elapsed: 0.417 sec - in org.openmrs.validator.LocationAttributeTypeValidatorTest
03-Nov-2020 11:19:35 Running org.openmrs.validator.RelationshipTypeValidatorTest
03-Nov-2020 11:19:35 Tests run: 7, Failures: 0, Errors: 0, Skipped: 0, Time elapsed: 0.367 sec - in org.openmrs.validator.RelationshipTypeValidatorTest
03-Nov-2020 11:19:35 Running org.openmrs.validator.ProviderAttributeTypeValidatorTest
03-Nov-2020 11:19:35 Tests run: 2, Failures: 0, Errors: 0, Skipped: 0, Time elapsed: 0.283 sec - in org.openmrs.validator.ProviderAttributeTypeValidatorTest
03-Nov-2020 11:19:35 Running org.openmrs.validator.OrderValidatorTest
03-Nov-2020 11:19:36 Tests run: 22, Failures: 0, Errors: 0, Skipped: 0, Time elapsed: 0.462 sec - in org.openmrs.validator.OrderValidatorTest
03-Nov-2020 11:19:36 Running org.openmrs.validator.ConceptSourceValidatorTest
03-Nov-2020 11:19:36 Tests run: 6, Failures: 0, Errors: 0, Skipped: 0, Time elapsed: 0.294 sec - in org.openmrs.validator.ConceptSourceValidatorTest
03-Nov-2020 11:19:36 Running org.openmrs.validator.EncounterRoleValidatorTest
03-Nov-2020 11:19:36 Tests run: 5, Failures: 0, Errors: 0, Skipped: 0, Time elapsed: 0.312 sec - in org.openmrs.validator.EncounterRoleValidatorTest
03-Nov-2020 11:19:36 Running org.openmrs.validator.RequireNameValidatorTest
03-Nov-2020 11:19:36 Tests run: 2, Failures: 0, Errors: 0, Skipped: 0, Time elapsed: 0 sec - in org.openmrs.validator.RequireNameValidatorTest
03-Nov-2020 11:19:36 Running org.openmrs.validator.ConceptReferenceTermValidatorTest
03-Nov-2020 11:19:37 [Field error in object 'term' on field 'conceptReferenceTermMaps[1].termB': rejected value [weight term(WGT234)]; codes [ConceptReferenceTerm.termToTerm.alreadyMapped.term.conceptReferenceTermMaps[1].termB,ConceptReferenceTerm.termToTerm.alreadyMapped.term.conceptReferenceTermMaps.termB,ConceptReferenceTerm.termToTerm.alreadyMapped.conceptReferenceTermMaps[1].termB,ConceptReferenceTerm.termToTerm.alreadyMapped.conceptReferenceTermMaps.termB,ConceptReferenceTerm.termToTerm.alreadyMapped.termB,ConceptReferenceTerm.termToTerm.alreadyMapped.org.openmrs.ConceptReferenceTerm,ConceptReferenceTerm.termToTerm.alreadyMapped]; arguments []; default message [Cannot map a reference term multiple times to the same concept reference term]]
03-Nov-2020 11:19:37 Tests run: 18, Failures: 0, Errors: 0, Skipped: 3, Time elapsed: 0.471 sec - in org.openmrs.validator.ConceptReferenceTermValidatorTest
03-Nov-2020 11:19:37 Running org.openmrs.validator.HL7SourceValidatorTest
03-Nov-2020 11:19:37 Tests run: 2, Failures: 0, Errors: 0, Skipped: 0, Time elapsed: 0.315 sec - in org.openmrs.validator.HL7SourceValidatorTest
03-Nov-2020 11:19:37 Running org.openmrs.validator.ConceptClassValidatorTest
03-Nov-2020 11:19:38 Tests run: 6, Failures: 0, Errors: 0, Skipped: 0, Time elapsed: 0.313 sec - in org.openmrs.validator.ConceptClassValidatorTest
03-Nov-2020 11:19:38 Running org.openmrs.BaseOpenmrsObjectTest
03-Nov-2020 11:19:38 Tests run: 20, Failures: 0, Errors: 0, Skipped: 0, Time elapsed: 0.411 sec - in org.openmrs.BaseOpenmrsObjectTest
03-Nov-2020 11:19:38 Running org.openmrs.EncounterTypeTest
03-Nov-2020 11:19:38 Tests run: 1, Failures: 0, Errors: 0, Skipped: 0, Time elapsed: 0.003 sec - in org.openmrs.EncounterTypeTest
03-Nov-2020 11:19:38 Running org.openmrs.DurationTest
03-Nov-2020 11:19:38 Tests run: 11, Failures: 0, Errors: 0, Skipped: 0, Time elapsed: 0.355 sec - in org.openmrs.DurationTest
03-Nov-2020 11:19:38 Running org.openmrs.LocationTest
03-Nov-2020 11:19:38 Tests run: 3, Failures: 0, Errors: 0, Skipped: 0, Time elapsed: 0 sec - in org.openmrs.LocationTest
03-Nov-2020 11:19:38 Running org.openmrs.comparator.PatientIdentifierTypeDefaultComparatorTest
03-Nov-2020 11:19:38 Tests run: 1, Failures: 0, Errors: 0, Skipped: 0, Time elapsed: 0.137 sec - in org.openmrs.comparator.PatientIdentifierTypeDefaultComparatorTest
03-Nov-2020 11:19:38 Running org.openmrs.ObsBehaviorTest
03-Nov-2020 11:19:39 Tests run: 3, Failures: 0, Errors: 0, Skipped: 1, Time elapsed: 0.267 sec - in org.openmrs.ObsBehaviorTest
03-Nov-2020 11:19:39 Running org.openmrs.ConceptReferenceTermTest
03-Nov-2020 11:19:39 Tests run: 3, Failures: 0, Errors: 0, Skipped: 0, Time elapsed: 0.001 sec - in org.openmrs.ConceptReferenceTermTest
03-Nov-2020 11:19:39 Running org.openmrs.aop.AuthorizationAdviceTest
03-Nov-2020 11:19:39 Tests run: 1, Failures: 0, Errors: 0, Skipped: 0, Time elapsed: 0.321 sec - in org.openmrs.aop.AuthorizationAdviceTest
03-Nov-2020 11:19:39 Running org.openmrs.aop.RequiredDataAdviceTest
03-Nov-2020 11:19:39 Tests run: 26, Failures: 0, Errors: 0, Skipped: 0, Time elapsed: 0.415 sec - in org.openmrs.aop.RequiredDataAdviceTest
03-Nov-2020 11:19:39 Running org.openmrs.PersonAttributeTest
03-Nov-2020 11:19:40 Tests run: 6, Failures: 0, Errors: 0, Skipped: 0, Time elapsed: 0.678 sec - in org.openmrs.PersonAttributeTest
03-Nov-2020 11:19:40 Running org.openmrs.RoleTest
03-Nov-2020 11:19:40 Tests run: 7, Failures: 0, Errors: 0, Skipped: 0, Time elapsed: 0.004 sec - in org.openmrs.RoleTest
03-Nov-2020 11:19:40 Running org.openmrs.messagesource.impl.DefaultMessageSourceServiceImplTest
03-Nov-2020 11:19:40 Tests run: 1, Failures: 0, Errors: 0, Skipped: 0, Time elapsed: 0 sec - in org.openmrs.messagesource.impl.DefaultMessageSourceServiceImplTest
03-Nov-2020 11:19:40 Running org.openmrs.messagesource.impl.CachedMessageSourceTest
03-Nov-2020 11:19:40 Tests run: 2, Failures: 0, Errors: 0, Skipped: 0, Time elapsed: 0.043 sec - in org.openmrs.messagesource.impl.CachedMessageSourceTest
03-Nov-2020 11:19:40 Running org.openmrs.messagesource.MessageSourceServiceTest
03-Nov-2020 11:19:40 Tests run: 1, Failures: 0, Errors: 0, Skipped: 0, Time elapsed: 0.256 sec - in org.openmrs.messagesource.MessageSourceServiceTest
03-Nov-2020 11:19:40 Running org.openmrs.messagesource.PresentationMessageMapTest
03-Nov-2020 11:19:40 Tests run: 2, Failures: 0, Errors: 0, Skipped: 0, Time elapsed: 0.001 sec - in org.openmrs.messagesource.PresentationMessageMapTest
03-Nov-2020 11:19:40 Running org.openmrs.util.DatabaseUpdaterTest
03-Nov-2020 11:19:41 INFO 11/3/20 11:19 AM:liquibase: Creating database history table with name: LIQUIBASECHANGELOG
03-Nov-2020 11:19:41 INFO 11/3/20 11:19 AM:liquibase: Reading from LIQUIBASECHANGELOG
03-Nov-2020 11:19:42 Tests run: 1, Failures: 0, Errors: 0, Skipped: 0, Time elapsed: 1.668 sec - in org.openmrs.util.DatabaseUpdaterTest
03-Nov-2020 11:19:42 Running org.openmrs.util.HttpClientTest
03-Nov-2020 11:19:42 Tests run: 1, Failures: 0, Errors: 0, Skipped: 0, Time elapsed: 0.02 sec - in org.openmrs.util.HttpClientTest
03-Nov-2020 11:19:42 Running org.openmrs.util.LocaleUtilityTest
03-Nov-2020 11:19:43 Tests run: 21, Failures: 0, Errors: 0, Skipped: 0, Time elapsed: 0.805 sec - in org.openmrs.util.LocaleUtilityTest
03-Nov-2020 11:19:43 Running org.openmrs.util.OpenmrsSecurityManagerTest
03-Nov-2020 11:19:43 Tests run: 2, Failures: 0, Errors: 0, Skipped: 0, Time elapsed: 0.001 sec - in org.openmrs.util.OpenmrsSecurityManagerTest
03-Nov-2020 11:19:43 Running org.openmrs.util.LocationUtilityTest
03-Nov-2020 11:19:43 Tests run: 2, Failures: 0, Errors: 0, Skipped: 0, Time elapsed: 0.341 sec - in org.openmrs.util.LocationUtilityTest
03-Nov-2020 11:19:43 Running org.openmrs.util.ProviderByPersonNameComparatorTest
03-Nov-2020 11:19:43 Tests run: 6, Failures: 0, Errors: 0, Skipped: 0, Time elapsed: 0.011 sec - in org.openmrs.util.ProviderByPersonNameComparatorTest
03-Nov-2020 11:19:43 Running org.openmrs.util.DoubleRangeTest
03-Nov-2020 11:19:43 Tests run: 28, Failures: 0, Errors: 0, Skipped: 0, Time elapsed: 0.028 sec - in org.openmrs.util.DoubleRangeTest
03-Nov-2020 11:19:43 Running org.openmrs.util.HttpUrlTest
03-Nov-2020 11:19:43 Tests run: 4, Failures: 0, Errors: 0, Skipped: 0, Time elapsed: 0.002 sec - in org.openmrs.util.HttpUrlTest
03-Nov-2020 11:19:43 Running org.openmrs.util.JavaVersionTest
03-Nov-2020 11:19:44 SLF4J: Class path contains multiple SLF4J bindings.
03-Nov-2020 11:19:44 SLF4J: Found binding in [jar:file:/home/bamboo-agent/.m2/repository/org/slf4j/slf4j-log4j12/1.6.0/slf4j-log4j12-1.6.0.jar!/org/slf4j/impl/StaticLoggerBinder.class]
03-Nov-2020 11:19:44 SLF4J: Found binding in [jar:file:/home/bamboo-agent/.m2/repository/org/slf4j/slf4j-log4j12/1.6.0/slf4j-log4j12-1.6.0.jar!/org/slf4j/impl/StaticLoggerBinder.class]
03-Nov-2020 11:19:44 SLF4J: See http://www.slf4j.org/codes.html#multiple_bindings for an explanation.
03-Nov-2020 11:19:44 Tests run: 2, Failures: 0, Errors: 0, Skipped: 0, Time elapsed: 1.01 sec - in org.openmrs.util.JavaVersionTest
03-Nov-2020 11:19:44 Running org.openmrs.util.ReflectTest
03-Nov-2020 11:19:44 Tests run: 18, Failures: 0, Errors: 0, Skipped: 0, Time elapsed: 0.004 sec - in org.openmrs.util.ReflectTest
03-Nov-2020 11:19:44 Running org.openmrs.util.UpgradeUtilTest
03-Nov-2020 11:19:45 Tests run: 2, Failures: 0, Errors: 0, Skipped: 0, Time elapsed: 0.309 sec - in org.openmrs.util.UpgradeUtilTest
03-Nov-2020 11:19:45 Running org.openmrs.util.DateUtilTest
03-Nov-2020 11:19:45 Tests run: 1, Failures: 0, Errors: 0, Skipped: 0, Time elapsed: 0 sec - in org.openmrs.util.DateUtilTest
03-Nov-2020 11:19:45 Running org.openmrs.util.ExceptionUtilTest
03-Nov-2020 11:19:45 Tests run: 1, Failures: 0, Errors: 0, Skipped: 0, Time elapsed: 0.003 sec - in org.openmrs.util.ExceptionUtilTest
03-Nov-2020 11:19:45 Running org.openmrs.util.PersonByNameComparatorTest
03-Nov-2020 11:19:45 Tests run: 4, Failures: 0, Errors: 0, Skipped: 0, Time elapsed: 0 sec - in org.openmrs.util.PersonByNameComparatorTest
03-Nov-2020 11:19:45 Running org.openmrs.util.UserByNameComparatorTest
03-Nov-2020 11:19:45 Tests run: 1, Failures: 0, Errors: 0, Skipped: 0, Time elapsed: 0 sec - in org.openmrs.util.UserByNameComparatorTest
03-Nov-2020 11:19:45 Running org.openmrs.util.DrugsByNameComparatorTest
03-Nov-2020 11:19:45 Tests run: 4, Failures: 0, Errors: 0, Skipped: 0, Time elapsed: 0 sec - in org.openmrs.util.DrugsByNameComparatorTest
03-Nov-2020 11:19:45 Running org.openmrs.util.OpenmrsUtilTest
03-Nov-2020 11:19:46 Tests run: 44, Failures: 0, Errors: 0, Skipped: 0, Time elapsed: 1.627 sec - in org.openmrs.util.OpenmrsUtilTest
03-Nov-2020 11:19:46 Running org.openmrs.util.GraphTest
03-Nov-2020 11:19:46 Tests run: 2, Failures: 0, Errors: 0, Skipped: 0, Time elapsed: 0.003 sec - in org.openmrs.util.GraphTest
03-Nov-2020 11:19:46 Running org.openmrs.util.HandlerUtilTest
03-Nov-2020 11:19:47 Tests run: 6, Failures: 0, Errors: 0, Skipped: 0, Time elapsed: 0.403 sec - in org.openmrs.util.HandlerUtilTest
03-Nov-2020 11:19:47 Running org.openmrs.util.SecurityTest
03-Nov-2020 11:19:47 Tests run: 7, Failures: 0, Errors: 0, Skipped: 0, Time elapsed: 0.101 sec - in org.openmrs.util.SecurityTest
03-Nov-2020 11:19:47 Running org.openmrs.DrugTest
03-Nov-2020 11:19:47 Tests run: 2, Failures: 0, Errors: 0, Skipped: 0, Time elapsed: 0.426 sec - in org.openmrs.DrugTest
03-Nov-2020 11:19:47 Running org.openmrs.ConceptNumericTest
03-Nov-2020 11:19:48 Tests run: 8, Failures: 0, Errors: 0, Skipped: 0, Time elapsed: 0.364 sec - in org.openmrs.ConceptNumericTest
03-Nov-2020 11:19:48 Running org.openmrs.OrderEntryIntegrationTest
03-Nov-2020 11:19:48 Tests run: 15, Failures: 0, Errors: 0, Skipped: 0, Time elapsed: 0.736 sec - in org.openmrs.OrderEntryIntegrationTest
03-Nov-2020 11:19:48 Running org.openmrs.api.LocationServiceTest
03-Nov-2020 11:19:50 Tests run: 70, Failures: 0, Errors: 0, Skipped: 0, Time elapsed: 1.378 sec - in org.openmrs.api.LocationServiceTest
03-Nov-2020 11:19:50 Running org.openmrs.api.AdministrationServiceTest
03-Nov-2020 11:19:51 Tests run: 53, Failures: 0, Errors: 0, Skipped: 4, Time elapsed: 1.022 sec - in org.openmrs.api.AdministrationServiceTest
03-Nov-2020 11:19:51 Running org.openmrs.api.FormServiceTest
03-Nov-2020 11:19:52 Tests run: 40, Failures: 0, Errors: 0, Skipped: 0, Time elapsed: 0.728 sec - in org.openmrs.api.FormServiceTest
03-Nov-2020 11:19:52 Running org.openmrs.api.ProviderServiceTest
03-Nov-2020 11:19:53 Tests run: 40, Failures: 0, Errors: 0, Skipped: 0, Time elapsed: 1.224 sec - in org.openmrs.api.ProviderServiceTest
03-Nov-2020 11:19:53 Running org.openmrs.api.OrderSetServiceTest
03-Nov-2020 11:19:53 Tests run: 12, Failures: 0, Errors: 0, Skipped: 0, Time elapsed: 0.528 sec - in org.openmrs.api.OrderSetServiceTest
03-Nov-2020 11:19:53 Running org.openmrs.api.PersonServiceTest
03-Nov-2020 11:19:55 Tests run: 119, Failures: 0, Errors: 0, Skipped: 0, Time elapsed: 1.506 sec - in org.openmrs.api.PersonServiceTest
03-Nov-2020 11:19:55 Running org.openmrs.api.EncounterServiceTest
03-Nov-2020 11:19:56 ERROR - ImageHandler.getObs(79) |2020-11-03 11:19:56,062| Trying to read file: /home/bamboo-agent/bamboo-agent/.agent_tmp/TRUNK-OC2-JOB1/appdir-for-unit-tests-54312797268382496/complex_obs/file1.jpg
03-Nov-2020 11:19:56 javax.imageio.IIOException: Can't read input file!
03-Nov-2020 11:19:56         at javax.imageio.ImageIO.read(ImageIO.java:1302)
03-Nov-2020 11:19:56         at org.openmrs.obs.handler.ImageHandler.getObs(ImageHandler.java:76)
03-Nov-2020 11:19:56         at org.openmrs.api.impl.ObsServiceImpl.getObs(ObsServiceImpl.java:254)
03-Nov-2020 11:19:56         at sun.reflect.GeneratedMethodAccessor774.invoke(Unknown Source)
03-Nov-2020 11:19:56         at sun.reflect.DelegatingMethodAccessorImpl.invoke(DelegatingMethodAccessorImpl.java:43)
03-Nov-2020 11:19:56         at java.lang.reflect.Method.invoke(Method.java:498)
03-Nov-2020 11:19:56         at org.springframework.aop.support.AopUtils.invokeJoinpointUsingReflection(AopUtils.java:317)
03-Nov-2020 11:19:56         at org.springframework.aop.framework.ReflectiveMethodInvocation.invokeJoinpoint(ReflectiveMethodInvocation.java:190)
03-Nov-2020 11:19:56         at org.springframework.aop.framework.ReflectiveMethodInvocation.proceed(ReflectiveMethodInvocation.java:157)
03-Nov-2020 11:19:56         at org.springframework.transaction.interceptor.TransactionInterceptor$1.proceedWithInvocation(TransactionInterceptor.java:99)
03-Nov-2020 11:19:56         at org.springframework.transaction.interceptor.TransactionAspectSupport.invokeWithinTransaction(TransactionAspectSupport.java:281)
03-Nov-2020 11:19:56         at org.springframework.transaction.interceptor.TransactionInterceptor.invoke(TransactionInterceptor.java:96)
03-Nov-2020 11:19:56         at org.springframework.aop.framework.ReflectiveMethodInvocation.proceed(ReflectiveMethodInvocation.java:179)
03-Nov-2020 11:19:56         at org.springframework.aop.framework.JdkDynamicAopProxy.invoke(JdkDynamicAopProxy.java:207)
03-Nov-2020 11:19:56         at com.sun.proxy.$Proxy73.getObs(Unknown Source)
03-Nov-2020 11:19:56         at sun.reflect.GeneratedMethodAccessor774.invoke(Unknown Source)
03-Nov-2020 11:19:56         at sun.reflect.DelegatingMethodAccessorImpl.invoke(DelegatingMethodAccessorImpl.java:43)
03-Nov-2020 11:19:56         at java.lang.reflect.Method.invoke(Method.java:498)
03-Nov-2020 11:19:56         at org.springframework.aop.support.AopUtils.invokeJoinpointUsingReflection(AopUtils.java:317)
03-Nov-2020 11:19:56         at org.springframework.aop.framework.ReflectiveMethodInvocation.invokeJoinpoint(ReflectiveMethodInvocation.java:190)
03-Nov-2020 11:19:56         at org.springframework.aop.framework.ReflectiveMethodInvocation.proceed(ReflectiveMethodInvocation.java:157)
03-Nov-2020 11:19:56         at org.openmrs.aop.LoggingAdvice.invoke(LoggingAdvice.java:121)
03-Nov-2020 11:19:56         at org.springframework.aop.framework.ReflectiveMethodInvocation.proceed(ReflectiveMethodInvocation.java:179)
03-Nov-2020 11:19:56         at org.springframework.aop.framework.adapter.MethodBeforeAdviceInterceptor.invoke(MethodBeforeAdviceInterceptor.java:52)
03-Nov-2020 11:19:56         at org.springframework.aop.framework.ReflectiveMethodInvocation.proceed(ReflectiveMethodInvocation.java:179)
03-Nov-2020 11:19:56         at org.springframework.aop.framework.adapter.MethodBeforeAdviceInterceptor.invoke(MethodBeforeAdviceInterceptor.java:52)
03-Nov-2020 11:19:56         at org.springframework.aop.framework.ReflectiveMethodInvocation.proceed(ReflectiveMethodInvocation.java:179)
03-Nov-2020 11:19:56         at org.springframework.aop.framework.JdkDynamicAopProxy.invoke(JdkDynamicAopProxy.java:207)
03-Nov-2020 11:19:56         at com.sun.proxy.$Proxy74.getObs(Unknown Source)
03-Nov-2020 11:19:56         at org.openmrs.api.impl.EncounterServiceImpl.saveEncounter(EncounterServiceImpl.java:214)
03-Nov-2020 11:19:56         at sun.reflect.GeneratedMethodAccessor1144.invoke(Unknown Source)
03-Nov-2020 11:19:56         at sun.reflect.DelegatingMethodAccessorImpl.invoke(DelegatingMethodAccessorImpl.java:43)
03-Nov-2020 11:19:56         at java.lang.reflect.Method.invoke(Method.java:498)
03-Nov-2020 11:19:56         at org.springframework.aop.support.AopUtils.invokeJoinpointUsingReflection(AopUtils.java:317)
03-Nov-2020 11:19:56         at org.springframework.aop.framework.ReflectiveMethodInvocation.invokeJoinpoint(ReflectiveMethodInvocation.java:190)
03-Nov-2020 11:19:56         at org.springframework.aop.framework.ReflectiveMethodInvocation.proceed(ReflectiveMethodInvocation.java:157)
03-Nov-2020 11:19:56         at org.springframework.transaction.interceptor.TransactionInterceptor$1.proceedWithInvocation(TransactionInterceptor.java:99)
03-Nov-2020 11:19:56         at org.springframework.transaction.interceptor.TransactionAspectSupport.invokeWithinTransaction(TransactionAspectSupport.java:281)
03-Nov-2020 11:19:56         at org.springframework.transaction.interceptor.TransactionInterceptor.invoke(TransactionInterceptor.java:96)
03-Nov-2020 11:19:56         at org.springframework.aop.framework.ReflectiveMethodInvocation.proceed(ReflectiveMethodInvocation.java:179)
03-Nov-2020 11:19:56         at org.springframework.aop.framework.JdkDynamicAopProxy.invoke(JdkDynamicAopProxy.java:207)
03-Nov-2020 11:19:56         at com.sun.proxy.$Proxy75.saveEncounter(Unknown Source)
03-Nov-2020 11:19:56         at sun.reflect.GeneratedMethodAccessor1144.invoke(Unknown Source)
03-Nov-2020 11:19:56         at sun.reflect.DelegatingMethodAccessorImpl.invoke(DelegatingMethodAccessorImpl.java:43)
03-Nov-2020 11:19:56         at java.lang.reflect.Method.invoke(Method.java:498)
03-Nov-2020 11:19:56         at org.springframework.aop.support.AopUtils.invokeJoinpointUsingReflection(AopUtils.java:317)
03-Nov-2020 11:19:56         at org.springframework.aop.framework.ReflectiveMethodInvocation.invokeJoinpoint(ReflectiveMethodInvocation.java:190)
03-Nov-2020 11:19:56         at org.springframework.aop.framework.ReflectiveMethodInvocation.proceed(ReflectiveMethodInvocation.java:157)
03-Nov-2020 11:19:56         at org.openmrs.aop.LoggingAdvice.invoke(LoggingAdvice.java:121)
03-Nov-2020 11:19:56         at org.springframework.aop.framework.ReflectiveMethodInvocation.proceed(ReflectiveMethodInvocation.java:179)
03-Nov-2020 11:19:56         at org.springframework.aop.framework.adapter.MethodBeforeAdviceInterceptor.invoke(MethodBeforeAdviceInterceptor.java:52)
03-Nov-2020 11:19:56         at org.springframework.aop.framework.ReflectiveMethodInvocation.proceed(ReflectiveMethodInvocation.java:179)
03-Nov-2020 11:19:56         at org.springframework.aop.framework.adapter.MethodBeforeAdviceInterceptor.invoke(MethodBeforeAdviceInterceptor.java:52)
03-Nov-2020 11:19:56         at org.springframework.aop.framework.ReflectiveMethodInvocation.proceed(ReflectiveMethodInvocation.java:179)
03-Nov-2020 11:19:56         at org.springframework.aop.framework.JdkDynamicAopProxy.invoke(JdkDynamicAopProxy.java:207)
03-Nov-2020 11:19:56         at com.sun.proxy.$Proxy76.saveEncounter(Unknown Source)
03-Nov-2020 11:19:56         at org.openmrs.api.EncounterServiceTest.saveEncounter_shouldSaveEncounterWithComplexObs(EncounterServiceTest.java:385)
03-Nov-2020 11:19:56         at sun.reflect.NativeMethodAccessorImpl.invoke0(Native Method)
03-Nov-2020 11:19:56         at sun.reflect.NativeMethodAccessorImpl.invoke(NativeMethodAccessorImpl.java:62)
03-Nov-2020 11:19:56         at sun.reflect.DelegatingMethodAccessorImpl.invoke(DelegatingMethodAccessorImpl.java:43)
03-Nov-2020 11:19:56         at java.lang.reflect.Method.invoke(Method.java:498)
03-Nov-2020 11:19:56         at org.junit.runners.model.FrameworkMethod$1.runReflectiveCall(FrameworkMethod.java:47)
03-Nov-2020 11:19:56         at org.junit.internal.runners.model.ReflectiveCallable.run(ReflectiveCallable.java:12)
03-Nov-2020 11:19:56         at org.junit.runners.model.FrameworkMethod.invokeExplosively(FrameworkMethod.java:44)
03-Nov-2020 11:19:56         at org.junit.internal.runners.statements.InvokeMethod.evaluate(InvokeMethod.java:17)
03-Nov-2020 11:19:56         at org.junit.internal.runners.statements.RunBefores.evaluate(RunBefores.java:26)
03-Nov-2020 11:19:56         at org.springframework.test.context.junit4.statements.RunBeforeTestMethodCallbacks.evaluate(RunBeforeTestMethodCallbacks.java:73)
03-Nov-2020 11:19:56         at org.junit.internal.runners.statements.RunAfters.evaluate(RunAfters.java:27)
03-Nov-2020 11:19:56         at org.springframework.test.context.junit4.statements.RunAfterTestMethodCallbacks.evaluate(RunAfterTestMethodCallbacks.java:82)
03-Nov-2020 11:19:56         at org.springframework.test.context.junit4.statements.SpringRepeat.evaluate(SpringRepeat.java:73)
03-Nov-2020 11:19:56         at org.junit.runners.ParentRunner.runLeaf(ParentRunner.java:271)
03-Nov-2020 11:19:56         at org.springframework.test.context.junit4.SpringJUnit4ClassRunner.runChild(SpringJUnit4ClassRunner.java:217)
03-Nov-2020 11:19:56         at org.springframework.test.context.junit4.SpringJUnit4ClassRunner.runChild(SpringJUnit4ClassRunner.java:83)
03-Nov-2020 11:19:56         at org.junit.runners.ParentRunner$3.run(ParentRunner.java:238)
03-Nov-2020 11:19:56         at org.junit.runners.ParentRunner$1.schedule(ParentRunner.java:63)
03-Nov-2020 11:19:56         at org.junit.runners.ParentRunner.runChildren(ParentRunner.java:236)
03-Nov-2020 11:19:56         at org.junit.runners.ParentRunner.access$000(ParentRunner.java:53)
03-Nov-2020 11:19:56         at org.junit.runners.ParentRunner$2.evaluate(ParentRunner.java:229)
03-Nov-2020 11:19:56         at org.springframework.test.context.junit4.statements.RunBeforeTestClassCallbacks.evaluate(RunBeforeTestClassCallbacks.java:61)
03-Nov-2020 11:19:56         at org.junit.internal.runners.statements.RunAfters.evaluate(RunAfters.java:27)
03-Nov-2020 11:19:56         at org.springframework.test.context.junit4.statements.RunAfterTestClassCallbacks.evaluate(RunAfterTestClassCallbacks.java:68)
03-Nov-2020 11:19:56         at org.junit.runners.ParentRunner.run(ParentRunner.java:309)
03-Nov-2020 11:19:56         at org.springframework.test.context.junit4.SpringJUnit4ClassRunner.run(SpringJUnit4ClassRunner.java:163)
03-Nov-2020 11:19:56         at org.apache.maven.surefire.junit4.JUnit4Provider.execute(JUnit4Provider.java:283)
03-Nov-2020 11:19:56         at org.apache.maven.surefire.junit4.JUnit4Provider.executeWithRerun(JUnit4Provider.java:173)
03-Nov-2020 11:19:56         at org.apache.maven.surefire.junit4.JUnit4Provider.executeTestSet(JUnit4Provider.java:153)
03-Nov-2020 11:19:56         at org.apache.maven.surefire.junit4.JUnit4Provider.invoke(JUnit4Provider.java:128)
03-Nov-2020 11:19:56         at org.apache.maven.surefire.booter.ForkedBooter.invokeProviderInSameClassLoader(ForkedBooter.java:203)
03-Nov-2020 11:19:56         at org.apache.maven.surefire.booter.ForkedBooter.runSuitesInProcess(ForkedBooter.java:155)
03-Nov-2020 11:19:56         at org.apache.maven.surefire.booter.ForkedBooter.main(ForkedBooter.java:103)
03-Nov-2020 11:19:56 ERROR - ImageHandler.getObs(96) |2020-11-03 11:19:56,067| Image /home/bamboo-agent/bamboo-agent/.agent_tmp/TRUNK-OC2-JOB1/appdir-for-unit-tests-54312797268382496/complex_obs/file1.jpg was not found
03-Nov-2020 11:19:56 java.io.FileNotFoundException: /home/bamboo-agent/bamboo-agent/.agent_tmp/TRUNK-OC2-JOB1/appdir-for-unit-tests-54312797268382496/complex_obs/file1.jpg (No such file or directory)
03-Nov-2020 11:19:56         at java.io.RandomAccessFile.open0(Native Method)
03-Nov-2020 11:19:56         at java.io.RandomAccessFile.open(RandomAccessFile.java:316)
03-Nov-2020 11:19:56         at java.io.RandomAccessFile.<init>(RandomAccessFile.java:243)
03-Nov-2020 11:19:56         at javax.imageio.stream.FileImageInputStream.<init>(FileImageInputStream.java:73)
03-Nov-2020 11:19:56         at org.openmrs.obs.handler.ImageHandler.getObs(ImageHandler.java:86)
03-Nov-2020 11:19:56         at org.openmrs.api.impl.ObsServiceImpl.getObs(ObsServiceImpl.java:254)
03-Nov-2020 11:19:56         at sun.reflect.GeneratedMethodAccessor774.invoke(Unknown Source)
03-Nov-2020 11:19:56         at sun.reflect.DelegatingMethodAccessorImpl.invoke(DelegatingMethodAccessorImpl.java:43)
03-Nov-2020 11:19:56         at java.lang.reflect.Method.invoke(Method.java:498)
03-Nov-2020 11:19:56         at org.springframework.aop.support.AopUtils.invokeJoinpointUsingReflection(AopUtils.java:317)
03-Nov-2020 11:19:56         at org.springframework.aop.framework.ReflectiveMethodInvocation.invokeJoinpoint(ReflectiveMethodInvocation.java:190)
03-Nov-2020 11:19:56         at org.springframework.aop.framework.ReflectiveMethodInvocation.proceed(ReflectiveMethodInvocation.java:157)
03-Nov-2020 11:19:56         at org.springframework.transaction.interceptor.TransactionInterceptor$1.proceedWithInvocation(TransactionInterceptor.java:99)
03-Nov-2020 11:19:56         at org.springframework.transaction.interceptor.TransactionAspectSupport.invokeWithinTransaction(TransactionAspectSupport.java:281)
03-Nov-2020 11:19:56         at org.springframework.transaction.interceptor.TransactionInterceptor.invoke(TransactionInterceptor.java:96)
03-Nov-2020 11:19:56         at org.springframework.aop.framework.ReflectiveMethodInvocation.proceed(ReflectiveMethodInvocation.java:179)
03-Nov-2020 11:19:56         at org.springframework.aop.framework.JdkDynamicAopProxy.invoke(JdkDynamicAopProxy.java:207)
03-Nov-2020 11:19:56         at com.sun.proxy.$Proxy73.getObs(Unknown Source)
03-Nov-2020 11:19:56         at sun.reflect.GeneratedMethodAccessor774.invoke(Unknown Source)
03-Nov-2020 11:19:56         at sun.reflect.DelegatingMethodAccessorImpl.invoke(DelegatingMethodAccessorImpl.java:43)
03-Nov-2020 11:19:56         at java.lang.reflect.Method.invoke(Method.java:498)
03-Nov-2020 11:19:56         at org.springframework.aop.support.AopUtils.invokeJoinpointUsingReflection(AopUtils.java:317)
03-Nov-2020 11:19:56         at org.springframework.aop.framework.ReflectiveMethodInvocation.invokeJoinpoint(ReflectiveMethodInvocation.java:190)
03-Nov-2020 11:19:56         at org.springframework.aop.framework.ReflectiveMethodInvocation.proceed(ReflectiveMethodInvocation.java:157)
03-Nov-2020 11:19:56         at org.openmrs.aop.LoggingAdvice.invoke(LoggingAdvice.java:121)
03-Nov-2020 11:19:56         at org.springframework.aop.framework.ReflectiveMethodInvocation.proceed(ReflectiveMethodInvocation.java:179)
03-Nov-2020 11:19:56         at org.springframework.aop.framework.adapter.MethodBeforeAdviceInterceptor.invoke(MethodBeforeAdviceInterceptor.java:52)
03-Nov-2020 11:19:56         at org.springframework.aop.framework.ReflectiveMethodInvocation.proceed(ReflectiveMethodInvocation.java:179)
03-Nov-2020 11:19:56         at org.springframework.aop.framework.adapter.MethodBeforeAdviceInterceptor.invoke(MethodBeforeAdviceInterceptor.java:52)
03-Nov-2020 11:19:56         at org.springframework.aop.framework.ReflectiveMethodInvocation.proceed(ReflectiveMethodInvocation.java:179)
03-Nov-2020 11:19:56         at org.springframework.aop.framework.JdkDynamicAopProxy.invoke(JdkDynamicAopProxy.java:207)
03-Nov-2020 11:19:56         at com.sun.proxy.$Proxy74.getObs(Unknown Source)
03-Nov-2020 11:19:56         at org.openmrs.api.impl.EncounterServiceImpl.saveEncounter(EncounterServiceImpl.java:214)
03-Nov-2020 11:19:56         at sun.reflect.GeneratedMethodAccessor1144.invoke(Unknown Source)
03-Nov-2020 11:19:56         at sun.reflect.DelegatingMethodAccessorImpl.invoke(DelegatingMethodAccessorImpl.java:43)
03-Nov-2020 11:19:56         at java.lang.reflect.Method.invoke(Method.java:498)
03-Nov-2020 11:19:56         at org.springframework.aop.support.AopUtils.invokeJoinpointUsingReflection(AopUtils.java:317)
03-Nov-2020 11:19:56         at org.springframework.aop.framework.ReflectiveMethodInvocation.invokeJoinpoint(ReflectiveMethodInvocation.java:190)
03-Nov-2020 11:19:56         at org.springframework.aop.framework.ReflectiveMethodInvocation.proceed(ReflectiveMethodInvocation.java:157)
03-Nov-2020 11:19:56         at org.springframework.transaction.interceptor.TransactionInterceptor$1.proceedWithInvocation(TransactionInterceptor.java:99)
03-Nov-2020 11:19:56         at org.springframework.transaction.interceptor.TransactionAspectSupport.invokeWithinTransaction(TransactionAspectSupport.java:281)
03-Nov-2020 11:19:56         at org.springframework.transaction.interceptor.TransactionInterceptor.invoke(TransactionInterceptor.java:96)
03-Nov-2020 11:19:56         at org.springframework.aop.framework.ReflectiveMethodInvocation.proceed(ReflectiveMethodInvocation.java:179)
03-Nov-2020 11:19:56         at org.springframework.aop.framework.JdkDynamicAopProxy.invoke(JdkDynamicAopProxy.java:207)
03-Nov-2020 11:19:56         at com.sun.proxy.$Proxy75.saveEncounter(Unknown Source)
03-Nov-2020 11:19:56         at sun.reflect.GeneratedMethodAccessor1144.invoke(Unknown Source)
03-Nov-2020 11:19:56         at sun.reflect.DelegatingMethodAccessorImpl.invoke(DelegatingMethodAccessorImpl.java:43)
03-Nov-2020 11:19:56         at java.lang.reflect.Method.invoke(Method.java:498)
03-Nov-2020 11:19:56         at org.springframework.aop.support.AopUtils.invokeJoinpointUsingReflection(AopUtils.java:317)
03-Nov-2020 11:19:56         at org.springframework.aop.framework.ReflectiveMethodInvocation.invokeJoinpoint(ReflectiveMethodInvocation.java:190)
03-Nov-2020 11:19:56         at org.springframework.aop.framework.ReflectiveMethodInvocation.proceed(ReflectiveMethodInvocation.java:157)
03-Nov-2020 11:19:56         at org.openmrs.aop.LoggingAdvice.invoke(LoggingAdvice.java:121)
03-Nov-2020 11:19:56         at org.springframework.aop.framework.ReflectiveMethodInvocation.proceed(ReflectiveMethodInvocation.java:179)
03-Nov-2020 11:19:56         at org.springframework.aop.framework.adapter.MethodBeforeAdviceInterceptor.invoke(MethodBeforeAdviceInterceptor.java:52)
03-Nov-2020 11:19:56         at org.springframework.aop.framework.ReflectiveMethodInvocation.proceed(ReflectiveMethodInvocation.java:179)
03-Nov-2020 11:19:56         at org.springframework.aop.framework.adapter.MethodBeforeAdviceInterceptor.invoke(MethodBeforeAdviceInterceptor.java:52)
03-Nov-2020 11:19:56         at org.springframework.aop.framework.ReflectiveMethodInvocation.proceed(ReflectiveMethodInvocation.java:179)
03-Nov-2020 11:19:56         at org.springframework.aop.framework.JdkDynamicAopProxy.invoke(JdkDynamicAopProxy.java:207)
03-Nov-2020 11:19:56         at com.sun.proxy.$Proxy76.saveEncounter(Unknown Source)
03-Nov-2020 11:19:56         at org.openmrs.api.EncounterServiceTest.saveEncounter_shouldSaveEncounterWithComplexObs(EncounterServiceTest.java:385)
03-Nov-2020 11:19:56         at sun.reflect.NativeMethodAccessorImpl.invoke0(Native Method)
03-Nov-2020 11:19:56         at sun.reflect.NativeMethodAccessorImpl.invoke(NativeMethodAccessorImpl.java:62)
03-Nov-2020 11:19:56         at sun.reflect.DelegatingMethodAccessorImpl.invoke(DelegatingMethodAccessorImpl.java:43)
03-Nov-2020 11:19:56         at java.lang.reflect.Method.invoke(Method.java:498)
03-Nov-2020 11:19:56         at org.junit.runners.model.FrameworkMethod$1.runReflectiveCall(FrameworkMethod.java:47)
03-Nov-2020 11:19:56         at org.junit.internal.runners.model.ReflectiveCallable.run(ReflectiveCallable.java:12)
03-Nov-2020 11:19:56         at org.junit.runners.model.FrameworkMethod.invokeExplosively(FrameworkMethod.java:44)
03-Nov-2020 11:19:56         at org.junit.internal.runners.statements.InvokeMethod.evaluate(InvokeMethod.java:17)
03-Nov-2020 11:19:56         at org.junit.internal.runners.statements.RunBefores.evaluate(RunBefores.java:26)
03-Nov-2020 11:19:56         at org.springframework.test.context.junit4.statements.RunBeforeTestMethodCallbacks.evaluate(RunBeforeTestMethodCallbacks.java:73)
03-Nov-2020 11:19:56         at org.junit.internal.runners.statements.RunAfters.evaluate(RunAfters.java:27)
03-Nov-2020 11:19:56         at org.springframework.test.context.junit4.statements.RunAfterTestMethodCallbacks.evaluate(RunAfterTestMethodCallbacks.java:82)
03-Nov-2020 11:19:56         at org.springframework.test.context.junit4.statements.SpringRepeat.evaluate(SpringRepeat.java:73)
03-Nov-2020 11:19:56         at org.junit.runners.ParentRunner.runLeaf(ParentRunner.java:271)
03-Nov-2020 11:19:56         at org.springframework.test.context.junit4.SpringJUnit4ClassRunner.runChild(SpringJUnit4ClassRunner.java:217)
03-Nov-2020 11:19:56         at org.springframework.test.context.junit4.SpringJUnit4ClassRunner.runChild(SpringJUnit4ClassRunner.java:83)
03-Nov-2020 11:19:56         at org.junit.runners.ParentRunner$3.run(ParentRunner.java:238)
03-Nov-2020 11:19:56         at org.junit.runners.ParentRunner$1.schedule(ParentRunner.java:63)
03-Nov-2020 11:19:56         at org.junit.runners.ParentRunner.runChildren(ParentRunner.java:236)
03-Nov-2020 11:19:56         at org.junit.runners.ParentRunner.access$000(ParentRunner.java:53)
03-Nov-2020 11:19:56         at org.junit.runners.ParentRunner$2.evaluate(ParentRunner.java:229)
03-Nov-2020 11:19:56         at org.springframework.test.context.junit4.statements.RunBeforeTestClassCallbacks.evaluate(RunBeforeTestClassCallbacks.java:61)
03-Nov-2020 11:19:56         at org.junit.internal.runners.statements.RunAfters.evaluate(RunAfters.java:27)
03-Nov-2020 11:19:56         at org.springframework.test.context.junit4.statements.RunAfterTestClassCallbacks.evaluate(RunAfterTestClassCallbacks.java:68)
03-Nov-2020 11:19:56         at org.junit.runners.ParentRunner.run(ParentRunner.java:309)
03-Nov-2020 11:19:56         at org.springframework.test.context.junit4.SpringJUnit4ClassRunner.run(SpringJUnit4ClassRunner.java:163)
03-Nov-2020 11:19:56         at org.apache.maven.surefire.junit4.JUnit4Provider.execute(JUnit4Provider.java:283)
03-Nov-2020 11:19:56         at org.apache.maven.surefire.junit4.JUnit4Provider.executeWithRerun(JUnit4Provider.java:173)
03-Nov-2020 11:19:56         at org.apache.maven.surefire.junit4.JUnit4Provider.executeTestSet(JUnit4Provider.java:153)
03-Nov-2020 11:19:56         at org.apache.maven.surefire.junit4.JUnit4Provider.invoke(JUnit4Provider.java:128)
03-Nov-2020 11:19:56         at org.apache.maven.surefire.booter.ForkedBooter.invokeProviderInSameClassLoader(ForkedBooter.java:203)
03-Nov-2020 11:19:56         at org.apache.maven.surefire.booter.ForkedBooter.runSuitesInProcess(ForkedBooter.java:155)
03-Nov-2020 11:19:56         at org.apache.maven.surefire.booter.ForkedBooter.main(ForkedBooter.java:103)
03-Nov-2020 11:20:00 Tests run: 141, Failures: 0, Errors: 0, Skipped: 2, Time elapsed: 5.373 sec - in org.openmrs.api.EncounterServiceTest
03-Nov-2020 11:20:00 Running org.openmrs.api.NoteServiceTest
03-Nov-2020 11:20:00 Tests run: 1, Failures: 0, Errors: 0, Skipped: 1, Time elapsed: 0 sec - in org.openmrs.api.NoteServiceTest
03-Nov-2020 11:20:00 Running org.openmrs.api.impl.SerializationServiceImplTest
03-Nov-2020 11:20:00 Tests run: 1, Failures: 0, Errors: 0, Skipped: 0, Time elapsed: 0.007 sec - in org.openmrs.api.impl.SerializationServiceImplTest
03-Nov-2020 11:20:00 Running org.openmrs.api.impl.ConceptServiceImplTest
03-Nov-2020 11:20:01 Tests run: 8, Failures: 0, Errors: 0, Skipped: 0, Time elapsed: 0.391 sec - in org.openmrs.api.impl.ConceptServiceImplTest
03-Nov-2020 11:20:01 Running org.openmrs.api.ProgramWorkflowServiceTest
03-Nov-2020 11:20:01 Tests run: 25, Failures: 0, Errors: 0, Skipped: 0, Time elapsed: 0.812 sec - in org.openmrs.api.ProgramWorkflowServiceTest
03-Nov-2020 11:20:01 Running org.openmrs.api.CohortServiceTest
03-Nov-2020 11:20:02 Tests run: 24, Failures: 0, Errors: 0, Skipped: 0, Time elapsed: 0.647 sec - in org.openmrs.api.CohortServiceTest
03-Nov-2020 11:20:02 Running org.openmrs.api.db.VisitDAOTest
03-Nov-2020 11:20:02 Tests run: 3, Failures: 0, Errors: 0, Skipped: 0, Time elapsed: 0.31 sec - in org.openmrs.api.db.VisitDAOTest
03-Nov-2020 11:20:02 Running org.openmrs.api.db.hibernate.ImmutableEntityInterceptorTest
03-Nov-2020 11:20:03 Tests run: 4, Failures: 0, Errors: 0, Skipped: 0, Time elapsed: 0.241 sec - in org.openmrs.api.db.hibernate.ImmutableEntityInterceptorTest
03-Nov-2020 11:20:03 Running org.openmrs.api.db.hibernate.HibernatePersonDAOTest
03-Nov-2020 11:20:03 Tests run: 41, Failures: 0, Errors: 0, Skipped: 0, Time elapsed: 0.859 sec - in org.openmrs.api.db.hibernate.HibernatePersonDAOTest
03-Nov-2020 11:20:03 Running org.openmrs.api.db.hibernate.DropMillisecondsHibernateInterceptorTest
03-Nov-2020 11:20:04 Tests run: 4, Failures: 0, Errors: 0, Skipped: 0, Time elapsed: 0.264 sec - in org.openmrs.api.db.hibernate.DropMillisecondsHibernateInterceptorTest
03-Nov-2020 11:20:04 Running org.openmrs.api.db.hibernate.ProviderDAOTest
03-Nov-2020 11:20:04 Tests run: 3, Failures: 0, Errors: 0, Skipped: 0, Time elapsed: 0.243 sec - in org.openmrs.api.db.hibernate.ProviderDAOTest
03-Nov-2020 11:20:04 Running org.openmrs.api.db.hibernate.HibernateConceptDAOTest
03-Nov-2020 11:20:05 Tests run: 11, Failures: 0, Errors: 0, Skipped: 0, Time elapsed: 1.277 sec - in org.openmrs.api.db.hibernate.HibernateConceptDAOTest
03-Nov-2020 11:20:05 Running org.openmrs.api.db.hibernate.HibernateLocationDAOTest
03-Nov-2020 11:20:05 Tests run: 3, Failures: 0, Errors: 0, Skipped: 0, Time elapsed: 0.244 sec - in org.openmrs.api.db.hibernate.HibernateLocationDAOTest
03-Nov-2020 11:20:05 Running org.openmrs.api.db.hibernate.HibernateProviderDAOTest
03-Nov-2020 11:20:06 Tests run: 3, Failures: 0, Errors: 0, Skipped: 0, Time elapsed: 0.293 sec - in org.openmrs.api.db.hibernate.HibernateProviderDAOTest
03-Nov-2020 11:20:06 Running org.openmrs.api.db.hibernate.PersonAttributeHelperTest
03-Nov-2020 11:20:06 Tests run: 5, Failures: 0, Errors: 0, Skipped: 0, Time elapsed: 0.285 sec - in org.openmrs.api.db.hibernate.PersonAttributeHelperTest
03-Nov-2020 11:20:06 Running org.openmrs.api.db.hibernate.HibernateOrderDAOTest
03-Nov-2020 11:20:06 Tests run: 1, Failures: 0, Errors: 0, Skipped: 0, Time elapsed: 0.211 sec - in org.openmrs.api.db.hibernate.HibernateOrderDAOTest
03-Nov-2020 11:20:06 Running org.openmrs.api.db.hibernate.PatientSearchCriteriaTest
03-Nov-2020 11:20:07 Tests run: 18, Failures: 0, Errors: 0, Skipped: 0, Time elapsed: 0.37 sec - in org.openmrs.api.db.hibernate.PatientSearchCriteriaTest
03-Nov-2020 11:20:07 Running org.openmrs.api.db.hibernate.HibernateObsDAOTest
03-Nov-2020 11:20:07 Tests run: 1, Failures: 0, Errors: 0, Skipped: 0, Time elapsed: 0.229 sec - in org.openmrs.api.db.hibernate.HibernateObsDAOTest
03-Nov-2020 11:20:07 Running org.openmrs.api.db.hibernate.AuditableInterceptorTest
03-Nov-2020 11:20:07 Tests run: 15, Failures: 0, Errors: 0, Skipped: 0, Time elapsed: 0.58 sec - in org.openmrs.api.db.hibernate.AuditableInterceptorTest
03-Nov-2020 11:20:07 Running org.openmrs.api.db.EncounterDAOTest
03-Nov-2020 11:20:08 Tests run: 4, Failures: 0, Errors: 0, Skipped: 0, Time elapsed: 0.382 sec - in org.openmrs.api.db.EncounterDAOTest
03-Nov-2020 11:20:08 Running org.openmrs.api.db.PatientDAOTest
03-Nov-2020 11:20:10 WARN - HibernatePatientDAO.getDuplicatePatientsSQLString(556) |2020-11-03 11:20:10,526| Unidentified attribute: abcDef
03-Nov-2020 11:20:14 WARN - HibernatePatientDAO.getDuplicatePatientsSQLString(556) |2020-11-03 11:20:14,895| Unidentified attribute: abcDef
03-Nov-2020 11:20:15 Tests run: 141, Failures: 0, Errors: 0, Skipped: 0, Time elapsed: 6.686 sec - in org.openmrs.api.db.PatientDAOTest
03-Nov-2020 11:20:15 Running org.openmrs.api.db.SerializedObjectDAOTest
03-Nov-2020 11:20:15 Tests run: 1, Failures: 0, Errors: 0, Skipped: 1, Time elapsed: 0 sec - in org.openmrs.api.db.SerializedObjectDAOTest
03-Nov-2020 11:20:15 Running org.openmrs.api.db.ProgramWorkflowDAOTest
03-Nov-2020 11:20:15 Tests run: 4, Failures: 0, Errors: 0, Skipped: 0, Time elapsed: 0.281 sec - in org.openmrs.api.db.ProgramWorkflowDAOTest
03-Nov-2020 11:20:15 Running org.openmrs.api.db.ConceptDAOTest
03-Nov-2020 11:20:15 Tests run: 13, Failures: 0, Errors: 0, Skipped: 2, Time elapsed: 0.39 sec - in org.openmrs.api.db.ConceptDAOTest
03-Nov-2020 11:20:15 Running org.openmrs.api.db.ContextDAOTest
03-Nov-2020 11:20:15 ERROR - HibernateContextDAO.authenticate(184) |2020-11-03 11:20:15,906| Unable to convert the global property security.allowedFailedLoginsBeforeLockoutto a valid integer. Using default value of 7
03-Nov-2020 11:20:15 ERROR - HibernateContextDAO.authenticate(184) |2020-11-03 11:20:15,916| Unable to convert the global property security.allowedFailedLoginsBeforeLockoutto a valid integer. Using default value of 7
03-Nov-2020 11:20:15 ERROR - HibernateContextDAO.authenticate(184) |2020-11-03 11:20:15,918| Unable to convert the global property security.allowedFailedLoginsBeforeLockoutto a valid integer. Using default value of 7
03-Nov-2020 11:20:15 ERROR - HibernateContextDAO.authenticate(184) |2020-11-03 11:20:15,919| Unable to convert the global property security.allowedFailedLoginsBeforeLockoutto a valid integer. Using default value of 7
03-Nov-2020 11:20:15 ERROR - HibernateContextDAO.authenticate(184) |2020-11-03 11:20:15,920| Unable to convert the global property security.allowedFailedLoginsBeforeLockoutto a valid integer. Using default value of 7
03-Nov-2020 11:20:15 ERROR - HibernateContextDAO.authenticate(184) |2020-11-03 11:20:15,920| Unable to convert the global property security.allowedFailedLoginsBeforeLockoutto a valid integer. Using default value of 7
03-Nov-2020 11:20:15 ERROR - HibernateContextDAO.authenticate(184) |2020-11-03 11:20:15,921| Unable to convert the global property security.allowedFailedLoginsBeforeLockoutto a valid integer. Using default value of 7
03-Nov-2020 11:20:15 ERROR - HibernateContextDAO.authenticate(184) |2020-11-03 11:20:15,922| Unable to convert the global property security.allowedFailedLoginsBeforeLockoutto a valid integer. Using default value of 7
03-Nov-2020 11:20:15 ERROR - HibernateContextDAO.authenticate(184) |2020-11-03 11:20:15,923| Unable to convert the global property security.allowedFailedLoginsBeforeLockoutto a valid integer. Using default value of 7
03-Nov-2020 11:20:15 ERROR - HibernateContextDAO.authenticate(184) |2020-11-03 11:20:15,924| Unable to convert the global property security.allowedFailedLoginsBeforeLockoutto a valid integer. Using default value of 7
03-Nov-2020 11:20:15 ERROR - HibernateContextDAO.authenticate(184) |2020-11-03 11:20:15,933| Unable to convert the global property security.allowedFailedLoginsBeforeLockoutto a valid integer. Using default value of 7
03-Nov-2020 11:20:15 ERROR - HibernateContextDAO.authenticate(184) |2020-11-03 11:20:15,941| Unable to convert the global property security.allowedFailedLoginsBeforeLockoutto a valid integer. Using default value of 7
03-Nov-2020 11:20:15 ERROR - HibernateContextDAO.authenticate(184) |2020-11-03 11:20:15,986| Unable to convert the global property security.allowedFailedLoginsBeforeLockoutto a valid integer. Using default value of 7
03-Nov-2020 11:20:15 ERROR - HibernateContextDAO.authenticate(184) |2020-11-03 11:20:15,987| Unable to convert the global property security.allowedFailedLoginsBeforeLockoutto a valid integer. Using default value of 7
03-Nov-2020 11:20:15 ERROR - HibernateContextDAO.authenticate(184) |2020-11-03 11:20:15,988| Unable to convert the global property security.allowedFailedLoginsBeforeLockoutto a valid integer. Using default value of 7
03-Nov-2020 11:20:15 ERROR - HibernateContextDAO.authenticate(184) |2020-11-03 11:20:15,992| Unable to convert the global property security.allowedFailedLoginsBeforeLockoutto a valid integer. Using default value of 7
03-Nov-2020 11:20:15 ERROR - HibernateContextDAO.authenticate(184) |2020-11-03 11:20:15,993| Unable to convert the global property security.allowedFailedLoginsBeforeLockoutto a valid integer. Using default value of 7
03-Nov-2020 11:20:15 ERROR - HibernateContextDAO.authenticate(184) |2020-11-03 11:20:15,993| Unable to convert the global property security.allowedFailedLoginsBeforeLockoutto a valid integer. Using default value of 7
03-Nov-2020 11:20:15 ERROR - HibernateContextDAO.authenticate(184) |2020-11-03 11:20:15,994| Unable to convert the global property security.allowedFailedLoginsBeforeLockoutto a valid integer. Using default value of 7
03-Nov-2020 11:20:16 ERROR - HibernateContextDAO.authenticate(184) |2020-11-03 11:20:16,002| Unable to convert the global property security.allowedFailedLoginsBeforeLockoutto a valid integer. Using default value of 7
03-Nov-2020 11:20:16 ERROR - HibernateContextDAO.authenticate(184) |2020-11-03 11:20:16,011| Unable to convert the global property security.allowedFailedLoginsBeforeLockoutto a valid integer. Using default value of 7
03-Nov-2020 11:20:16 Tests run: 21, Failures: 0, Errors: 0, Skipped: 0, Time elapsed: 0.431 sec - in org.openmrs.api.db.ContextDAOTest
03-Nov-2020 11:20:16 Running org.openmrs.api.db.PersonDAOTest
03-Nov-2020 11:20:16 Tests run: 3, Failures: 0, Errors: 0, Skipped: 0, Time elapsed: 0.267 sec - in org.openmrs.api.db.PersonDAOTest
03-Nov-2020 11:20:16 Running org.openmrs.api.db.UserDAOTest
03-Nov-2020 11:20:16 Tests run: 8, Failures: 0, Errors: 0, Skipped: 0, Time elapsed: 0.341 sec - in org.openmrs.api.db.UserDAOTest
03-Nov-2020 11:20:16 Running org.openmrs.api.OrderServiceTest
03-Nov-2020 11:20:19 Tests run: 169, Failures: 0, Errors: 0, Skipped: 3, Time elapsed: 2.438 sec - in org.openmrs.api.OrderServiceTest
03-Nov-2020 11:20:19 Running org.openmrs.api.PatientServiceTest
03-Nov-2020 11:20:24 Tests run: 163, Failures: 0, Errors: 0, Skipped: 2, Time elapsed: 5.568 sec - in org.openmrs.api.PatientServiceTest
03-Nov-2020 11:20:24 Running org.openmrs.api.OpenmrsServiceTest
03-Nov-2020 11:20:24 Tests run: 1, Failures: 0, Errors: 0, Skipped: 1, Time elapsed: 0.002 sec - in org.openmrs.api.OpenmrsServiceTest
03-Nov-2020 11:20:24 Running org.openmrs.api.handler.RequiredReasonVoidSaveHandlerTest
03-Nov-2020 11:20:25 Tests run: 5, Failures: 0, Errors: 0, Skipped: 0, Time elapsed: 0.284 sec - in org.openmrs.api.handler.RequiredReasonVoidSaveHandlerTest
03-Nov-2020 11:20:25 Running org.openmrs.api.handler.PersonVoidHandlerTest
03-Nov-2020 11:20:25 Tests run: 8, Failures: 0, Errors: 0, Skipped: 0, Time elapsed: 0.317 sec - in org.openmrs.api.handler.PersonVoidHandlerTest
03-Nov-2020 11:20:25 Running org.openmrs.api.handler.OpenmrsMetadataSaveHandlerTest
03-Nov-2020 11:20:25 Tests run: 2, Failures: 0, Errors: 0, Skipped: 0, Time elapsed: 0.002 sec - in org.openmrs.api.handler.OpenmrsMetadataSaveHandlerTest
03-Nov-2020 11:20:25 Running org.openmrs.api.handler.BaseUnretireHandlerTest
03-Nov-2020 11:20:25 Tests run: 6, Failures: 0, Errors: 0, Skipped: 0, Time elapsed: 0.002 sec - in org.openmrs.api.handler.BaseUnretireHandlerTest
03-Nov-2020 11:20:25 Running org.openmrs.api.handler.ExistingVisitAssignmentHandlerTest
03-Nov-2020 11:20:25 Tests run: 3, Failures: 0, Errors: 0, Skipped: 0, Time elapsed: 0.321 sec - in org.openmrs.api.handler.ExistingVisitAssignmentHandlerTest
03-Nov-2020 11:20:25 Running org.openmrs.api.handler.RequireVoidReasonVoidHandlerTest
03-Nov-2020 11:20:25 Tests run: 5, Failures: 0, Errors: 0, Skipped: 0, Time elapsed: 0.24 sec - in org.openmrs.api.handler.RequireVoidReasonVoidHandlerTest
03-Nov-2020 11:20:25 Running org.openmrs.api.handler.OpenmrsObjectSaveHandlerTest
03-Nov-2020 11:20:25 Tests run: 5, Failures: 0, Errors: 0, Skipped: 0, Time elapsed: 0.005 sec - in org.openmrs.api.handler.OpenmrsObjectSaveHandlerTest
03-Nov-2020 11:20:25 Running org.openmrs.api.handler.ConceptNameSaveHandlerTest
03-Nov-2020 11:20:26 Tests run: 4, Failures: 0, Errors: 0, Skipped: 0, Time elapsed: 0.293 sec - in org.openmrs.api.handler.ConceptNameSaveHandlerTest
03-Nov-2020 11:20:26 Running org.openmrs.api.handler.PatientDataVoidHandlerTest
03-Nov-2020 11:20:26 Tests run: 1, Failures: 0, Errors: 0, Skipped: 0, Time elapsed: 0.256 sec - in org.openmrs.api.handler.PatientDataVoidHandlerTest
03-Nov-2020 11:20:26 Running org.openmrs.api.handler.BaseVoidHandlerTest
03-Nov-2020 11:20:26 Tests run: 8, Failures: 0, Errors: 0, Skipped: 0, Time elapsed: 0.002 sec - in org.openmrs.api.handler.BaseVoidHandlerTest
03-Nov-2020 11:20:26 Running org.openmrs.api.handler.BaseRetireHandlerTest
03-Nov-2020 11:20:26 Tests run: 8, Failures: 0, Errors: 0, Skipped: 0, Time elapsed: 0.002 sec - in org.openmrs.api.handler.BaseRetireHandlerTest
03-Nov-2020 11:20:26 Running org.openmrs.api.handler.ExistingOrNewVisitAssignmentHandlerTest
03-Nov-2020 11:20:26 Tests run: 5, Failures: 0, Errors: 0, Skipped: 0, Time elapsed: 0.459 sec - in org.openmrs.api.handler.ExistingOrNewVisitAssignmentHandlerTest
03-Nov-2020 11:20:26 Running org.openmrs.api.handler.PatientDataUnvoidHandlerTest
03-Nov-2020 11:20:29 Tests run: 2, Failures: 0, Errors: 0, Skipped: 0, Time elapsed: 2.228 sec - in org.openmrs.api.handler.PatientDataUnvoidHandlerTest
03-Nov-2020 11:20:29 Running org.openmrs.api.handler.BaseUnvoidHandlerTest
03-Nov-2020 11:20:29 Tests run: 6, Failures: 0, Errors: 0, Skipped: 0, Time elapsed: 0.002 sec - in org.openmrs.api.handler.BaseUnvoidHandlerTest
03-Nov-2020 11:20:29 Running org.openmrs.api.handler.PersonUnvoidHandlerTest
03-Nov-2020 11:20:29 Tests run: 6, Failures: 0, Errors: 0, Skipped: 0, Time elapsed: 0.002 sec - in org.openmrs.api.handler.PersonUnvoidHandlerTest
03-Nov-2020 11:20:29 Running org.openmrs.api.UserServiceTest
03-Nov-2020 11:20:31 Tests run: 85, Failures: 0, Errors: 0, Skipped: 1, Time elapsed: 2.798 sec - in org.openmrs.api.UserServiceTest
03-Nov-2020 11:20:31 Running org.openmrs.api.context.ContextTest
03-Nov-2020 11:20:32 Tests run: 16, Failures: 0, Errors: 0, Skipped: 0, Time elapsed: 0.344 sec - in org.openmrs.api.context.ContextTest
03-Nov-2020 11:20:32 Running org.openmrs.api.context.ContextWithModuleTest
03-Nov-2020 11:20:32 Tests run: 1, Failures: 0, Errors: 0, Skipped: 0, Time elapsed: 0.298 sec - in org.openmrs.api.context.ContextWithModuleTest
03-Nov-2020 11:20:32 Running org.openmrs.api.context.DaemonTest
03-Nov-2020 11:20:32 Tests run: 7, Failures: 0, Errors: 0, Skipped: 0, Time elapsed: 0.351 sec - in org.openmrs.api.context.DaemonTest
03-Nov-2020 11:20:32 Running org.openmrs.api.ObsServiceTest
03-Nov-2020 11:20:33 ERROR - ImageHandler.getObs(79) |2020-11-03 11:20:33,891| Trying to read file: /home/bamboo-agent/bamboo-agent/.agent_tmp/TRUNK-OC2-JOB1/appdir-for-unit-tests-5347025513283575257/complex_obs/openmrs_logo_small.gif
03-Nov-2020 11:20:33 javax.imageio.IIOException: Can't read input file!
03-Nov-2020 11:20:33         at javax.imageio.ImageIO.read(ImageIO.java:1302)
03-Nov-2020 11:20:33         at org.openmrs.obs.handler.ImageHandler.getObs(ImageHandler.java:76)
03-Nov-2020 11:20:33         at org.openmrs.api.impl.ObsServiceImpl.getComplexObs(ObsServiceImpl.java:480)
03-Nov-2020 11:20:33         at sun.reflect.NativeMethodAccessorImpl.invoke0(Native Method)
03-Nov-2020 11:20:33         at sun.reflect.NativeMethodAccessorImpl.invoke(NativeMethodAccessorImpl.java:62)
03-Nov-2020 11:20:33         at sun.reflect.DelegatingMethodAccessorImpl.invoke(DelegatingMethodAccessorImpl.java:43)
03-Nov-2020 11:20:33         at java.lang.reflect.Method.invoke(Method.java:498)
03-Nov-2020 11:20:33         at org.springframework.aop.support.AopUtils.invokeJoinpointUsingReflection(AopUtils.java:317)
03-Nov-2020 11:20:33         at org.springframework.aop.framework.ReflectiveMethodInvocation.invokeJoinpoint(ReflectiveMethodInvocation.java:190)
03-Nov-2020 11:20:33         at org.springframework.aop.framework.ReflectiveMethodInvocation.proceed(ReflectiveMethodInvocation.java:157)
03-Nov-2020 11:20:33         at org.springframework.transaction.interceptor.TransactionInterceptor$1.proceedWithInvocation(TransactionInterceptor.java:99)
03-Nov-2020 11:20:33         at org.springframework.transaction.interceptor.TransactionAspectSupport.invokeWithinTransaction(TransactionAspectSupport.java:281)
03-Nov-2020 11:20:33         at org.springframework.transaction.interceptor.TransactionInterceptor.invoke(TransactionInterceptor.java:96)
03-Nov-2020 11:20:33         at org.springframework.aop.framework.ReflectiveMethodInvocation.proceed(ReflectiveMethodInvocation.java:179)
03-Nov-2020 11:20:33         at org.springframework.aop.framework.JdkDynamicAopProxy.invoke(JdkDynamicAopProxy.java:207)
03-Nov-2020 11:20:33         at com.sun.proxy.$Proxy73.getComplexObs(Unknown Source)
03-Nov-2020 11:20:33         at sun.reflect.NativeMethodAccessorImpl.invoke0(Native Method)
03-Nov-2020 11:20:33         at sun.reflect.NativeMethodAccessorImpl.invoke(NativeMethodAccessorImpl.java:62)
03-Nov-2020 11:20:33         at sun.reflect.DelegatingMethodAccessorImpl.invoke(DelegatingMethodAccessorImpl.java:43)
03-Nov-2020 11:20:33         at java.lang.reflect.Method.invoke(Method.java:498)
03-Nov-2020 11:20:33         at org.springframework.aop.support.AopUtils.invokeJoinpointUsingReflection(AopUtils.java:317)
03-Nov-2020 11:20:33         at org.springframework.aop.framework.ReflectiveMethodInvocation.invokeJoinpoint(ReflectiveMethodInvocation.java:190)
03-Nov-2020 11:20:33         at org.springframework.aop.framework.ReflectiveMethodInvocation.proceed(ReflectiveMethodInvocation.java:157)
03-Nov-2020 11:20:33         at org.openmrs.aop.LoggingAdvice.invoke(LoggingAdvice.java:121)
03-Nov-2020 11:20:33         at org.springframework.aop.framework.ReflectiveMethodInvocation.proceed(ReflectiveMethodInvocation.java:179)
03-Nov-2020 11:20:33         at org.springframework.aop.framework.adapter.MethodBeforeAdviceInterceptor.invoke(MethodBeforeAdviceInterceptor.java:52)
03-Nov-2020 11:20:33         at org.springframework.aop.framework.ReflectiveMethodInvocation.proceed(ReflectiveMethodInvocation.java:179)
03-Nov-2020 11:20:33         at org.springframework.aop.framework.adapter.MethodBeforeAdviceInterceptor.invoke(MethodBeforeAdviceInterceptor.java:52)
03-Nov-2020 11:20:33         at org.springframework.aop.framework.ReflectiveMethodInvocation.proceed(ReflectiveMethodInvocation.java:179)
03-Nov-2020 11:20:33         at org.springframework.aop.framework.JdkDynamicAopProxy.invoke(JdkDynamicAopProxy.java:207)
03-Nov-2020 11:20:33         at com.sun.proxy.$Proxy74.getComplexObs(Unknown Source)
03-Nov-2020 11:20:33         at org.openmrs.api.ObsServiceTest.purgeObs_shouldDeleteTheGivenObsFromTheDatabase(ObsServiceTest.java:1353)
03-Nov-2020 11:20:33         at sun.reflect.NativeMethodAccessorImpl.invoke0(Native Method)
03-Nov-2020 11:20:33         at sun.reflect.NativeMethodAccessorImpl.invoke(NativeMethodAccessorImpl.java:62)
03-Nov-2020 11:20:33         at sun.reflect.DelegatingMethodAccessorImpl.invoke(DelegatingMethodAccessorImpl.java:43)
03-Nov-2020 11:20:33         at java.lang.reflect.Method.invoke(Method.java:498)
03-Nov-2020 11:20:33         at org.junit.runners.model.FrameworkMethod$1.runReflectiveCall(FrameworkMethod.java:47)
03-Nov-2020 11:20:33         at org.junit.internal.runners.model.ReflectiveCallable.run(ReflectiveCallable.java:12)
03-Nov-2020 11:20:33         at org.junit.runners.model.FrameworkMethod.invokeExplosively(FrameworkMethod.java:44)
03-Nov-2020 11:20:33         at org.junit.internal.runners.statements.InvokeMethod.evaluate(InvokeMethod.java:17)
03-Nov-2020 11:20:33         at org.junit.internal.runners.statements.RunBefores.evaluate(RunBefores.java:26)
03-Nov-2020 11:20:33         at org.springframework.test.context.junit4.statements.RunBeforeTestMethodCallbacks.evaluate(RunBeforeTestMethodCallbacks.java:73)
03-Nov-2020 11:20:33         at org.junit.internal.runners.statements.RunAfters.evaluate(RunAfters.java:27)
03-Nov-2020 11:20:33         at org.springframework.test.context.junit4.statements.RunAfterTestMethodCallbacks.evaluate(RunAfterTestMethodCallbacks.java:82)
03-Nov-2020 11:20:33         at org.junit.rules.ExpectedException$ExpectedExceptionStatement.evaluate(ExpectedException.java:168)
03-Nov-2020 11:20:33         at org.junit.rules.RunRules.evaluate(RunRules.java:20)
03-Nov-2020 11:20:33         at org.springframework.test.context.junit4.statements.SpringRepeat.evaluate(SpringRepeat.java:73)
03-Nov-2020 11:20:33         at org.junit.runners.ParentRunner.runLeaf(ParentRunner.java:271)
03-Nov-2020 11:20:33         at org.springframework.test.context.junit4.SpringJUnit4ClassRunner.runChild(SpringJUnit4ClassRunner.java:217)
03-Nov-2020 11:20:33         at org.springframework.test.context.junit4.SpringJUnit4ClassRunner.runChild(SpringJUnit4ClassRunner.java:83)
03-Nov-2020 11:20:33         at org.junit.runners.ParentRunner$3.run(ParentRunner.java:238)
03-Nov-2020 11:20:33         at org.junit.runners.ParentRunner$1.schedule(ParentRunner.java:63)
03-Nov-2020 11:20:33         at org.junit.runners.ParentRunner.runChildren(ParentRunner.java:236)
03-Nov-2020 11:20:33         at org.junit.runners.ParentRunner.access$000(ParentRunner.java:53)
03-Nov-2020 11:20:33         at org.junit.runners.ParentRunner$2.evaluate(ParentRunner.java:229)
03-Nov-2020 11:20:33         at org.springframework.test.context.junit4.statements.RunBeforeTestClassCallbacks.evaluate(RunBeforeTestClassCallbacks.java:61)
03-Nov-2020 11:20:33         at org.junit.internal.runners.statements.RunAfters.evaluate(RunAfters.java:27)
03-Nov-2020 11:20:33         at org.springframework.test.context.junit4.statements.RunAfterTestClassCallbacks.evaluate(RunAfterTestClassCallbacks.java:68)
03-Nov-2020 11:20:33         at org.junit.runners.ParentRunner.run(ParentRunner.java:309)
03-Nov-2020 11:20:33         at org.springframework.test.context.junit4.SpringJUnit4ClassRunner.run(SpringJUnit4ClassRunner.java:163)
03-Nov-2020 11:20:33         at org.apache.maven.surefire.junit4.JUnit4Provider.execute(JUnit4Provider.java:283)
03-Nov-2020 11:20:33         at org.apache.maven.surefire.junit4.JUnit4Provider.executeWithRerun(JUnit4Provider.java:173)
03-Nov-2020 11:20:33         at org.apache.maven.surefire.junit4.JUnit4Provider.executeTestSet(JUnit4Provider.java:153)
03-Nov-2020 11:20:33         at org.apache.maven.surefire.junit4.JUnit4Provider.invoke(JUnit4Provider.java:128)
03-Nov-2020 11:20:33         at org.apache.maven.surefire.booter.ForkedBooter.invokeProviderInSameClassLoader(ForkedBooter.java:203)
03-Nov-2020 11:20:33         at org.apache.maven.surefire.booter.ForkedBooter.runSuitesInProcess(ForkedBooter.java:155)
03-Nov-2020 11:20:33         at org.apache.maven.surefire.booter.ForkedBooter.main(ForkedBooter.java:103)
03-Nov-2020 11:20:33 ERROR - ImageHandler.getObs(96) |2020-11-03 11:20:33,896| Image /home/bamboo-agent/bamboo-agent/.agent_tmp/TRUNK-OC2-JOB1/appdir-for-unit-tests-5347025513283575257/complex_obs/openmrs_logo_small.gif was not found
03-Nov-2020 11:20:33 java.io.FileNotFoundException: /home/bamboo-agent/bamboo-agent/.agent_tmp/TRUNK-OC2-JOB1/appdir-for-unit-tests-5347025513283575257/complex_obs/openmrs_logo_small.gif (No such file or directory)
03-Nov-2020 11:20:33         at java.io.RandomAccessFile.open0(Native Method)
03-Nov-2020 11:20:33         at java.io.RandomAccessFile.open(RandomAccessFile.java:316)
03-Nov-2020 11:20:33         at java.io.RandomAccessFile.<init>(RandomAccessFile.java:243)
03-Nov-2020 11:20:33         at javax.imageio.stream.FileImageInputStream.<init>(FileImageInputStream.java:73)
03-Nov-2020 11:20:33         at org.openmrs.obs.handler.ImageHandler.getObs(ImageHandler.java:86)
03-Nov-2020 11:20:33         at org.openmrs.api.impl.ObsServiceImpl.getComplexObs(ObsServiceImpl.java:480)
03-Nov-2020 11:20:33         at sun.reflect.NativeMethodAccessorImpl.invoke0(Native Method)
03-Nov-2020 11:20:33         at sun.reflect.NativeMethodAccessorImpl.invoke(NativeMethodAccessorImpl.java:62)
03-Nov-2020 11:20:33         at sun.reflect.DelegatingMethodAccessorImpl.invoke(DelegatingMethodAccessorImpl.java:43)
03-Nov-2020 11:20:33         at java.lang.reflect.Method.invoke(Method.java:498)
03-Nov-2020 11:20:33         at org.springframework.aop.support.AopUtils.invokeJoinpointUsingReflection(AopUtils.java:317)
03-Nov-2020 11:20:33         at org.springframework.aop.framework.ReflectiveMethodInvocation.invokeJoinpoint(ReflectiveMethodInvocation.java:190)
03-Nov-2020 11:20:33         at org.springframework.aop.framework.ReflectiveMethodInvocation.proceed(ReflectiveMethodInvocation.java:157)
03-Nov-2020 11:20:33         at org.springframework.transaction.interceptor.TransactionInterceptor$1.proceedWithInvocation(TransactionInterceptor.java:99)
03-Nov-2020 11:20:33         at org.springframework.transaction.interceptor.TransactionAspectSupport.invokeWithinTransaction(TransactionAspectSupport.java:281)
03-Nov-2020 11:20:33         at org.springframework.transaction.interceptor.TransactionInterceptor.invoke(TransactionInterceptor.java:96)
03-Nov-2020 11:20:33         at org.springframework.aop.framework.ReflectiveMethodInvocation.proceed(ReflectiveMethodInvocation.java:179)
03-Nov-2020 11:20:33         at org.springframework.aop.framework.JdkDynamicAopProxy.invoke(JdkDynamicAopProxy.java:207)
03-Nov-2020 11:20:33         at com.sun.proxy.$Proxy73.getComplexObs(Unknown Source)
03-Nov-2020 11:20:33         at sun.reflect.NativeMethodAccessorImpl.invoke0(Native Method)
03-Nov-2020 11:20:33         at sun.reflect.NativeMethodAccessorImpl.invoke(NativeMethodAccessorImpl.java:62)
03-Nov-2020 11:20:33         at sun.reflect.DelegatingMethodAccessorImpl.invoke(DelegatingMethodAccessorImpl.java:43)
03-Nov-2020 11:20:33         at java.lang.reflect.Method.invoke(Method.java:498)
03-Nov-2020 11:20:33         at org.springframework.aop.support.AopUtils.invokeJoinpointUsingReflection(AopUtils.java:317)
03-Nov-2020 11:20:33         at org.springframework.aop.framework.ReflectiveMethodInvocation.invokeJoinpoint(ReflectiveMethodInvocation.java:190)
03-Nov-2020 11:20:33         at org.springframework.aop.framework.ReflectiveMethodInvocation.proceed(ReflectiveMethodInvocation.java:157)
03-Nov-2020 11:20:33         at org.openmrs.aop.LoggingAdvice.invoke(LoggingAdvice.java:121)
03-Nov-2020 11:20:33         at org.springframework.aop.framework.ReflectiveMethodInvocation.proceed(ReflectiveMethodInvocation.java:179)
03-Nov-2020 11:20:33         at org.springframework.aop.framework.adapter.MethodBeforeAdviceInterceptor.invoke(MethodBeforeAdviceInterceptor.java:52)
03-Nov-2020 11:20:33         at org.springframework.aop.framework.ReflectiveMethodInvocation.proceed(ReflectiveMethodInvocation.java:179)
03-Nov-2020 11:20:33         at org.springframework.aop.framework.adapter.MethodBeforeAdviceInterceptor.invoke(MethodBeforeAdviceInterceptor.java:52)
03-Nov-2020 11:20:33         at org.springframework.aop.framework.ReflectiveMethodInvocation.proceed(ReflectiveMethodInvocation.java:179)
03-Nov-2020 11:20:33         at org.springframework.aop.framework.JdkDynamicAopProxy.invoke(JdkDynamicAopProxy.java:207)
03-Nov-2020 11:20:33         at com.sun.proxy.$Proxy74.getComplexObs(Unknown Source)
03-Nov-2020 11:20:33         at org.openmrs.api.ObsServiceTest.purgeObs_shouldDeleteTheGivenObsFromTheDatabase(ObsServiceTest.java:1353)
03-Nov-2020 11:20:33         at sun.reflect.NativeMethodAccessorImpl.invoke0(Native Method)
03-Nov-2020 11:20:33         at sun.reflect.NativeMethodAccessorImpl.invoke(NativeMethodAccessorImpl.java:62)
03-Nov-2020 11:20:33         at sun.reflect.DelegatingMethodAccessorImpl.invoke(DelegatingMethodAccessorImpl.java:43)
03-Nov-2020 11:20:33         at java.lang.reflect.Method.invoke(Method.java:498)
03-Nov-2020 11:20:33         at org.junit.runners.model.FrameworkMethod$1.runReflectiveCall(FrameworkMethod.java:47)
03-Nov-2020 11:20:33         at org.junit.internal.runners.model.ReflectiveCallable.run(ReflectiveCallable.java:12)
03-Nov-2020 11:20:33         at org.junit.runners.model.FrameworkMethod.invokeExplosively(FrameworkMethod.java:44)
03-Nov-2020 11:20:33         at org.junit.internal.runners.statements.InvokeMethod.evaluate(InvokeMethod.java:17)
03-Nov-2020 11:20:33         at org.junit.internal.runners.statements.RunBefores.evaluate(RunBefores.java:26)
03-Nov-2020 11:20:33         at org.springframework.test.context.junit4.statements.RunBeforeTestMethodCallbacks.evaluate(RunBeforeTestMethodCallbacks.java:73)
03-Nov-2020 11:20:33         at org.junit.internal.runners.statements.RunAfters.evaluate(RunAfters.java:27)
03-Nov-2020 11:20:33         at org.springframework.test.context.junit4.statements.RunAfterTestMethodCallbacks.evaluate(RunAfterTestMethodCallbacks.java:82)
03-Nov-2020 11:20:33         at org.junit.rules.ExpectedException$ExpectedExceptionStatement.evaluate(ExpectedException.java:168)
03-Nov-2020 11:20:33         at org.junit.rules.RunRules.evaluate(RunRules.java:20)
03-Nov-2020 11:20:33         at org.springframework.test.context.junit4.statements.SpringRepeat.evaluate(SpringRepeat.java:73)
03-Nov-2020 11:20:33         at org.junit.runners.ParentRunner.runLeaf(ParentRunner.java:271)
03-Nov-2020 11:20:33         at org.springframework.test.context.junit4.SpringJUnit4ClassRunner.runChild(SpringJUnit4ClassRunner.java:217)
03-Nov-2020 11:20:33         at org.springframework.test.context.junit4.SpringJUnit4ClassRunner.runChild(SpringJUnit4ClassRunner.java:83)
03-Nov-2020 11:20:33         at org.junit.runners.ParentRunner$3.run(ParentRunner.java:238)
03-Nov-2020 11:20:33         at org.junit.runners.ParentRunner$1.schedule(ParentRunner.java:63)
03-Nov-2020 11:20:33         at org.junit.runners.ParentRunner.runChildren(ParentRunner.java:236)
03-Nov-2020 11:20:33         at org.junit.runners.ParentRunner.access$000(ParentRunner.java:53)
03-Nov-2020 11:20:33         at org.junit.runners.ParentRunner$2.evaluate(ParentRunner.java:229)
03-Nov-2020 11:20:33         at org.springframework.test.context.junit4.statements.RunBeforeTestClassCallbacks.evaluate(RunBeforeTestClassCallbacks.java:61)
03-Nov-2020 11:20:33         at org.junit.internal.runners.statements.RunAfters.evaluate(RunAfters.java:27)
03-Nov-2020 11:20:33         at org.springframework.test.context.junit4.statements.RunAfterTestClassCallbacks.evaluate(RunAfterTestClassCallbacks.java:68)
03-Nov-2020 11:20:33         at org.junit.runners.ParentRunner.run(ParentRunner.java:309)
03-Nov-2020 11:20:33         at org.springframework.test.context.junit4.SpringJUnit4ClassRunner.run(SpringJUnit4ClassRunner.java:163)
03-Nov-2020 11:20:33         at org.apache.maven.surefire.junit4.JUnit4Provider.execute(JUnit4Provider.java:283)
03-Nov-2020 11:20:33         at org.apache.maven.surefire.junit4.JUnit4Provider.executeWithRerun(JUnit4Provider.java:173)
03-Nov-2020 11:20:33         at org.apache.maven.surefire.junit4.JUnit4Provider.executeTestSet(JUnit4Provider.java:153)
03-Nov-2020 11:20:33         at org.apache.maven.surefire.junit4.JUnit4Provider.invoke(JUnit4Provider.java:128)
03-Nov-2020 11:20:33         at org.apache.maven.surefire.booter.ForkedBooter.invokeProviderInSameClassLoader(ForkedBooter.java:203)
03-Nov-2020 11:20:33         at org.apache.maven.surefire.booter.ForkedBooter.runSuitesInProcess(ForkedBooter.java:155)
03-Nov-2020 11:20:33         at org.apache.maven.surefire.booter.ForkedBooter.main(ForkedBooter.java:103)
03-Nov-2020 11:20:35 Tests run: 75, Failures: 0, Errors: 0, Skipped: 0, Time elapsed: 2.103 sec - in org.openmrs.api.ObsServiceTest
03-Nov-2020 11:20:35 Running org.openmrs.api.ConceptServiceTest
03-Nov-2020 11:21:02 Tests run: 236, Failures: 0, Errors: 0, Skipped: 1, Time elapsed: 27.573 sec - in org.openmrs.api.ConceptServiceTest
03-Nov-2020 11:21:02 Running org.openmrs.api.PatientServiceAllergyTest
03-Nov-2020 11:21:03 Tests run: 16, Failures: 0, Errors: 0, Skipped: 0, Time elapsed: 0.584 sec - in org.openmrs.api.PatientServiceAllergyTest
03-Nov-2020 11:21:03 Running org.openmrs.api.DatatypeServiceTest
03-Nov-2020 11:21:03 Tests run: 2, Failures: 0, Errors: 0, Skipped: 0, Time elapsed: 0.289 sec - in org.openmrs.api.DatatypeServiceTest
03-Nov-2020 11:21:03 Running org.openmrs.api.ProgramWorkflowServiceUnitTest
03-Nov-2020 11:21:03 Tests run: 3, Failures: 0, Errors: 0, Skipped: 0, Time elapsed: 0.028 sec - in org.openmrs.api.ProgramWorkflowServiceUnitTest
03-Nov-2020 11:21:03 Running org.openmrs.api.VisitServiceTest
03-Nov-2020 11:21:04 ERROR - AbstractBatchImpl.clearBatch(183) |2020-11-03 11:21:04,203| HHH000352: Unable to release batch statement...
03-Nov-2020 11:21:04 Tests run: 60, Failures: 0, Errors: 0, Skipped: 0, Time elapsed: 0.751 sec - in org.openmrs.api.VisitServiceTest
03-Nov-2020 11:21:04 Running org.openmrs.order.OrderUtilTest
03-Nov-2020 11:21:04 Tests run: 15, Failures: 0, Errors: 0, Skipped: 0, Time elapsed: 0.004 sec - in org.openmrs.order.OrderUtilTest
03-Nov-2020 11:21:04 Running org.openmrs.PatientProgramTest
03-Nov-2020 11:21:04 Tests run: 2, Failures: 0, Errors: 0, Skipped: 0, Time elapsed: 0.001 sec - in org.openmrs.PatientProgramTest
03-Nov-2020 11:21:04 Running org.openmrs.PatientStateTest
03-Nov-2020 11:21:04 Tests run: 13, Failures: 0, Errors: 0, Skipped: 0, Time elapsed: 0.003 sec - in org.openmrs.PatientStateTest
03-Nov-2020 11:21:04 Running org.openmrs.attribute.AttributeIntegrationTest
03-Nov-2020 11:21:04 Tests run: 1, Failures: 0, Errors: 0, Skipped: 0, Time elapsed: 0.333 sec - in org.openmrs.attribute.AttributeIntegrationTest
03-Nov-2020 11:21:04 Running org.openmrs.EncounterRoleTest
03-Nov-2020 11:21:04 Tests run: 1, Failures: 0, Errors: 0, Skipped: 0, Time elapsed: 0.001 sec - in org.openmrs.EncounterRoleTest
03-Nov-2020 11:21:04 Running org.openmrs.ProviderTest
03-Nov-2020 11:21:04 Tests run: 2, Failures: 0, Errors: 0, Skipped: 0, Time elapsed: 0 sec - in org.openmrs.ProviderTest
03-Nov-2020 11:21:04 Running org.openmrs.serialization.SimpleXStreamSerializerTest
03-Nov-2020 11:21:04 Tests run: 5, Failures: 0, Errors: 0, Skipped: 0, Time elapsed: 0.02 sec - in org.openmrs.serialization.SimpleXStreamSerializerTest
03-Nov-2020 11:21:04 Running org.openmrs.serialization.JavaSerializationTest
03-Nov-2020 11:21:04 Tests run: 2, Failures: 0, Errors: 0, Skipped: 0, Time elapsed: 0.047 sec - in org.openmrs.serialization.JavaSerializationTest
03-Nov-2020 11:21:04 Running org.openmrs.BaseCustomizableMetadataTest
03-Nov-2020 11:21:05 Tests run: 2, Failures: 0, Errors: 0, Skipped: 0, Time elapsed: 0.316 sec - in org.openmrs.BaseCustomizableMetadataTest
03-Nov-2020 11:21:05 Running org.openmrs.UserTest
03-Nov-2020 11:21:05 Tests run: 9, Failures: 0, Errors: 0, Skipped: 0, Time elapsed: 0.004 sec - in org.openmrs.UserTest
03-Nov-2020 11:21:05 Running org.openmrs.logic.result.EmptyResultTest
03-Nov-2020 11:21:05 Tests run: 2, Failures: 0, Errors: 0, Skipped: 0, Time elapsed: 0.004 sec - in org.openmrs.logic.result.EmptyResultTest
03-Nov-2020 11:21:05 Running org.openmrs.logic.result.ResultTest
03-Nov-2020 11:21:05 Tests run: 17, Failures: 0, Errors: 0, Skipped: 0, Time elapsed: 0.013 sec - in org.openmrs.logic.result.ResultTest
03-Nov-2020 11:21:05 Running org.openmrs.PatientTest
03-Nov-2020 11:21:05 Tests run: 8, Failures: 0, Errors: 0, Skipped: 0, Time elapsed: 0.007 sec - in org.openmrs.PatientTest
03-Nov-2020 11:21:05 Running org.openmrs.notification.db.hibernate.HibernateAlertDAOTest
03-Nov-2020 11:21:05 Tests run: 1, Failures: 0, Errors: 0, Skipped: 0, Time elapsed: 0.324 sec - in org.openmrs.notification.db.hibernate.HibernateAlertDAOTest
03-Nov-2020 11:21:05 Running org.openmrs.notification.AlertServiceTest
03-Nov-2020 11:21:05 Tests run: 3, Failures: 0, Errors: 0, Skipped: 0, Time elapsed: 0.365 sec - in org.openmrs.notification.AlertServiceTest
03-Nov-2020 11:21:05 Running org.openmrs.notification.MessageTest
03-Nov-2020 11:21:05 Tests run: 4, Failures: 0, Errors: 0, Skipped: 0, Time elapsed: 0.002 sec - in org.openmrs.notification.MessageTest
03-Nov-2020 11:21:05 Running org.openmrs.PersonNameTest
03-Nov-2020 11:21:05 Tests run: 19, Failures: 0, Errors: 0, Skipped: 0, Time elapsed: 0.002 sec - in org.openmrs.PersonNameTest
03-Nov-2020 11:21:05 Running org.openmrs.EncounterProviderTest
03-Nov-2020 11:21:05 Tests run: 1, Failures: 0, Errors: 0, Skipped: 0, Time elapsed: 0.001 sec - in org.openmrs.EncounterProviderTest
03-Nov-2020 11:21:05 Running org.openmrs.hl7.HL7UtilTest
03-Nov-2020 11:21:05 Tests run: 5, Failures: 0, Errors: 0, Skipped: 0, Time elapsed: 0.026 sec - in org.openmrs.hl7.HL7UtilTest
03-Nov-2020 11:21:05 Running org.openmrs.hl7.HL7ServiceTest
03-Nov-2020 11:21:06 ERROR - HL7ServiceImpl.setFatalError(742) |2020-11-03 11:21:06,469| ca.uhn.hl7v2.HL7Exception: HL7 encoding not supported
03-Nov-2020 11:21:06 Tests run: 26, Failures: 0, Errors: 0, Skipped: 2, Time elapsed: 0.91 sec - in org.openmrs.hl7.HL7ServiceTest
03-Nov-2020 11:21:06 Running org.openmrs.hl7.handler.ORUR01HandlerTest
03-Nov-2020 11:21:08 Tests run: 37, Failures: 0, Errors: 0, Skipped: 0, Time elapsed: 1.762 sec - in org.openmrs.hl7.handler.ORUR01HandlerTest
03-Nov-2020 11:21:08 Running org.openmrs.OpenmrsTestsTest
03-Nov-2020 11:21:08 Tests run: 4, Failures: 0, Errors: 0, Skipped: 0, Time elapsed: 0.152 sec - in org.openmrs.OpenmrsTestsTest
03-Nov-2020 11:21:08 Running org.openmrs.propertyeditor.UserEditorTest
03-Nov-2020 11:21:08 Tests run: 2, Failures: 0, Errors: 0, Skipped: 0, Time elapsed: 0.288 sec - in org.openmrs.propertyeditor.UserEditorTest
03-Nov-2020 11:21:08 Running org.openmrs.propertyeditor.PersonAttributeTypeEditorTest
03-Nov-2020 11:21:09 Tests run: 2, Failures: 0, Errors: 0, Skipped: 0, Time elapsed: 0.336 sec - in org.openmrs.propertyeditor.PersonAttributeTypeEditorTest
03-Nov-2020 11:21:09 Running org.openmrs.propertyeditor.ConceptNumericEditorTest
03-Nov-2020 11:21:09 Tests run: 2, Failures: 0, Errors: 0, Skipped: 0, Time elapsed: 0.283 sec - in org.openmrs.propertyeditor.ConceptNumericEditorTest
03-Nov-2020 11:21:09 Running org.openmrs.propertyeditor.ConceptSourceEditorTest
03-Nov-2020 11:21:09 Tests run: 2, Failures: 0, Errors: 0, Skipped: 0, Time elapsed: 0.263 sec - in org.openmrs.propertyeditor.ConceptSourceEditorTest
03-Nov-2020 11:21:09 Running org.openmrs.propertyeditor.ProgramWorkflowEditorTest
03-Nov-2020 11:21:10 Tests run: 1, Failures: 0, Errors: 0, Skipped: 0, Time elapsed: 0.309 sec - in org.openmrs.propertyeditor.ProgramWorkflowEditorTest
03-Nov-2020 11:21:10 Running org.openmrs.propertyeditor.CohortEditorTest
03-Nov-2020 11:21:10 Tests run: 2, Failures: 0, Errors: 0, Skipped: 0, Time elapsed: 0.256 sec - in org.openmrs.propertyeditor.CohortEditorTest
03-Nov-2020 11:21:10 Running org.openmrs.propertyeditor.ProviderEditorTest
03-Nov-2020 11:21:10 Tests run: 2, Failures: 0, Errors: 0, Skipped: 0, Time elapsed: 0.334 sec - in org.openmrs.propertyeditor.ProviderEditorTest
03-Nov-2020 11:21:10 Running org.openmrs.propertyeditor.EncounterTypeEditorTest
03-Nov-2020 11:21:11 Tests run: 2, Failures: 0, Errors: 0, Skipped: 0, Time elapsed: 0.341 sec - in org.openmrs.propertyeditor.EncounterTypeEditorTest
03-Nov-2020 11:21:11 Running org.openmrs.propertyeditor.ConceptNameEditorTest
03-Nov-2020 11:21:11 Tests run: 2, Failures: 0, Errors: 0, Skipped: 0, Time elapsed: 0.357 sec - in org.openmrs.propertyeditor.ConceptNameEditorTest
03-Nov-2020 11:21:11 Running org.openmrs.propertyeditor.PatientIdentifierTypeEditorTest
03-Nov-2020 11:21:11 Tests run: 2, Failures: 0, Errors: 0, Skipped: 0, Time elapsed: 0.392 sec - in org.openmrs.propertyeditor.PatientIdentifierTypeEditorTest
03-Nov-2020 11:21:11 Running org.openmrs.propertyeditor.LocationTagEditorTest
03-Nov-2020 11:21:12 Tests run: 2, Failures: 0, Errors: 0, Skipped: 0, Time elapsed: 0.327 sec - in org.openmrs.propertyeditor.LocationTagEditorTest
03-Nov-2020 11:21:12 Running org.openmrs.propertyeditor.ConceptDatatypeEditorTest
03-Nov-2020 11:21:12 Tests run: 2, Failures: 0, Errors: 0, Skipped: 0, Time elapsed: 0.31 sec - in org.openmrs.propertyeditor.ConceptDatatypeEditorTest
03-Nov-2020 11:21:12 Running org.openmrs.propertyeditor.ConceptAnswerEditorTest
03-Nov-2020 11:21:12 Tests run: 2, Failures: 0, Errors: 0, Skipped: 0, Time elapsed: 0.515 sec - in org.openmrs.propertyeditor.ConceptAnswerEditorTest
03-Nov-2020 11:21:12 Running org.openmrs.propertyeditor.ConceptClassEditorTest
03-Nov-2020 11:21:13 Tests run: 2, Failures: 0, Errors: 0, Skipped: 0, Time elapsed: 0.269 sec - in org.openmrs.propertyeditor.ConceptClassEditorTest
03-Nov-2020 11:21:13 Running org.openmrs.propertyeditor.ProgramWorkflowStateEditorTest
03-Nov-2020 11:21:13 Tests run: 1, Failures: 0, Errors: 0, Skipped: 0, Time elapsed: 0.438 sec - in org.openmrs.propertyeditor.ProgramWorkflowStateEditorTest
03-Nov-2020 11:21:13 Running org.openmrs.propertyeditor.ProgramEditorTest
03-Nov-2020 11:21:14 Tests run: 4, Failures: 0, Errors: 0, Skipped: 0, Time elapsed: 0.369 sec - in org.openmrs.propertyeditor.ProgramEditorTest
03-Nov-2020 11:21:14 Running org.openmrs.propertyeditor.DateOrDatetimeEditorTest
03-Nov-2020 11:21:14 Tests run: 6, Failures: 0, Errors: 0, Skipped: 0, Time elapsed: 0.003 sec - in org.openmrs.propertyeditor.DateOrDatetimeEditorTest
03-Nov-2020 11:21:14 Running org.openmrs.propertyeditor.VisitEditorTest
03-Nov-2020 11:21:14 Tests run: 2, Failures: 0, Errors: 0, Skipped: 0, Time elapsed: 0.256 sec - in org.openmrs.propertyeditor.VisitEditorTest
03-Nov-2020 11:21:14 Running org.openmrs.propertyeditor.VisitTypeEditorTest
03-Nov-2020 11:21:14 Tests run: 2, Failures: 0, Errors: 0, Skipped: 0, Time elapsed: 0.288 sec - in org.openmrs.propertyeditor.VisitTypeEditorTest
03-Nov-2020 11:21:14 Running org.openmrs.propertyeditor.RoleEditorTest
03-Nov-2020 11:21:14 Tests run: 2, Failures: 0, Errors: 0, Skipped: 0, Time elapsed: 0.309 sec - in org.openmrs.propertyeditor.RoleEditorTest
03-Nov-2020 11:21:14 Running org.openmrs.propertyeditor.ConceptEditorTest
03-Nov-2020 11:21:15 Tests run: 2, Failures: 0, Errors: 0, Skipped: 0, Time elapsed: 0.312 sec - in org.openmrs.propertyeditor.ConceptEditorTest
03-Nov-2020 11:21:15 Running org.openmrs.propertyeditor.WorkflowCollectionEditorTest
03-Nov-2020 11:21:15 Tests run: 1, Failures: 0, Errors: 0, Skipped: 0, Time elapsed: 0.486 sec - in org.openmrs.propertyeditor.WorkflowCollectionEditorTest
03-Nov-2020 11:21:15 Running org.openmrs.propertyeditor.PersonAttributeEditorTest
03-Nov-2020 11:21:16 Tests run: 2, Failures: 0, Errors: 0, Skipped: 0, Time elapsed: 0.327 sec - in org.openmrs.propertyeditor.PersonAttributeEditorTest
03-Nov-2020 11:21:16 Running org.openmrs.propertyeditor.FormEditorTest
03-Nov-2020 11:21:16 Tests run: 2, Failures: 0, Errors: 0, Skipped: 0, Time elapsed: 0.376 sec - in org.openmrs.propertyeditor.FormEditorTest
03-Nov-2020 11:21:16 Running org.openmrs.propertyeditor.OrderEditorTest
03-Nov-2020 11:21:16 Tests run: 2, Failures: 0, Errors: 0, Skipped: 0, Time elapsed: 0.264 sec - in org.openmrs.propertyeditor.OrderEditorTest
03-Nov-2020 11:21:16 Running org.openmrs.propertyeditor.PrivilegeEditorTest
03-Nov-2020 11:21:16 Tests run: 2, Failures: 0, Errors: 0, Skipped: 0, Time elapsed: 0.267 sec - in org.openmrs.propertyeditor.PrivilegeEditorTest
03-Nov-2020 11:21:16 Running org.openmrs.propertyeditor.EncounterEditorTest
03-Nov-2020 11:21:17 Tests run: 2, Failures: 0, Errors: 0, Skipped: 0, Time elapsed: 0.236 sec - in org.openmrs.propertyeditor.EncounterEditorTest
03-Nov-2020 11:21:17 Running org.openmrs.propertyeditor.DrugEditorTest
03-Nov-2020 11:21:17 Tests run: 2, Failures: 0, Errors: 0, Skipped: 0, Time elapsed: 0.247 sec - in org.openmrs.propertyeditor.DrugEditorTest
03-Nov-2020 11:21:17 Running org.openmrs.propertyeditor.PersonEditorTest
03-Nov-2020 11:21:17 Tests run: 2, Failures: 0, Errors: 0, Skipped: 0, Time elapsed: 0.34 sec - in org.openmrs.propertyeditor.PersonEditorTest
03-Nov-2020 11:21:17 Running org.openmrs.propertyeditor.LocationEditorTest
03-Nov-2020 11:21:18 Tests run: 2, Failures: 0, Errors: 0, Skipped: 0, Time elapsed: 0.253 sec - in org.openmrs.propertyeditor.LocationEditorTest
03-Nov-2020 11:21:18 Running org.openmrs.propertyeditor.PatientEditorTest
03-Nov-2020 11:21:18 Tests run: 2, Failures: 0, Errors: 0, Skipped: 0, Time elapsed: 0.287 sec - in org.openmrs.propertyeditor.PatientEditorTest
03-Nov-2020 11:21:18 Running org.openmrs.propertyeditor.ConceptAnswersEditorTest
03-Nov-2020 11:21:18 Tests run: 1, Failures: 0, Errors: 0, Skipped: 0, Time elapsed: 0.293 sec - in org.openmrs.propertyeditor.ConceptAnswersEditorTest
03-Nov-2020 11:21:18 Running org.openmrs.EncounterTest
03-Nov-2020 11:21:19 Tests run: 56, Failures: 0, Errors: 0, Skipped: 0, Time elapsed: 0.898 sec - in org.openmrs.EncounterTest
03-Nov-2020 11:21:19 Running org.openmrs.AllergenTest
03-Nov-2020 11:21:19 Tests run: 6, Failures: 0, Errors: 0, Skipped: 0, Time elapsed: 0.4 sec - in org.openmrs.AllergenTest
03-Nov-2020 11:21:19 Running org.openmrs.customdatatype.datatype.DateDatatypeTest
03-Nov-2020 11:21:19 Tests run: 2, Failures: 0, Errors: 0, Skipped: 0, Time elapsed: 0.001 sec - in org.openmrs.customdatatype.datatype.DateDatatypeTest
03-Nov-2020 11:21:19 Running org.openmrs.customdatatype.datatype.RegexValidatedTextTest
03-Nov-2020 11:21:19 Tests run: 3, Failures: 0, Errors: 0, Skipped: 0, Time elapsed: 0.007 sec - in org.openmrs.customdatatype.datatype.RegexValidatedTextTest
03-Nov-2020 11:21:19 Running org.openmrs.customdatatype.datatype.BaseOpenmrsDatatypeTest
03-Nov-2020 11:21:19 Tests run: 1, Failures: 0, Errors: 0, Skipped: 0, Time elapsed: 0.001 sec - in org.openmrs.customdatatype.datatype.BaseOpenmrsDatatypeTest
03-Nov-2020 11:21:19 Running org.openmrs.customdatatype.datatype.BaseMetadataDatatypeTest
03-Nov-2020 11:21:19 Tests run: 1, Failures: 0, Errors: 0, Skipped: 0, Time elapsed: 0.001 sec - in org.openmrs.customdatatype.datatype.BaseMetadataDatatypeTest
03-Nov-2020 11:21:19 Running org.openmrs.customdatatype.CustomDatatypeUtilTest
03-Nov-2020 11:21:20 Tests run: 1, Failures: 0, Errors: 0, Skipped: 0, Time elapsed: 0.294 sec - in org.openmrs.customdatatype.CustomDatatypeUtilTest
03-Nov-2020 11:21:20 Running org.openmrs.module.ModuleActivatorTest
03-Nov-2020 11:21:20 Tests run: 1, Failures: 0, Errors: 0, Skipped: 1, Time elapsed: 0 sec - in org.openmrs.module.ModuleActivatorTest
03-Nov-2020 11:21:20 Running org.openmrs.module.ModuleUtilTest
03-Nov-2020 11:21:20 Tests run: 43, Failures: 0, Errors: 0, Skipped: 0, Time elapsed: 0.573 sec - in org.openmrs.module.ModuleUtilTest
03-Nov-2020 11:21:20 Running org.openmrs.module.VersionComparatorTest
03-Nov-2020 11:21:20 Tests run: 1, Failures: 0, Errors: 0, Skipped: 0, Time elapsed: 0 sec - in org.openmrs.module.VersionComparatorTest
03-Nov-2020 11:21:20 Running org.openmrs.module.ModuleInteroperabilityTest
03-Nov-2020 11:21:21 Tests run: 1, Failures: 0, Errors: 0, Skipped: 0, Time elapsed: 0.327 sec - in org.openmrs.module.ModuleInteroperabilityTest
03-Nov-2020 11:21:21 Running org.openmrs.module.ModuleClassLoaderTest
03-Nov-2020 11:21:21 Tests run: 10, Failures: 0, Errors: 0, Skipped: 0, Time elapsed: 0.453 sec - in org.openmrs.module.ModuleClassLoaderTest
03-Nov-2020 11:21:21 Running org.openmrs.module.ModuleFileParserTest
03-Nov-2020 11:21:21 Tests run: 5, Failures: 0, Errors: 0, Skipped: 0, Time elapsed: 0.018 sec - in org.openmrs.module.ModuleFileParserTest
03-Nov-2020 11:21:21
03-Nov-2020 11:21:21 Results :
03-Nov-2020 11:21:21
03-Nov-2020 11:21:21 Tests run: 3266, Failures: 0, Errors: 0, Skipped: 29
03-Nov-2020 11:21:21
03-Nov-2020 11:21:21 [INFO]
03-Nov-2020 11:21:21 [INFO] --- maven-jar-plugin:2.3.2:jar (default-jar) @ openmrs-api ---
03-Nov-2020 11:21:22 [INFO] Building jar: /home/bamboo-agent/bamboo-agent/xml-data/build-dir/TRUNK-OC2-JOB1/api/target/openmrs-api-2.0.9-SNAPSHOT.jar
03-Nov-2020 11:21:22 [INFO]
03-Nov-2020 11:21:22 [INFO] --- maven-jar-plugin:2.3.2:test-jar (default) @ openmrs-api ---
03-Nov-2020 11:21:22 [INFO] Building jar: /home/bamboo-agent/bamboo-agent/xml-data/build-dir/TRUNK-OC2-JOB1/api/target/openmrs-api-2.0.9-SNAPSHOT-tests.jar
03-Nov-2020 11:21:22 [INFO]                                                                         
03-Nov-2020 11:21:22 [INFO] ------------------------------------------------------------------------
03-Nov-2020 11:21:22 [INFO] Building openmrs-web 2.0.9-SNAPSHOT
03-Nov-2020 11:21:22 [INFO] ------------------------------------------------------------------------
03-Nov-2020 11:21:23 [INFO]
03-Nov-2020 11:21:23 [INFO] --- maven-clean-plugin:2.5:clean (default-clean) @ openmrs-web ---
03-Nov-2020 11:21:23 [INFO]
03-Nov-2020 11:21:23 [INFO] --- buildnumber-maven-plugin:1.1:create (default) @ openmrs-web ---
03-Nov-2020 11:21:23 [INFO]
03-Nov-2020 11:21:23 [INFO] --- build-helper-maven-plugin:1.5:parse-version (parse-version) @ openmrs-web ---
03-Nov-2020 11:21:23 [INFO]
03-Nov-2020 11:21:23 [INFO] --- maven-java-formatter-plugin:0.3:format (default) @ openmrs-web ---
03-Nov-2020 11:21:23 [INFO] Using 'UTF-8' encoding to format source files.
03-Nov-2020 11:21:23 [INFO] Number of files to be formatted: 50
03-Nov-2020 11:21:23 [INFO] Successfully formatted: 0 file(s)
03-Nov-2020 11:21:23 [INFO] Fail to format        : 0 file(s)
03-Nov-2020 11:21:23 [INFO] Skipped               : 50 file(s)
03-Nov-2020 11:21:23 [INFO] Approximate time taken: 0s
03-Nov-2020 11:21:23 [INFO]
03-Nov-2020 11:21:23 [INFO] --- maven-resources-plugin:2.4:resources (default-resources) @ openmrs-web ---
03-Nov-2020 11:21:23 [INFO] Using 'UTF-8' encoding to copy filtered resources.
03-Nov-2020 11:21:23 [INFO] Copying 22 resources
03-Nov-2020 11:21:23 [INFO]
03-Nov-2020 11:21:23 [INFO] --- maven-compiler-plugin:2.1:compile (default-compile) @ openmrs-web ---
03-Nov-2020 11:21:23 [INFO] Compiling 39 source files to /home/bamboo-agent/bamboo-agent/xml-data/build-dir/TRUNK-OC2-JOB1/web/target/classes
03-Nov-2020 11:21:24 [INFO]
03-Nov-2020 11:21:24 [INFO] --- maven-resources-plugin:2.4:testResources (default-testResources) @ openmrs-web ---
03-Nov-2020 11:21:24 [INFO] Using 'UTF-8' encoding to copy filtered resources.
03-Nov-2020 11:21:24 [INFO] skip non existing resourceDirectory /home/bamboo-agent/bamboo-agent/xml-data/build-dir/TRUNK-OC2-JOB1/web/src/test/resources
03-Nov-2020 11:21:24 [INFO]
03-Nov-2020 11:21:24 [INFO] --- maven-compiler-plugin:2.1:testCompile (default-testCompile) @ openmrs-web ---
03-Nov-2020 11:21:24 [INFO] Compiling 11 source files to /home/bamboo-agent/bamboo-agent/xml-data/build-dir/TRUNK-OC2-JOB1/web/target/test-classes
03-Nov-2020 11:21:25 [INFO]
03-Nov-2020 11:21:25 [INFO] --- maven-surefire-plugin:2.18.1:test (default-test) @ openmrs-web ---
03-Nov-2020 11:21:25 [INFO] Surefire report directory: /home/bamboo-agent/bamboo-agent/xml-data/build-dir/TRUNK-OC2-JOB1/web/target/surefire-reports
03-Nov-2020 11:21:25
03-Nov-2020 11:21:25 -------------------------------------------------------
03-Nov-2020 11:21:25 T E S T S
03-Nov-2020 11:21:25 -------------------------------------------------------
03-Nov-2020 11:21:27 Running org.openmrs.web.filter.update.UpdateFilterTest
03-Nov-2020 11:21:37 Tests run: 5, Failures: 0, Errors: 0, Skipped: 0, Time elapsed: 9.506 sec - in org.openmrs.web.filter.update.UpdateFilterTest
03-Nov-2020 11:21:37 Running org.openmrs.web.filter.update.util.FilterUtilTest
03-Nov-2020 11:21:37 Tests run: 2, Failures: 0, Errors: 0, Skipped: 2, Time elapsed: 0 sec - in org.openmrs.web.filter.update.util.FilterUtilTest
03-Nov-2020 11:21:37 Running org.openmrs.web.filter.update.GZIPFilterTest
03-Nov-2020 11:21:37 Tests run: 1, Failures: 0, Errors: 0, Skipped: 0, Time elapsed: 0.289 sec - in org.openmrs.web.filter.update.GZIPFilterTest
03-Nov-2020 11:21:37 Running org.openmrs.web.WebUtilTest
03-Nov-2020 11:21:37 Tests run: 10, Failures: 0, Errors: 0, Skipped: 0, Time elapsed: 0.006 sec - in org.openmrs.web.WebUtilTest
03-Nov-2020 11:21:37 Running org.openmrs.module.web.WebModuleUtilTest
03-Nov-2020 11:21:37 SLF4J: Class path contains multiple SLF4J bindings.
03-Nov-2020 11:21:37 SLF4J: Found binding in [jar:file:/home/bamboo-agent/.m2/repository/org/slf4j/slf4j-log4j12/1.6.0/slf4j-log4j12-1.6.0.jar!/org/slf4j/impl/StaticLoggerBinder.class]
03-Nov-2020 11:21:37 SLF4J: Found binding in [jar:file:/home/bamboo-agent/.m2/repository/org/slf4j/slf4j-log4j12/1.6.0/slf4j-log4j12-1.6.0.jar!/org/slf4j/impl/StaticLoggerBinder.class]
03-Nov-2020 11:21:37 SLF4J: See http://www.slf4j.org/codes.html#multiple_bindings for an explanation.
03-Nov-2020 11:21:38 Tests run: 9, Failures: 0, Errors: 0, Skipped: 0, Time elapsed: 1.093 sec - in org.openmrs.module.web.WebModuleUtilTest
03-Nov-2020 11:21:38
03-Nov-2020 11:21:38 Results :
03-Nov-2020 11:21:38
03-Nov-2020 11:21:38 Tests run: 27, Failures: 0, Errors: 0, Skipped: 2
03-Nov-2020 11:21:38
03-Nov-2020 11:21:38 [INFO]
03-Nov-2020 11:21:38 [INFO] --- maven-jar-plugin:2.3.2:jar (default-jar) @ openmrs-web ---
03-Nov-2020 11:21:38 [INFO] Building jar: /home/bamboo-agent/bamboo-agent/xml-data/build-dir/TRUNK-OC2-JOB1/web/target/openmrs-web-2.0.9-SNAPSHOT.jar
03-Nov-2020 11:21:38 [INFO]
03-Nov-2020 11:21:38 [INFO] --- maven-jar-plugin:2.3.2:test-jar (default) @ openmrs-web ---
03-Nov-2020 11:21:38 [INFO] Building jar: /home/bamboo-agent/bamboo-agent/xml-data/build-dir/TRUNK-OC2-JOB1/web/target/openmrs-web-2.0.9-SNAPSHOT-tests.jar
03-Nov-2020 11:21:38 [INFO]                                                                         
03-Nov-2020 11:21:38 [INFO] ------------------------------------------------------------------------
03-Nov-2020 11:21:38 [INFO] Building openmrs-webapp 2.0.9-SNAPSHOT
03-Nov-2020 11:21:38 [INFO] ------------------------------------------------------------------------
03-Nov-2020 11:21:39 [INFO]
03-Nov-2020 11:21:39 [INFO] --- maven-clean-plugin:2.5:clean (default-clean) @ openmrs-webapp ---
03-Nov-2020 11:21:39 [INFO]
03-Nov-2020 11:21:39 [INFO] --- buildnumber-maven-plugin:1.1:create (default) @ openmrs-webapp ---
03-Nov-2020 11:21:39 [INFO]
03-Nov-2020 11:21:39 [INFO] --- build-helper-maven-plugin:1.5:parse-version (parse-version) @ openmrs-webapp ---
03-Nov-2020 11:21:39 [INFO]
03-Nov-2020 11:21:39 [INFO] --- maven-resources-plugin:2.4:resources (default-resources) @ openmrs-webapp ---
03-Nov-2020 11:21:39 [INFO] Using 'UTF-8' encoding to copy filtered resources.
03-Nov-2020 11:21:39 [INFO] Copying 2 resources
03-Nov-2020 11:21:39 [INFO] Copying 1 resource to ../jetty
03-Nov-2020 11:21:39 [INFO]
03-Nov-2020 11:21:39 [INFO] --- maven-antrun-plugin:1.4:run (default) @ openmrs-webapp ---
03-Nov-2020 11:21:40 project.artifactId
03-Nov-2020 11:21:40 [INFO] Executing tasks
03-Nov-2020 11:21:40     [unzip] Expanding: /home/bamboo-agent/bamboo-agent/xml-data/build-dir/TRUNK-OC2-JOB1/webapp/src/main/resources/liquibase-demo-data.zip into /home/bamboo-agent/bamboo-agent/xml-data/build-dir/TRUNK-OC2-JOB1/webapp/target/classes
03-Nov-2020 11:21:40 [INFO] Executed tasks
03-Nov-2020 11:21:40 [INFO]
03-Nov-2020 11:21:40 [INFO] --- maven-compiler-plugin:2.1:compile (default-compile) @ openmrs-webapp ---
03-Nov-2020 11:21:40 [INFO] No sources to compile
03-Nov-2020 11:21:40 [INFO]
03-Nov-2020 11:21:40 [INFO] --- maven-resources-plugin:2.4:testResources (default-testResources) @ openmrs-webapp ---
03-Nov-2020 11:21:40 [INFO] Using 'UTF-8' encoding to copy filtered resources.
03-Nov-2020 11:21:40 [INFO] Copying 1 resource
03-Nov-2020 11:21:40 [INFO]
03-Nov-2020 11:21:40 [INFO] --- maven-compiler-plugin:2.1:testCompile (default-testCompile) @ openmrs-webapp ---
03-Nov-2020 11:21:40 [INFO] Compiling 3 source files to /home/bamboo-agent/bamboo-agent/xml-data/build-dir/TRUNK-OC2-JOB1/webapp/target/test-classes
03-Nov-2020 11:21:40 [INFO]
03-Nov-2020 11:21:40 [INFO] --- maven-surefire-plugin:2.18.1:test (default-test) @ openmrs-webapp ---
03-Nov-2020 11:21:40 [INFO] Surefire report directory: /home/bamboo-agent/bamboo-agent/xml-data/build-dir/TRUNK-OC2-JOB1/webapp/target/surefire-reports
03-Nov-2020 11:21:40
03-Nov-2020 11:21:40 -------------------------------------------------------
03-Nov-2020 11:21:40 T E S T S
03-Nov-2020 11:21:40 -------------------------------------------------------
03-Nov-2020 11:21:41 Running org.openmrs.MessagePropertiesFilesTest
03-Nov-2020 11:21:41 Tests run: 0, Failures: 0, Errors: 0, Skipped: 0, Time elapsed: 0.001 sec - in org.openmrs.MessagePropertiesFilesTest
03-Nov-2020 11:21:41
03-Nov-2020 11:21:41 Results :
03-Nov-2020 11:21:41
03-Nov-2020 11:21:41 Tests run: 0, Failures: 0, Errors: 0, Skipped: 0
03-Nov-2020 11:21:41
03-Nov-2020 11:21:41 [INFO]
03-Nov-2020 11:21:41 [INFO] --- maven-war-plugin:2.4:war (default-war) @ openmrs-webapp ---
03-Nov-2020 11:21:41 [INFO] Packaging webapp
03-Nov-2020 11:21:41 [INFO] Assembling webapp [openmrs-webapp] in [/home/bamboo-agent/bamboo-agent/xml-data/build-dir/TRUNK-OC2-JOB1/webapp/target/openmrs]
03-Nov-2020 11:21:41 [INFO] Processing war project
03-Nov-2020 11:21:41 [INFO] Copying webapp webResources [/home/bamboo-agent/bamboo-agent/xml-data/build-dir/TRUNK-OC2-JOB1/webapp/src/main/webapp] to [/home/bamboo-agent/bamboo-agent/xml-data/build-dir/TRUNK-OC2-JOB1/webapp/target/openmrs]
03-Nov-2020 11:21:42 [INFO] Copying webapp resources [/home/bamboo-agent/bamboo-agent/xml-data/build-dir/TRUNK-OC2-JOB1/webapp/src/main/webapp]
03-Nov-2020 11:21:44 [INFO] Webapp assembled in [2447 msecs]
03-Nov-2020 11:21:44 [INFO] Building war: /home/bamboo-agent/bamboo-agent/xml-data/build-dir/TRUNK-OC2-JOB1/webapp/target/openmrs.war
03-Nov-2020 11:21:46 [INFO]
03-Nov-2020 11:21:46 [INFO] --- maven-jar-plugin:2.3.2:test-jar (default) @ openmrs-webapp ---
03-Nov-2020 11:21:46 [INFO] Building jar: /home/bamboo-agent/bamboo-agent/xml-data/build-dir/TRUNK-OC2-JOB1/webapp/target/openmrs-tests.jar
03-Nov-2020 11:21:46 [INFO] ------------------------------------------------------------------------
03-Nov-2020 11:21:46 [INFO] Reactor Summary:
03-Nov-2020 11:21:46 [INFO]
03-Nov-2020 11:21:46 [INFO] OpenMRS ............................................ SUCCESS [  2.855 s]
03-Nov-2020 11:21:46 [INFO] openmrs-tools ...................................... SUCCESS [  1.873 s]
03-Nov-2020 11:21:46 [INFO] openmrs-test ....................................... SUCCESS [  0.628 s]
03-Nov-2020 11:21:46 [INFO] openmrs-api ........................................ SUCCESS [02:47 min]
03-Nov-2020 11:21:46 [INFO] openmrs-web ........................................ SUCCESS [ 15.801 s]
03-Nov-2020 11:21:46 [INFO] openmrs-webapp ..................................... SUCCESS [  8.048 s]
03-Nov-2020 11:21:46 [INFO] ------------------------------------------------------------------------
03-Nov-2020 11:21:46 [INFO] BUILD SUCCESS
03-Nov-2020 11:21:46 [INFO] ------------------------------------------------------------------------
03-Nov-2020 11:21:46 [INFO] Total time: 03:17 min
03-Nov-2020 11:21:46 [INFO] Finished at: 2020-11-03T11:21:46+00:00
03-Nov-2020 11:21:47 [INFO] Final Memory: 104M/679M
03-Nov-2020 11:21:47 [INFO] ------------------------------------------------------------------------
03-Nov-2020 11:21:47 Parsing test results under /home/bamboo-agent/bamboo-agent/xml-data/build-dir/TRUNK-OC2-JOB1...
03-Nov-2020 11:21:47 Finished task 'Build' with result: Success
03-Nov-2020 11:21:47 Running post build plugin 'Docker Container Cleanup'
03-Nov-2020 11:21:47 Running post build plugin 'NCover Results Collector'
03-Nov-2020 11:21:47 Running post build plugin 'Clover Results Collector'
03-Nov-2020 11:21:47 Running post build plugin 'Sauce OnDemand Post Runner'
03-Nov-2020 11:21:47 Running post build plugin 'npm Cache Cleanup'
03-Nov-2020 11:21:47 Running post build plugin 'Artifact Copier'
03-Nov-2020 11:21:47 Publishing an artifact: openmrs-war
03-Nov-2020 11:21:49 Finished publishing of artifact Non required shared artifact: [openmrs-war], pattern: [**/openmrs.war] anchored at: [webapp/target] in 1.725 s
03-Nov-2020 11:21:49 Publishing an artifact: openmrs-api
03-Nov-2020 11:21:50 Finished publishing of artifact Non required shared artifact: [openmrs-api], pattern: [**/openmrs-api*.jar] anchored at: [webapp/target/openmrs/WEB-INF/lib] in 768.5 ms
03-Nov-2020 11:21:50 Publishing an artifact: sonar-issues
03-Nov-2020 11:21:50 Unable to publish artifact [sonar-issues]: the source directory /home/bamboo-agent/bamboo-agent/xml-data/build-dir/TRUNK-OC2-JOB1/target/sonar/issues-report does not exist.
03-Nov-2020 11:21:50 The artifact hasn't been successfully published after 651.0 μs
03-Nov-2020 11:21:50 Finalising the build...
03-Nov-2020 11:21:50 Stopping timer.
03-Nov-2020 11:21:50 Build TRUNK-OC2-JOB1-242 completed.
03-Nov-2020 11:21:50 Running on server: post build plugin 'NCover Results Collector'
03-Nov-2020 11:21:50 Running on server: post build plugin 'Build Hanging Detection Configuration'
03-Nov-2020 11:21:50 Running on server: post build plugin 'Clover Delta Calculator'
03-Nov-2020 11:21:50 Running on server: post build plugin 'Maven Dependencies Postprocessor'
03-Nov-2020 11:21:50 All post build plugins have finished
03-Nov-2020 11:21:50 Generating build results summary...
03-Nov-2020 11:21:52 Saving build results to disk...
03-Nov-2020 11:21:52 Logging substituted variables...
03-Nov-2020 11:21:53 Indexing build results...
03-Nov-2020 11:21:53 Finished building TRUNK-OC2-JOB1-242.