Build: #531 failed

Job: Integration Tests failed

Stages & jobs

  1. Build and Tests

  2. Deploy

  3. Release

    Requires a user to start manually

Build log

The build generated 4,759 lines of output.The output is too long and has been truncated to the last 1,000 lines. Download or view full build log

16-Mar-2020 14:43:08         at org.openmrs.aop.RequiredDataAdvice.before(RequiredDataAdvice.java:135)
16-Mar-2020 14:43:08         at org.springframework.aop.framework.adapter.MethodBeforeAdviceInterceptor.invoke(MethodBeforeAdviceInterceptor.java:49)
16-Mar-2020 14:43:08         at org.springframework.aop.framework.ReflectiveMethodInvocation.proceed(ReflectiveMethodInvocation.java:172)
16-Mar-2020 14:43:08         at org.springframework.aop.framework.adapter.MethodBeforeAdviceInterceptor.invoke(MethodBeforeAdviceInterceptor.java:50)
16-Mar-2020 14:43:08         at org.springframework.aop.framework.ReflectiveMethodInvocation.proceed(ReflectiveMethodInvocation.java:172)
16-Mar-2020 14:43:08         at org.springframework.aop.framework.JdkDynamicAopProxy.invoke(JdkDynamicAopProxy.java:202)
16-Mar-2020 14:43:08         at com.sun.proxy.$Proxy35.saveEncounter(Unknown Source)
16-Mar-2020 14:43:08         at sun.reflect.GeneratedMethodAccessor841.invoke(Unknown Source)
16-Mar-2020 14:43:08         at sun.reflect.DelegatingMethodAccessorImpl.invoke(DelegatingMethodAccessorImpl.java:43)
16-Mar-2020 14:43:08         at java.lang.reflect.Method.invoke(Method.java:498)
16-Mar-2020 14:43:08         at org.springframework.aop.support.AopUtils.invokeJoinpointUsingReflection(AopUtils.java:318)
16-Mar-2020 14:43:08         at org.springframework.aop.framework.ReflectiveMethodInvocation.invokeJoinpoint(ReflectiveMethodInvocation.java:183)
16-Mar-2020 14:43:08         at org.springframework.aop.framework.ReflectiveMethodInvocation.proceed(ReflectiveMethodInvocation.java:150)
16-Mar-2020 14:43:08         at org.springframework.transaction.interceptor.TransactionInterceptor.invoke(TransactionInterceptor.java:110)
16-Mar-2020 14:43:08         at org.springframework.aop.framework.ReflectiveMethodInvocation.proceed(ReflectiveMethodInvocation.java:172)
16-Mar-2020 14:43:08         at org.springframework.aop.framework.JdkDynamicAopProxy.invoke(JdkDynamicAopProxy.java:202)
16-Mar-2020 14:43:08         at com.sun.proxy.$Proxy35.saveEncounter(Unknown Source)
16-Mar-2020 14:43:08         at org.openmrs.api.EncounterServiceTest.saveEncounter_shouldCascadeSaveToContainedObsWhenEncounterAlreadyExists(EncounterServiceTest.java:376)
16-Mar-2020 14:43:08         at sun.reflect.NativeMethodAccessorImpl.invoke0(Native Method)
16-Mar-2020 14:43:08         at sun.reflect.NativeMethodAccessorImpl.invoke(NativeMethodAccessorImpl.java:62)
16-Mar-2020 14:43:08         at sun.reflect.DelegatingMethodAccessorImpl.invoke(DelegatingMethodAccessorImpl.java:43)
16-Mar-2020 14:43:08         at java.lang.reflect.Method.invoke(Method.java:498)
16-Mar-2020 14:43:08         at org.junit.runners.model.FrameworkMethod$1.runReflectiveCall(FrameworkMethod.java:47)
16-Mar-2020 14:43:08         at org.junit.internal.runners.model.ReflectiveCallable.run(ReflectiveCallable.java:12)
16-Mar-2020 14:43:08         at org.junit.runners.model.FrameworkMethod.invokeExplosively(FrameworkMethod.java:44)
16-Mar-2020 14:43:08         at org.junit.internal.runners.statements.InvokeMethod.evaluate(InvokeMethod.java:17)
16-Mar-2020 14:43:08         at org.junit.internal.runners.statements.RunBefores.evaluate(RunBefores.java:26)
16-Mar-2020 14:43:08         at org.springframework.test.context.junit4.statements.RunBeforeTestMethodCallbacks.evaluate(RunBeforeTestMethodCallbacks.java:74)
16-Mar-2020 14:43:08         at org.junit.internal.runners.statements.RunAfters.evaluate(RunAfters.java:27)
16-Mar-2020 14:43:08         at org.springframework.test.context.junit4.statements.RunAfterTestMethodCallbacks.evaluate(RunAfterTestMethodCallbacks.java:83)
16-Mar-2020 14:43:08         at org.springframework.test.context.junit4.statements.SpringRepeat.evaluate(SpringRepeat.java:72)
16-Mar-2020 14:43:08         at org.springframework.test.context.junit4.SpringJUnit4ClassRunner.runChild(SpringJUnit4ClassRunner.java:231)
16-Mar-2020 14:43:08         at org.junit.runners.BlockJUnit4ClassRunner.runChild(BlockJUnit4ClassRunner.java:50)
16-Mar-2020 14:43:08         at org.junit.runners.ParentRunner$3.run(ParentRunner.java:238)
16-Mar-2020 14:43:08         at org.junit.runners.ParentRunner$1.schedule(ParentRunner.java:63)
16-Mar-2020 14:43:08         at org.junit.runners.ParentRunner.runChildren(ParentRunner.java:236)
16-Mar-2020 14:43:08         at org.junit.runners.ParentRunner.access$000(ParentRunner.java:53)
16-Mar-2020 14:43:08         at org.junit.runners.ParentRunner$2.evaluate(ParentRunner.java:229)
16-Mar-2020 14:43:08         at org.springframework.test.context.junit4.statements.RunBeforeTestClassCallbacks.evaluate(RunBeforeTestClassCallbacks.java:61)
16-Mar-2020 14:43:08         at org.junit.internal.runners.statements.RunAfters.evaluate(RunAfters.java:27)
16-Mar-2020 14:43:08         at org.springframework.test.context.junit4.statements.RunAfterTestClassCallbacks.evaluate(RunAfterTestClassCallbacks.java:71)
16-Mar-2020 14:43:08         at org.junit.runners.ParentRunner.run(ParentRunner.java:309)
16-Mar-2020 14:43:08         at org.springframework.test.context.junit4.SpringJUnit4ClassRunner.run(SpringJUnit4ClassRunner.java:174)
16-Mar-2020 14:43:08         at org.apache.maven.surefire.junit4.JUnit4TestSet.execute(JUnit4TestSet.java:59)
16-Mar-2020 14:43:08         at org.apache.maven.surefire.suite.AbstractDirectoryTestSuite.executeTestSet(AbstractDirectoryTestSuite.java:115)
16-Mar-2020 14:43:08         at org.apache.maven.surefire.suite.AbstractDirectoryTestSuite.execute(AbstractDirectoryTestSuite.java:102)
16-Mar-2020 14:43:08         at org.apache.maven.surefire.Surefire.run(Surefire.java:180)
16-Mar-2020 14:43:08         at sun.reflect.NativeMethodAccessorImpl.invoke0(Native Method)
16-Mar-2020 14:43:08         at sun.reflect.NativeMethodAccessorImpl.invoke(NativeMethodAccessorImpl.java:62)
16-Mar-2020 14:43:08         at sun.reflect.DelegatingMethodAccessorImpl.invoke(DelegatingMethodAccessorImpl.java:43)
16-Mar-2020 14:43:08         at java.lang.reflect.Method.invoke(Method.java:498)
16-Mar-2020 14:43:08         at org.apache.maven.surefire.booter.SurefireBooter.runSuitesInProcess(SurefireBooter.java:350)
16-Mar-2020 14:43:08         at org.apache.maven.surefire.booter.SurefireBooter.main(SurefireBooter.java:1021)
16-Mar-2020 14:43:08 ERROR - EncounterSaveHandler.handle(47) |2020-03-16 14:43:08,007| Unable to save complex obs
16-Mar-2020 14:43:08 java.lang.NullPointerException
16-Mar-2020 14:43:08         at org.openmrs.api.handler.EncounterSaveHandler.handle(EncounterSaveHandler.java:39)
16-Mar-2020 14:43:08         at org.openmrs.api.handler.EncounterSaveHandler.handle(EncounterSaveHandler.java:25)
16-Mar-2020 14:43:08         at org.openmrs.aop.RequiredDataAdvice.recursivelyHandle(RequiredDataAdvice.java:266)
16-Mar-2020 14:43:08         at org.openmrs.aop.RequiredDataAdvice.recursivelyHandle(RequiredDataAdvice.java:230)
16-Mar-2020 14:43:08         at org.openmrs.aop.RequiredDataAdvice.before(RequiredDataAdvice.java:135)
16-Mar-2020 14:43:08         at org.springframework.aop.framework.adapter.MethodBeforeAdviceInterceptor.invoke(MethodBeforeAdviceInterceptor.java:49)
16-Mar-2020 14:43:08         at org.springframework.aop.framework.ReflectiveMethodInvocation.proceed(ReflectiveMethodInvocation.java:172)
16-Mar-2020 14:43:08         at org.springframework.aop.framework.adapter.MethodBeforeAdviceInterceptor.invoke(MethodBeforeAdviceInterceptor.java:50)
16-Mar-2020 14:43:08         at org.springframework.aop.framework.ReflectiveMethodInvocation.proceed(ReflectiveMethodInvocation.java:172)
16-Mar-2020 14:43:08         at org.springframework.aop.framework.JdkDynamicAopProxy.invoke(JdkDynamicAopProxy.java:202)
16-Mar-2020 14:43:08         at com.sun.proxy.$Proxy35.saveEncounter(Unknown Source)
16-Mar-2020 14:43:08         at sun.reflect.GeneratedMethodAccessor841.invoke(Unknown Source)
16-Mar-2020 14:43:08         at sun.reflect.DelegatingMethodAccessorImpl.invoke(DelegatingMethodAccessorImpl.java:43)
16-Mar-2020 14:43:08         at java.lang.reflect.Method.invoke(Method.java:498)
16-Mar-2020 14:43:08         at org.springframework.aop.support.AopUtils.invokeJoinpointUsingReflection(AopUtils.java:318)
16-Mar-2020 14:43:08         at org.springframework.aop.framework.ReflectiveMethodInvocation.invokeJoinpoint(ReflectiveMethodInvocation.java:183)
16-Mar-2020 14:43:08         at org.springframework.aop.framework.ReflectiveMethodInvocation.proceed(ReflectiveMethodInvocation.java:150)
16-Mar-2020 14:43:08         at org.springframework.transaction.interceptor.TransactionInterceptor.invoke(TransactionInterceptor.java:110)
16-Mar-2020 14:43:08         at org.springframework.aop.framework.ReflectiveMethodInvocation.proceed(ReflectiveMethodInvocation.java:172)
16-Mar-2020 14:43:08         at org.springframework.aop.framework.JdkDynamicAopProxy.invoke(JdkDynamicAopProxy.java:202)
16-Mar-2020 14:43:08         at com.sun.proxy.$Proxy35.saveEncounter(Unknown Source)
16-Mar-2020 14:43:08         at org.openmrs.api.EncounterServiceTest.saveEncounter_shouldCascadeSaveToContainedObsWhenEncounterAlreadyExists(EncounterServiceTest.java:376)
16-Mar-2020 14:43:08         at sun.reflect.NativeMethodAccessorImpl.invoke0(Native Method)
16-Mar-2020 14:43:08         at sun.reflect.NativeMethodAccessorImpl.invoke(NativeMethodAccessorImpl.java:62)
16-Mar-2020 14:43:08         at sun.reflect.DelegatingMethodAccessorImpl.invoke(DelegatingMethodAccessorImpl.java:43)
16-Mar-2020 14:43:08         at java.lang.reflect.Method.invoke(Method.java:498)
16-Mar-2020 14:43:08         at org.junit.runners.model.FrameworkMethod$1.runReflectiveCall(FrameworkMethod.java:47)
16-Mar-2020 14:43:08         at org.junit.internal.runners.model.ReflectiveCallable.run(ReflectiveCallable.java:12)
16-Mar-2020 14:43:08         at org.junit.runners.model.FrameworkMethod.invokeExplosively(FrameworkMethod.java:44)
16-Mar-2020 14:43:08         at org.junit.internal.runners.statements.InvokeMethod.evaluate(InvokeMethod.java:17)
16-Mar-2020 14:43:08         at org.junit.internal.runners.statements.RunBefores.evaluate(RunBefores.java:26)
16-Mar-2020 14:43:08         at org.springframework.test.context.junit4.statements.RunBeforeTestMethodCallbacks.evaluate(RunBeforeTestMethodCallbacks.java:74)
16-Mar-2020 14:43:08         at org.junit.internal.runners.statements.RunAfters.evaluate(RunAfters.java:27)
16-Mar-2020 14:43:08         at org.springframework.test.context.junit4.statements.RunAfterTestMethodCallbacks.evaluate(RunAfterTestMethodCallbacks.java:83)
16-Mar-2020 14:43:08         at org.springframework.test.context.junit4.statements.SpringRepeat.evaluate(SpringRepeat.java:72)
16-Mar-2020 14:43:08         at org.springframework.test.context.junit4.SpringJUnit4ClassRunner.runChild(SpringJUnit4ClassRunner.java:231)
16-Mar-2020 14:43:08         at org.junit.runners.BlockJUnit4ClassRunner.runChild(BlockJUnit4ClassRunner.java:50)
16-Mar-2020 14:43:08         at org.junit.runners.ParentRunner$3.run(ParentRunner.java:238)
16-Mar-2020 14:43:08         at org.junit.runners.ParentRunner$1.schedule(ParentRunner.java:63)
16-Mar-2020 14:43:08         at org.junit.runners.ParentRunner.runChildren(ParentRunner.java:236)
16-Mar-2020 14:43:08         at org.junit.runners.ParentRunner.access$000(ParentRunner.java:53)
16-Mar-2020 14:43:08         at org.junit.runners.ParentRunner$2.evaluate(ParentRunner.java:229)
16-Mar-2020 14:43:08         at org.springframework.test.context.junit4.statements.RunBeforeTestClassCallbacks.evaluate(RunBeforeTestClassCallbacks.java:61)
16-Mar-2020 14:43:08         at org.junit.internal.runners.statements.RunAfters.evaluate(RunAfters.java:27)
16-Mar-2020 14:43:08         at org.springframework.test.context.junit4.statements.RunAfterTestClassCallbacks.evaluate(RunAfterTestClassCallbacks.java:71)
16-Mar-2020 14:43:08         at org.junit.runners.ParentRunner.run(ParentRunner.java:309)
16-Mar-2020 14:43:08         at org.springframework.test.context.junit4.SpringJUnit4ClassRunner.run(SpringJUnit4ClassRunner.java:174)
16-Mar-2020 14:43:08         at org.apache.maven.surefire.junit4.JUnit4TestSet.execute(JUnit4TestSet.java:59)
16-Mar-2020 14:43:08         at org.apache.maven.surefire.suite.AbstractDirectoryTestSuite.executeTestSet(AbstractDirectoryTestSuite.java:115)
16-Mar-2020 14:43:08         at org.apache.maven.surefire.suite.AbstractDirectoryTestSuite.execute(AbstractDirectoryTestSuite.java:102)
16-Mar-2020 14:43:08         at org.apache.maven.surefire.Surefire.run(Surefire.java:180)
16-Mar-2020 14:43:08         at sun.reflect.NativeMethodAccessorImpl.invoke0(Native Method)
16-Mar-2020 14:43:08         at sun.reflect.NativeMethodAccessorImpl.invoke(NativeMethodAccessorImpl.java:62)
16-Mar-2020 14:43:08         at sun.reflect.DelegatingMethodAccessorImpl.invoke(DelegatingMethodAccessorImpl.java:43)
16-Mar-2020 14:43:08         at java.lang.reflect.Method.invoke(Method.java:498)
16-Mar-2020 14:43:08         at org.apache.maven.surefire.booter.SurefireBooter.runSuitesInProcess(SurefireBooter.java:350)
16-Mar-2020 14:43:08         at org.apache.maven.surefire.booter.SurefireBooter.main(SurefireBooter.java:1021)
16-Mar-2020 14:43:09 ERROR - EncounterSaveHandler.handle(47) |2020-03-16 14:43:09,088| Unable to save complex obs
16-Mar-2020 14:43:09 java.lang.NullPointerException
16-Mar-2020 14:43:09         at org.openmrs.api.handler.EncounterSaveHandler.handle(EncounterSaveHandler.java:39)
16-Mar-2020 14:43:09         at org.openmrs.api.handler.EncounterSaveHandler.handle(EncounterSaveHandler.java:25)
16-Mar-2020 14:43:09         at org.openmrs.aop.RequiredDataAdvice.recursivelyHandle(RequiredDataAdvice.java:266)
16-Mar-2020 14:43:09         at org.openmrs.aop.RequiredDataAdvice.recursivelyHandle(RequiredDataAdvice.java:230)
16-Mar-2020 14:43:09         at org.openmrs.aop.RequiredDataAdvice.before(RequiredDataAdvice.java:135)
16-Mar-2020 14:43:09         at org.springframework.aop.framework.adapter.MethodBeforeAdviceInterceptor.invoke(MethodBeforeAdviceInterceptor.java:49)
16-Mar-2020 14:43:09         at org.springframework.aop.framework.ReflectiveMethodInvocation.proceed(ReflectiveMethodInvocation.java:172)
16-Mar-2020 14:43:09         at org.springframework.aop.framework.adapter.MethodBeforeAdviceInterceptor.invoke(MethodBeforeAdviceInterceptor.java:50)
16-Mar-2020 14:43:09         at org.springframework.aop.framework.ReflectiveMethodInvocation.proceed(ReflectiveMethodInvocation.java:172)
16-Mar-2020 14:43:09         at org.springframework.aop.framework.JdkDynamicAopProxy.invoke(JdkDynamicAopProxy.java:202)
16-Mar-2020 14:43:09         at com.sun.proxy.$Proxy35.saveEncounter(Unknown Source)
16-Mar-2020 14:43:09         at sun.reflect.GeneratedMethodAccessor841.invoke(Unknown Source)
16-Mar-2020 14:43:09         at sun.reflect.DelegatingMethodAccessorImpl.invoke(DelegatingMethodAccessorImpl.java:43)
16-Mar-2020 14:43:09         at java.lang.reflect.Method.invoke(Method.java:498)
16-Mar-2020 14:43:09         at org.springframework.aop.support.AopUtils.invokeJoinpointUsingReflection(AopUtils.java:318)
16-Mar-2020 14:43:09         at org.springframework.aop.framework.ReflectiveMethodInvocation.invokeJoinpoint(ReflectiveMethodInvocation.java:183)
16-Mar-2020 14:43:09         at org.springframework.aop.framework.ReflectiveMethodInvocation.proceed(ReflectiveMethodInvocation.java:150)
16-Mar-2020 14:43:09         at org.springframework.transaction.interceptor.TransactionInterceptor.invoke(TransactionInterceptor.java:110)
16-Mar-2020 14:43:09         at org.springframework.aop.framework.ReflectiveMethodInvocation.proceed(ReflectiveMethodInvocation.java:172)
16-Mar-2020 14:43:09         at org.springframework.aop.framework.JdkDynamicAopProxy.invoke(JdkDynamicAopProxy.java:202)
16-Mar-2020 14:43:09         at com.sun.proxy.$Proxy35.saveEncounter(Unknown Source)
16-Mar-2020 14:43:09         at org.openmrs.api.EncounterServiceTest.saveEncounter_shouldCascadeChangeOfLocationInEncounterToContainedObs(EncounterServiceTest.java:205)
16-Mar-2020 14:43:09         at sun.reflect.NativeMethodAccessorImpl.invoke0(Native Method)
16-Mar-2020 14:43:09         at sun.reflect.NativeMethodAccessorImpl.invoke(NativeMethodAccessorImpl.java:62)
16-Mar-2020 14:43:09         at sun.reflect.DelegatingMethodAccessorImpl.invoke(DelegatingMethodAccessorImpl.java:43)
16-Mar-2020 14:43:09         at java.lang.reflect.Method.invoke(Method.java:498)
16-Mar-2020 14:43:09         at org.junit.runners.model.FrameworkMethod$1.runReflectiveCall(FrameworkMethod.java:47)
16-Mar-2020 14:43:09         at org.junit.internal.runners.model.ReflectiveCallable.run(ReflectiveCallable.java:12)
16-Mar-2020 14:43:09         at org.junit.runners.model.FrameworkMethod.invokeExplosively(FrameworkMethod.java:44)
16-Mar-2020 14:43:09         at org.junit.internal.runners.statements.InvokeMethod.evaluate(InvokeMethod.java:17)
16-Mar-2020 14:43:09         at org.junit.internal.runners.statements.RunBefores.evaluate(RunBefores.java:26)
16-Mar-2020 14:43:09         at org.springframework.test.context.junit4.statements.RunBeforeTestMethodCallbacks.evaluate(RunBeforeTestMethodCallbacks.java:74)
16-Mar-2020 14:43:09         at org.junit.internal.runners.statements.RunAfters.evaluate(RunAfters.java:27)
16-Mar-2020 14:43:09         at org.springframework.test.context.junit4.statements.RunAfterTestMethodCallbacks.evaluate(RunAfterTestMethodCallbacks.java:83)
16-Mar-2020 14:43:09         at org.springframework.test.context.junit4.statements.SpringRepeat.evaluate(SpringRepeat.java:72)
16-Mar-2020 14:43:09         at org.springframework.test.context.junit4.SpringJUnit4ClassRunner.runChild(SpringJUnit4ClassRunner.java:231)
16-Mar-2020 14:43:09         at org.junit.runners.BlockJUnit4ClassRunner.runChild(BlockJUnit4ClassRunner.java:50)
16-Mar-2020 14:43:09         at org.junit.runners.ParentRunner$3.run(ParentRunner.java:238)
16-Mar-2020 14:43:09         at org.junit.runners.ParentRunner$1.schedule(ParentRunner.java:63)
16-Mar-2020 14:43:09         at org.junit.runners.ParentRunner.runChildren(ParentRunner.java:236)
16-Mar-2020 14:43:09         at org.junit.runners.ParentRunner.access$000(ParentRunner.java:53)
16-Mar-2020 14:43:09         at org.junit.runners.ParentRunner$2.evaluate(ParentRunner.java:229)
16-Mar-2020 14:43:09         at org.springframework.test.context.junit4.statements.RunBeforeTestClassCallbacks.evaluate(RunBeforeTestClassCallbacks.java:61)
16-Mar-2020 14:43:09         at org.junit.internal.runners.statements.RunAfters.evaluate(RunAfters.java:27)
16-Mar-2020 14:43:09         at org.springframework.test.context.junit4.statements.RunAfterTestClassCallbacks.evaluate(RunAfterTestClassCallbacks.java:71)
16-Mar-2020 14:43:09         at org.junit.runners.ParentRunner.run(ParentRunner.java:309)
16-Mar-2020 14:43:09         at org.springframework.test.context.junit4.SpringJUnit4ClassRunner.run(SpringJUnit4ClassRunner.java:174)
16-Mar-2020 14:43:09         at org.apache.maven.surefire.junit4.JUnit4TestSet.execute(JUnit4TestSet.java:59)
16-Mar-2020 14:43:09         at org.apache.maven.surefire.suite.AbstractDirectoryTestSuite.executeTestSet(AbstractDirectoryTestSuite.java:115)
16-Mar-2020 14:43:09         at org.apache.maven.surefire.suite.AbstractDirectoryTestSuite.execute(AbstractDirectoryTestSuite.java:102)
16-Mar-2020 14:43:09         at org.apache.maven.surefire.Surefire.run(Surefire.java:180)
16-Mar-2020 14:43:09         at sun.reflect.NativeMethodAccessorImpl.invoke0(Native Method)
16-Mar-2020 14:43:09         at sun.reflect.NativeMethodAccessorImpl.invoke(NativeMethodAccessorImpl.java:62)
16-Mar-2020 14:43:09         at sun.reflect.DelegatingMethodAccessorImpl.invoke(DelegatingMethodAccessorImpl.java:43)
16-Mar-2020 14:43:09         at java.lang.reflect.Method.invoke(Method.java:498)
16-Mar-2020 14:43:09         at org.apache.maven.surefire.booter.SurefireBooter.runSuitesInProcess(SurefireBooter.java:350)
16-Mar-2020 14:43:09         at org.apache.maven.surefire.booter.SurefireBooter.main(SurefireBooter.java:1021)
16-Mar-2020 14:43:09 ERROR - EncounterSaveHandler.handle(47) |2020-03-16 14:43:09,091| Unable to save complex obs
16-Mar-2020 14:43:09 java.lang.NullPointerException
16-Mar-2020 14:43:09         at org.openmrs.api.handler.EncounterSaveHandler.handle(EncounterSaveHandler.java:39)
16-Mar-2020 14:43:09         at org.openmrs.api.handler.EncounterSaveHandler.handle(EncounterSaveHandler.java:25)
16-Mar-2020 14:43:09         at org.openmrs.aop.RequiredDataAdvice.recursivelyHandle(RequiredDataAdvice.java:266)
16-Mar-2020 14:43:09         at org.openmrs.aop.RequiredDataAdvice.recursivelyHandle(RequiredDataAdvice.java:230)
16-Mar-2020 14:43:09         at org.openmrs.aop.RequiredDataAdvice.before(RequiredDataAdvice.java:135)
16-Mar-2020 14:43:09         at org.springframework.aop.framework.adapter.MethodBeforeAdviceInterceptor.invoke(MethodBeforeAdviceInterceptor.java:49)
16-Mar-2020 14:43:09         at org.springframework.aop.framework.ReflectiveMethodInvocation.proceed(ReflectiveMethodInvocation.java:172)
16-Mar-2020 14:43:09         at org.springframework.aop.framework.adapter.MethodBeforeAdviceInterceptor.invoke(MethodBeforeAdviceInterceptor.java:50)
16-Mar-2020 14:43:09         at org.springframework.aop.framework.ReflectiveMethodInvocation.proceed(ReflectiveMethodInvocation.java:172)
16-Mar-2020 14:43:09         at org.springframework.aop.framework.JdkDynamicAopProxy.invoke(JdkDynamicAopProxy.java:202)
16-Mar-2020 14:43:09         at com.sun.proxy.$Proxy35.saveEncounter(Unknown Source)
16-Mar-2020 14:43:09         at sun.reflect.GeneratedMethodAccessor841.invoke(Unknown Source)
16-Mar-2020 14:43:09         at sun.reflect.DelegatingMethodAccessorImpl.invoke(DelegatingMethodAccessorImpl.java:43)
16-Mar-2020 14:43:09         at java.lang.reflect.Method.invoke(Method.java:498)
16-Mar-2020 14:43:09         at org.springframework.aop.support.AopUtils.invokeJoinpointUsingReflection(AopUtils.java:318)
16-Mar-2020 14:43:09         at org.springframework.aop.framework.ReflectiveMethodInvocation.invokeJoinpoint(ReflectiveMethodInvocation.java:183)
16-Mar-2020 14:43:09         at org.springframework.aop.framework.ReflectiveMethodInvocation.proceed(ReflectiveMethodInvocation.java:150)
16-Mar-2020 14:43:09         at org.springframework.transaction.interceptor.TransactionInterceptor.invoke(TransactionInterceptor.java:110)
16-Mar-2020 14:43:09         at org.springframework.aop.framework.ReflectiveMethodInvocation.proceed(ReflectiveMethodInvocation.java:172)
16-Mar-2020 14:43:09         at org.springframework.aop.framework.JdkDynamicAopProxy.invoke(JdkDynamicAopProxy.java:202)
16-Mar-2020 14:43:09         at com.sun.proxy.$Proxy35.saveEncounter(Unknown Source)
16-Mar-2020 14:43:09         at org.openmrs.api.EncounterServiceTest.saveEncounter_shouldCascadeChangeOfLocationInEncounterToContainedObs(EncounterServiceTest.java:208)
16-Mar-2020 14:43:09         at sun.reflect.NativeMethodAccessorImpl.invoke0(Native Method)
16-Mar-2020 14:43:09         at sun.reflect.NativeMethodAccessorImpl.invoke(NativeMethodAccessorImpl.java:62)
16-Mar-2020 14:43:09         at sun.reflect.DelegatingMethodAccessorImpl.invoke(DelegatingMethodAccessorImpl.java:43)
16-Mar-2020 14:43:09         at java.lang.reflect.Method.invoke(Method.java:498)
16-Mar-2020 14:43:09         at org.junit.runners.model.FrameworkMethod$1.runReflectiveCall(FrameworkMethod.java:47)
16-Mar-2020 14:43:09         at org.junit.internal.runners.model.ReflectiveCallable.run(ReflectiveCallable.java:12)
16-Mar-2020 14:43:09         at org.junit.runners.model.FrameworkMethod.invokeExplosively(FrameworkMethod.java:44)
16-Mar-2020 14:43:09         at org.junit.internal.runners.statements.InvokeMethod.evaluate(InvokeMethod.java:17)
16-Mar-2020 14:43:09         at org.junit.internal.runners.statements.RunBefores.evaluate(RunBefores.java:26)
16-Mar-2020 14:43:09         at org.springframework.test.context.junit4.statements.RunBeforeTestMethodCallbacks.evaluate(RunBeforeTestMethodCallbacks.java:74)
16-Mar-2020 14:43:09         at org.junit.internal.runners.statements.RunAfters.evaluate(RunAfters.java:27)
16-Mar-2020 14:43:09         at org.springframework.test.context.junit4.statements.RunAfterTestMethodCallbacks.evaluate(RunAfterTestMethodCallbacks.java:83)
16-Mar-2020 14:43:09         at org.springframework.test.context.junit4.statements.SpringRepeat.evaluate(SpringRepeat.java:72)
16-Mar-2020 14:43:09         at org.springframework.test.context.junit4.SpringJUnit4ClassRunner.runChild(SpringJUnit4ClassRunner.java:231)
16-Mar-2020 14:43:09         at org.junit.runners.BlockJUnit4ClassRunner.runChild(BlockJUnit4ClassRunner.java:50)
16-Mar-2020 14:43:09         at org.junit.runners.ParentRunner$3.run(ParentRunner.java:238)
16-Mar-2020 14:43:09         at org.junit.runners.ParentRunner$1.schedule(ParentRunner.java:63)
16-Mar-2020 14:43:09         at org.junit.runners.ParentRunner.runChildren(ParentRunner.java:236)
16-Mar-2020 14:43:09         at org.junit.runners.ParentRunner.access$000(ParentRunner.java:53)
16-Mar-2020 14:43:09         at org.junit.runners.ParentRunner$2.evaluate(ParentRunner.java:229)
16-Mar-2020 14:43:09         at org.springframework.test.context.junit4.statements.RunBeforeTestClassCallbacks.evaluate(RunBeforeTestClassCallbacks.java:61)
16-Mar-2020 14:43:09         at org.junit.internal.runners.statements.RunAfters.evaluate(RunAfters.java:27)
16-Mar-2020 14:43:09         at org.springframework.test.context.junit4.statements.RunAfterTestClassCallbacks.evaluate(RunAfterTestClassCallbacks.java:71)
16-Mar-2020 14:43:09         at org.junit.runners.ParentRunner.run(ParentRunner.java:309)
16-Mar-2020 14:43:09         at org.springframework.test.context.junit4.SpringJUnit4ClassRunner.run(SpringJUnit4ClassRunner.java:174)
16-Mar-2020 14:43:09         at org.apache.maven.surefire.junit4.JUnit4TestSet.execute(JUnit4TestSet.java:59)
16-Mar-2020 14:43:09         at org.apache.maven.surefire.suite.AbstractDirectoryTestSuite.executeTestSet(AbstractDirectoryTestSuite.java:115)
16-Mar-2020 14:43:09         at org.apache.maven.surefire.suite.AbstractDirectoryTestSuite.execute(AbstractDirectoryTestSuite.java:102)
16-Mar-2020 14:43:09         at org.apache.maven.surefire.Surefire.run(Surefire.java:180)
16-Mar-2020 14:43:09         at sun.reflect.NativeMethodAccessorImpl.invoke0(Native Method)
16-Mar-2020 14:43:09         at sun.reflect.NativeMethodAccessorImpl.invoke(NativeMethodAccessorImpl.java:62)
16-Mar-2020 14:43:09         at sun.reflect.DelegatingMethodAccessorImpl.invoke(DelegatingMethodAccessorImpl.java:43)
16-Mar-2020 14:43:09         at java.lang.reflect.Method.invoke(Method.java:498)
16-Mar-2020 14:43:09         at org.apache.maven.surefire.booter.SurefireBooter.runSuitesInProcess(SurefireBooter.java:350)
16-Mar-2020 14:43:09         at org.apache.maven.surefire.booter.SurefireBooter.main(SurefireBooter.java:1021)
16-Mar-2020 14:43:11 Tests run: 101, Failures: 0, Errors: 0, Skipped: 3, Time elapsed: 12.478 sec
16-Mar-2020 14:43:11 Running org.openmrs.api.OrderServiceTest
16-Mar-2020 14:43:26 Tests run: 150, Failures: 0, Errors: 0, Skipped: 0, Time elapsed: 15.347 sec
16-Mar-2020 14:43:26 Running org.openmrs.propertyeditor.VisitEditorTest
16-Mar-2020 14:43:26 Tests run: 2, Failures: 0, Errors: 0, Skipped: 0, Time elapsed: 0.174 sec
16-Mar-2020 14:43:26 Running org.openmrs.api.handler.RequiredReasonVoidSaveHandlerTest
16-Mar-2020 14:43:27 Tests run: 5, Failures: 0, Errors: 0, Skipped: 0, Time elapsed: 0.493 sec
16-Mar-2020 14:43:27 Running org.openmrs.validator.ProviderValidatorTest
16-Mar-2020 14:43:28 Tests run: 14, Failures: 0, Errors: 0, Skipped: 0, Time elapsed: 1.388 sec
16-Mar-2020 14:43:28 Running org.openmrs.propertyeditor.ProgramWorkflowStateEditorTest
16-Mar-2020 14:43:28 Tests run: 2, Failures: 0, Errors: 0, Skipped: 0, Time elapsed: 0.169 sec
16-Mar-2020 14:43:28 Running org.openmrs.propertyeditor.ConceptAnswerEditorTest
16-Mar-2020 14:43:29 Tests run: 2, Failures: 0, Errors: 0, Skipped: 0, Time elapsed: 0.268 sec
16-Mar-2020 14:43:29 Running org.openmrs.EncounterRoleTest
16-Mar-2020 14:43:29 Tests run: 1, Failures: 0, Errors: 0, Skipped: 0, Time elapsed: 0.001 sec
16-Mar-2020 14:43:29 Running org.openmrs.api.handler.OpenmrsMetadataSaveHandlerTest
16-Mar-2020 14:43:29 Tests run: 2, Failures: 0, Errors: 0, Skipped: 0, Time elapsed: 0.001 sec
16-Mar-2020 14:43:29 Running org.openmrs.api.ConceptServiceTest
16-Mar-2020 14:43:42 ERROR - JDBCExceptionReporter.logExceptions(234) |2020-03-16 14:43:42,222| NULL not allowed for column "DESCRIPTION"; SQL statement:
16-Mar-2020 14:43:42 insert into concept_name_tag (concept_name_tag_id, tag, description, date_created, creator, voided, date_voided, void_reason, voided_by, uuid) values (null, ?, ?, ?, ?, ?, ?, ?, ?, ?) [23502-187]
16-Mar-2020 14:43:44 ERROR - JDBCExceptionReporter.logExceptions(234) |2020-03-16 14:43:44,720| NULL not allowed for column "DESCRIPTION"; SQL statement:
16-Mar-2020 14:43:44 insert into concept_name_tag (concept_name_tag_id, tag, description, date_created, creator, voided, date_voided, void_reason, voided_by, uuid) values (null, ?, ?, ?, ?, ?, ?, ?, ?, ?) [23502-187]
16-Mar-2020 14:43:48 Tests run: 199, Failures: 0, Errors: 0, Skipped: 0, Time elapsed: 19.624 sec
16-Mar-2020 14:43:48 Running org.openmrs.validator.ProgramValidatorTest
16-Mar-2020 14:43:49 Tests run: 5, Failures: 0, Errors: 0, Skipped: 0, Time elapsed: 0.539 sec
16-Mar-2020 14:43:49 Running org.openmrs.ConceptWordTest
16-Mar-2020 14:43:49 Tests run: 2, Failures: 0, Errors: 0, Skipped: 0, Time elapsed: 0.187 sec
16-Mar-2020 14:43:49 Running org.openmrs.hl7.HL7ServiceTest
16-Mar-2020 14:43:52 Tests run: 26, Failures: 0, Errors: 0, Skipped: 2, Time elapsed: 2.996 sec
16-Mar-2020 14:43:52 Running org.openmrs.propertyeditor.PrivilegeEditorTest
16-Mar-2020 14:43:52 Tests run: 2, Failures: 0, Errors: 0, Skipped: 0, Time elapsed: 0.202 sec
16-Mar-2020 14:43:52 Running org.openmrs.propertyeditor.PersonEditorTest
16-Mar-2020 14:43:52 Tests run: 2, Failures: 0, Errors: 0, Skipped: 0, Time elapsed: 0.217 sec
16-Mar-2020 14:43:52 Running org.openmrs.api.db.hibernate.ImmutableEntityInterceptorTest
16-Mar-2020 14:43:52 Tests run: 4, Failures: 0, Errors: 0, Skipped: 0, Time elapsed: 0.006 sec
16-Mar-2020 14:43:52 Running org.openmrs.api.db.SerializedObjectDAOTest
16-Mar-2020 14:43:54 Tests run: 9, Failures: 0, Errors: 0, Skipped: 0, Time elapsed: 1.796 sec
16-Mar-2020 14:43:54 Running org.openmrs.module.ModuleInteroperabilityTest
16-Mar-2020 14:43:54 ERROR - BatchingBatcher.doExecuteBatch(73) |2020-03-16 14:43:54,702| Exception executing batch:
16-Mar-2020 14:43:54 org.hibernate.StaleStateException: Batch update returned unexpected row count from update [0]; actual row count: 0; expected: 1
16-Mar-2020 14:43:54         at org.hibernate.jdbc.Expectations$BasicExpectation.checkBatched(Expectations.java:85)
16-Mar-2020 14:43:54         at org.hibernate.jdbc.Expectations$BasicExpectation.verifyOutcome(Expectations.java:70)
16-Mar-2020 14:43:54         at org.hibernate.jdbc.BatchingBatcher.checkRowCounts(BatchingBatcher.java:90)
16-Mar-2020 14:43:54         at org.hibernate.jdbc.BatchingBatcher.doExecuteBatch(BatchingBatcher.java:70)
16-Mar-2020 14:43:54         at org.hibernate.jdbc.AbstractBatcher.executeBatch(AbstractBatcher.java:268)
16-Mar-2020 14:43:54         at org.hibernate.engine.ActionQueue.executeActions(ActionQueue.java:268)
16-Mar-2020 14:43:54         at org.hibernate.engine.ActionQueue.executeActions(ActionQueue.java:185)
16-Mar-2020 14:43:54         at org.hibernate.event.def.AbstractFlushingEventListener.performExecutions(AbstractFlushingEventListener.java:321)
16-Mar-2020 14:43:54         at org.hibernate.event.def.DefaultFlushEventListener.onFlush(DefaultFlushEventListener.java:51)
16-Mar-2020 14:43:54         at org.hibernate.impl.SessionImpl.flush(SessionImpl.java:1216)
16-Mar-2020 14:43:54         at org.hibernate.impl.SessionImpl.managedFlush(SessionImpl.java:383)
16-Mar-2020 14:43:54         at org.hibernate.transaction.JDBCTransaction.commit(JDBCTransaction.java:133)
16-Mar-2020 14:43:54         at org.springframework.orm.hibernate3.HibernateTransactionManager.doCommit(HibernateTransactionManager.java:656)
16-Mar-2020 14:43:54         at org.springframework.transaction.support.AbstractPlatformTransactionManager.processCommit(AbstractPlatformTransactionManager.java:754)
16-Mar-2020 14:43:54         at org.springframework.transaction.support.AbstractPlatformTransactionManager.commit(AbstractPlatformTransactionManager.java:723)
16-Mar-2020 14:43:54         at org.springframework.transaction.interceptor.TransactionAspectSupport.commitTransactionAfterReturning(TransactionAspectSupport.java:393)
16-Mar-2020 14:43:54         at org.springframework.transaction.interceptor.TransactionInterceptor.invoke(TransactionInterceptor.java:120)
16-Mar-2020 14:43:54         at org.springframework.aop.framework.ReflectiveMethodInvocation.proceed(ReflectiveMethodInvocation.java:172)
16-Mar-2020 14:43:54         at org.springframework.aop.framework.JdkDynamicAopProxy.invoke(JdkDynamicAopProxy.java:202)
16-Mar-2020 14:43:54         at com.sun.proxy.$Proxy68.saveRole(Unknown Source)
16-Mar-2020 14:43:54         at org.openmrs.api.context.Context.checkCoreDataset(Context.java:1006)
16-Mar-2020 14:43:54         at org.openmrs.module.ModuleFactory.startModuleInternal(ModuleFactory.java:556)
16-Mar-2020 14:43:54         at org.openmrs.api.context.Daemon$1.run(Daemon.java:57)
16-Mar-2020 14:43:54 ERROR - Context.checkCoreDataset(1011) |2020-03-16 14:43:54,706| Error while setting core roles for openmrs system
16-Mar-2020 14:43:54 org.springframework.orm.hibernate3.HibernateOptimisticLockingFailureException: Batch update returned unexpected row count from update [0]; actual row count: 0; expected: 1; nested exception is org.hibernate.StaleStateException: Batch update returned unexpected row count from update [0]; actual row count: 0; expected: 1
16-Mar-2020 14:43:54         at org.springframework.orm.hibernate3.SessionFactoryUtils.convertHibernateAccessException(SessionFactoryUtils.java:679)
16-Mar-2020 14:43:54         at org.springframework.orm.hibernate3.HibernateTransactionManager.convertHibernateAccessException(HibernateTransactionManager.java:793)
16-Mar-2020 14:43:54         at org.springframework.orm.hibernate3.HibernateTransactionManager.doCommit(HibernateTransactionManager.java:664)
16-Mar-2020 14:43:54         at org.springframework.transaction.support.AbstractPlatformTransactionManager.processCommit(AbstractPlatformTransactionManager.java:754)
16-Mar-2020 14:43:54         at org.springframework.transaction.support.AbstractPlatformTransactionManager.commit(AbstractPlatformTransactionManager.java:723)
16-Mar-2020 14:43:54         at org.springframework.transaction.interceptor.TransactionAspectSupport.commitTransactionAfterReturning(TransactionAspectSupport.java:393)
16-Mar-2020 14:43:54         at org.springframework.transaction.interceptor.TransactionInterceptor.invoke(TransactionInterceptor.java:120)
16-Mar-2020 14:43:54         at org.springframework.aop.framework.ReflectiveMethodInvocation.proceed(ReflectiveMethodInvocation.java:172)
16-Mar-2020 14:43:54         at org.springframework.aop.framework.JdkDynamicAopProxy.invoke(JdkDynamicAopProxy.java:202)
16-Mar-2020 14:43:54         at com.sun.proxy.$Proxy68.saveRole(Unknown Source)
16-Mar-2020 14:43:54         at org.openmrs.api.context.Context.checkCoreDataset(Context.java:1006)
16-Mar-2020 14:43:54         at org.openmrs.module.ModuleFactory.startModuleInternal(ModuleFactory.java:556)
16-Mar-2020 14:43:54         at org.openmrs.api.context.Daemon$1.run(Daemon.java:57)
16-Mar-2020 14:43:54 Caused by: org.hibernate.StaleStateException: Batch update returned unexpected row count from update [0]; actual row count: 0; expected: 1
16-Mar-2020 14:43:54         at org.hibernate.jdbc.Expectations$BasicExpectation.checkBatched(Expectations.java:85)
16-Mar-2020 14:43:54         at org.hibernate.jdbc.Expectations$BasicExpectation.verifyOutcome(Expectations.java:70)
16-Mar-2020 14:43:54         at org.hibernate.jdbc.BatchingBatcher.checkRowCounts(BatchingBatcher.java:90)
16-Mar-2020 14:43:54         at org.hibernate.jdbc.BatchingBatcher.doExecuteBatch(BatchingBatcher.java:70)
16-Mar-2020 14:43:54         at org.hibernate.jdbc.AbstractBatcher.executeBatch(AbstractBatcher.java:268)
16-Mar-2020 14:43:54         at org.hibernate.engine.ActionQueue.executeActions(ActionQueue.java:268)
16-Mar-2020 14:43:54         at org.hibernate.engine.ActionQueue.executeActions(ActionQueue.java:185)
16-Mar-2020 14:43:54         at org.hibernate.event.def.AbstractFlushingEventListener.performExecutions(AbstractFlushingEventListener.java:321)
16-Mar-2020 14:43:54         at org.hibernate.event.def.DefaultFlushEventListener.onFlush(DefaultFlushEventListener.java:51)
16-Mar-2020 14:43:54         at org.hibernate.impl.SessionImpl.flush(SessionImpl.java:1216)
16-Mar-2020 14:43:54         at org.hibernate.impl.SessionImpl.managedFlush(SessionImpl.java:383)
16-Mar-2020 14:43:54         at org.hibernate.transaction.JDBCTransaction.commit(JDBCTransaction.java:133)
16-Mar-2020 14:43:54         at org.springframework.orm.hibernate3.HibernateTransactionManager.doCommit(HibernateTransactionManager.java:656)
16-Mar-2020 14:43:54         ... 10 more
16-Mar-2020 14:43:55 Tests run: 1, Failures: 0, Errors: 0, Skipped: 0, Time elapsed: 0.624 sec
16-Mar-2020 14:43:55 Running org.openmrs.util.PersonByNameComparatorTest
16-Mar-2020 14:43:55 Tests run: 4, Failures: 0, Errors: 0, Skipped: 0, Time elapsed: 0.005 sec
16-Mar-2020 14:43:55 Running org.openmrs.report.ReportSchemaXmlTest
16-Mar-2020 14:43:55 Tests run: 2, Failures: 0, Errors: 0, Skipped: 0, Time elapsed: 0.23 sec
16-Mar-2020 14:43:55 Running org.openmrs.validator.PersonAddressValidatorTest
16-Mar-2020 14:43:56 Tests run: 6, Failures: 0, Errors: 0, Skipped: 0, Time elapsed: 0.587 sec
16-Mar-2020 14:43:56 Running org.openmrs.util.DrugsByNameComparatorTest
16-Mar-2020 14:43:56 Tests run: 4, Failures: 0, Errors: 0, Skipped: 0, Time elapsed: 0.002 sec
16-Mar-2020 14:43:56 Running org.openmrs.cohort.CohortUtilTest
16-Mar-2020 14:43:56 Tests run: 1, Failures: 0, Errors: 0, Skipped: 0, Time elapsed: 0.099 sec
16-Mar-2020 14:43:56 Running org.openmrs.arden.ArdenServiceTest
16-Mar-2020 14:43:56 Tests run: 1, Failures: 0, Errors: 0, Skipped: 1, Time elapsed: 0.001 sec
16-Mar-2020 14:43:56 Running org.openmrs.OrderTypeTest
16-Mar-2020 14:43:56 Tests run: 3, Failures: 0, Errors: 0, Skipped: 0, Time elapsed: 0.001 sec
16-Mar-2020 14:43:56 Running org.openmrs.validator.RoleValidatorTest
16-Mar-2020 14:43:56 Tests run: 4, Failures: 0, Errors: 0, Skipped: 0, Time elapsed: 0.002 sec
16-Mar-2020 14:43:56 Running org.openmrs.report.PepfarReportTest
16-Mar-2020 14:43:56 Tests run: 1, Failures: 0, Errors: 0, Skipped: 0, Time elapsed: 0.107 sec
16-Mar-2020 14:43:56 Running org.openmrs.api.handler.RequireVoidReasonVoidHandlerTest
16-Mar-2020 14:43:56 Tests run: 5, Failures: 0, Errors: 0, Skipped: 0, Time elapsed: 0.517 sec
16-Mar-2020 14:43:56 Running org.openmrs.notification.db.hibernate.HibernateAlertDAOTest
16-Mar-2020 14:43:56 Tests run: 1, Failures: 0, Errors: 0, Skipped: 0, Time elapsed: 0.098 sec
16-Mar-2020 14:43:56 Running org.openmrs.api.handler.ExistingOrNewVisitAssignmentHandlerTest
16-Mar-2020 14:43:57 Tests run: 4, Failures: 0, Errors: 0, Skipped: 0, Time elapsed: 0.455 sec
16-Mar-2020 14:43:57 Running org.openmrs.propertyeditor.ProviderEditorTest
16-Mar-2020 14:43:57 Tests run: 2, Failures: 0, Errors: 0, Skipped: 0, Time elapsed: 0.221 sec
16-Mar-2020 14:43:57 Running org.openmrs.reporting.export.RowPerObsDataExportTest
16-Mar-2020 14:44:00 Tests run: 2, Failures: 0, Errors: 0, Skipped: 0, Time elapsed: 3.314 sec
16-Mar-2020 14:44:00 Running org.openmrs.validator.PatientValidatorTest
16-Mar-2020 14:44:02 Tests run: 9, Failures: 0, Errors: 0, Skipped: 0, Time elapsed: 1.085 sec
16-Mar-2020 14:44:02 Running org.openmrs.util.LocationUtilityTest
16-Mar-2020 14:44:02 Tests run: 2, Failures: 0, Errors: 0, Skipped: 0, Time elapsed: 0.231 sec
16-Mar-2020 14:44:02 Running org.openmrs.api.context.ContextTest
16-Mar-2020 14:44:03 Tests run: 16, Failures: 0, Errors: 0, Skipped: 0, Time elapsed: 1.477 sec
16-Mar-2020 14:44:03 Running org.openmrs.api.handler.PersonVoidHandlerTest
16-Mar-2020 14:44:04 Tests run: 8, Failures: 0, Errors: 0, Skipped: 0, Time elapsed: 0.748 sec
16-Mar-2020 14:44:04 Running org.openmrs.propertyeditor.PersonAttributeTypeEditorTest
16-Mar-2020 14:44:04 Tests run: 2, Failures: 0, Errors: 0, Skipped: 0, Time elapsed: 0.263 sec
16-Mar-2020 14:44:04 Running org.openmrs.logic.result.EmptyResultTest
16-Mar-2020 14:44:04 Tests run: 2, Failures: 0, Errors: 0, Skipped: 0, Time elapsed: 0.001 sec
16-Mar-2020 14:44:04 Running org.openmrs.EncounterTypeTest
16-Mar-2020 14:44:04 Tests run: 1, Failures: 0, Errors: 0, Skipped: 0, Time elapsed: 0.001 sec
16-Mar-2020 14:44:04 Running org.openmrs.api.db.EncounterDAOTest
16-Mar-2020 14:44:04 Tests run: 1, Failures: 0, Errors: 0, Skipped: 0, Time elapsed: 0.188 sec
16-Mar-2020 14:44:04 Running org.openmrs.api.handler.BaseVoidHandlerTest
16-Mar-2020 14:44:04 Tests run: 8, Failures: 0, Errors: 0, Skipped: 0, Time elapsed: 0.003 sec
16-Mar-2020 14:44:04 Running org.openmrs.validator.OrderTypeValidatorTest
16-Mar-2020 14:44:05 Tests run: 12, Failures: 0, Errors: 0, Skipped: 0, Time elapsed: 1.045 sec
16-Mar-2020 14:44:05 Running org.openmrs.validator.FormValidatorTest
16-Mar-2020 14:44:06 Tests run: 6, Failures: 0, Errors: 0, Skipped: 0, Time elapsed: 0.547 sec
16-Mar-2020 14:44:06 Running org.openmrs.util.HandlerUtilTest
16-Mar-2020 14:44:07 Tests run: 6, Failures: 0, Errors: 0, Skipped: 0, Time elapsed: 0.668 sec
16-Mar-2020 14:44:07 Running org.openmrs.validator.AlertValidatorTest
16-Mar-2020 14:44:07 Tests run: 2, Failures: 0, Errors: 0, Skipped: 0, Time elapsed: 0.004 sec
16-Mar-2020 14:44:07 Running org.openmrs.messagesource.MessageSourceServiceTest
16-Mar-2020 14:44:07 Tests run: 1, Failures: 0, Errors: 0, Skipped: 0, Time elapsed: 0.12 sec
16-Mar-2020 14:44:07 Running org.openmrs.api.db.PatientDAOTest
16-Mar-2020 14:44:08 Tests run: 11, Failures: 0, Errors: 0, Skipped: 0, Time elapsed: 1.435 sec
16-Mar-2020 14:44:08 Running org.openmrs.customdatatype.datatype.DateDatatypeTest
16-Mar-2020 14:44:08 Tests run: 2, Failures: 0, Errors: 0, Skipped: 0, Time elapsed: 0.002 sec
16-Mar-2020 14:44:08 Running org.openmrs.propertyeditor.ProgramEditorTest
16-Mar-2020 14:44:09 Tests run: 4, Failures: 0, Errors: 0, Skipped: 0, Time elapsed: 0.439 sec
16-Mar-2020 14:44:09 Running org.openmrs.validator.PrivilegeValidatorTest
16-Mar-2020 14:44:09 Tests run: 3, Failures: 0, Errors: 0, Skipped: 0, Time elapsed: 0.002 sec
16-Mar-2020 14:44:09 Running org.openmrs.aop.RequiredDataAdviceTest
16-Mar-2020 14:44:09 Tests run: 26, Failures: 0, Errors: 0, Skipped: 0, Time elapsed: 0.305 sec
16-Mar-2020 14:44:09 Running org.openmrs.util.OpenmrsSecurityManagerTest
16-Mar-2020 14:44:09 Tests run: 2, Failures: 0, Errors: 0, Skipped: 0, Time elapsed: 0.001 sec
16-Mar-2020 14:44:09 Running org.openmrs.api.impl.SerializationServiceImplTest
16-Mar-2020 14:44:09 Tests run: 1, Failures: 0, Errors: 0, Skipped: 0, Time elapsed: 0.002 sec
16-Mar-2020 14:44:09 Running org.openmrs.ConceptTest
16-Mar-2020 14:44:09 Tests run: 57, Failures: 0, Errors: 0, Skipped: 0, Time elapsed: 0.088 sec
16-Mar-2020 14:44:09 Running org.openmrs.customdatatype.datatype.RegexValidatedTextTest
16-Mar-2020 14:44:09 Tests run: 3, Failures: 0, Errors: 0, Skipped: 0, Time elapsed: 0.002 sec
16-Mar-2020 14:44:09 Running org.openmrs.api.PersonServiceTest
16-Mar-2020 14:44:21 Tests run: 112, Failures: 0, Errors: 0, Skipped: 2, Time elapsed: 11.485 sec
16-Mar-2020 14:44:21 Running org.openmrs.reporting.ReportObjectServiceTest
16-Mar-2020 14:44:21 ERROR - OpenmrsUtil.toPatientFilter(1795) |2020-03-16 14:44:21,181| error converting "${howManyDays}" to class java.lang.Integer
16-Mar-2020 14:44:21 java.lang.reflect.InvocationTargetException
16-Mar-2020 14:44:21         at sun.reflect.NativeMethodAccessorImpl.invoke0(Native Method)
16-Mar-2020 14:44:21         at sun.reflect.NativeMethodAccessorImpl.invoke(NativeMethodAccessorImpl.java:62)
16-Mar-2020 14:44:21         at sun.reflect.DelegatingMethodAccessorImpl.invoke(DelegatingMethodAccessorImpl.java:43)
16-Mar-2020 14:44:21         at java.lang.reflect.Method.invoke(Method.java:498)
16-Mar-2020 14:44:21         at org.openmrs.util.OpenmrsUtil.toPatientFilter(OpenmrsUtil.java:1728)
16-Mar-2020 14:44:21         at org.openmrs.util.OpenmrsUtil.toPatientFilter(OpenmrsUtil.java:1550)
16-Mar-2020 14:44:21         at org.openmrs.cohort.CohortSearchHistory.addSearchItem(CohortSearchHistory.java:210)
16-Mar-2020 14:44:21         at org.openmrs.reporting.ReportObjectServiceTest.saveSearchHistory_shouldSaveHistorySuccessfully(ReportObjectServiceTest.java:46)
16-Mar-2020 14:44:21         at sun.reflect.NativeMethodAccessorImpl.invoke0(Native Method)
16-Mar-2020 14:44:21         at sun.reflect.NativeMethodAccessorImpl.invoke(NativeMethodAccessorImpl.java:62)
16-Mar-2020 14:44:21         at sun.reflect.DelegatingMethodAccessorImpl.invoke(DelegatingMethodAccessorImpl.java:43)
16-Mar-2020 14:44:21         at java.lang.reflect.Method.invoke(Method.java:498)
16-Mar-2020 14:44:21         at org.junit.runners.model.FrameworkMethod$1.runReflectiveCall(FrameworkMethod.java:47)
16-Mar-2020 14:44:21         at org.junit.internal.runners.model.ReflectiveCallable.run(ReflectiveCallable.java:12)
16-Mar-2020 14:44:21         at org.junit.runners.model.FrameworkMethod.invokeExplosively(FrameworkMethod.java:44)
16-Mar-2020 14:44:21         at org.junit.internal.runners.statements.InvokeMethod.evaluate(InvokeMethod.java:17)
16-Mar-2020 14:44:21         at org.junit.internal.runners.statements.RunBefores.evaluate(RunBefores.java:26)
16-Mar-2020 14:44:21         at org.springframework.test.context.junit4.statements.RunBeforeTestMethodCallbacks.evaluate(RunBeforeTestMethodCallbacks.java:74)
16-Mar-2020 14:44:21         at org.junit.internal.runners.statements.RunAfters.evaluate(RunAfters.java:27)
16-Mar-2020 14:44:21         at org.springframework.test.context.junit4.statements.RunAfterTestMethodCallbacks.evaluate(RunAfterTestMethodCallbacks.java:83)
16-Mar-2020 14:44:21         at org.springframework.test.context.junit4.statements.SpringRepeat.evaluate(SpringRepeat.java:72)
16-Mar-2020 14:44:21         at org.springframework.test.context.junit4.SpringJUnit4ClassRunner.runChild(SpringJUnit4ClassRunner.java:231)
16-Mar-2020 14:44:21         at org.junit.runners.BlockJUnit4ClassRunner.runChild(BlockJUnit4ClassRunner.java:50)
16-Mar-2020 14:44:21         at org.junit.runners.ParentRunner$3.run(ParentRunner.java:238)
16-Mar-2020 14:44:21         at org.junit.runners.ParentRunner$1.schedule(ParentRunner.java:63)
16-Mar-2020 14:44:21         at org.junit.runners.ParentRunner.runChildren(ParentRunner.java:236)
16-Mar-2020 14:44:21         at org.junit.runners.ParentRunner.access$000(ParentRunner.java:53)
16-Mar-2020 14:44:21         at org.junit.runners.ParentRunner$2.evaluate(ParentRunner.java:229)
16-Mar-2020 14:44:21         at org.springframework.test.context.junit4.statements.RunBeforeTestClassCallbacks.evaluate(RunBeforeTestClassCallbacks.java:61)
16-Mar-2020 14:44:21         at org.junit.internal.runners.statements.RunAfters.evaluate(RunAfters.java:27)
16-Mar-2020 14:44:21         at org.springframework.test.context.junit4.statements.RunAfterTestClassCallbacks.evaluate(RunAfterTestClassCallbacks.java:71)
16-Mar-2020 14:44:21         at org.junit.runners.ParentRunner.run(ParentRunner.java:309)
16-Mar-2020 14:44:21         at org.springframework.test.context.junit4.SpringJUnit4ClassRunner.run(SpringJUnit4ClassRunner.java:174)
16-Mar-2020 14:44:21         at org.apache.maven.surefire.junit4.JUnit4TestSet.execute(JUnit4TestSet.java:59)
16-Mar-2020 14:44:21         at org.apache.maven.surefire.suite.AbstractDirectoryTestSuite.executeTestSet(AbstractDirectoryTestSuite.java:115)
16-Mar-2020 14:44:21         at org.apache.maven.surefire.suite.AbstractDirectoryTestSuite.execute(AbstractDirectoryTestSuite.java:102)
16-Mar-2020 14:44:21         at org.apache.maven.surefire.Surefire.run(Surefire.java:180)
16-Mar-2020 14:44:21         at sun.reflect.NativeMethodAccessorImpl.invoke0(Native Method)
16-Mar-2020 14:44:21         at sun.reflect.NativeMethodAccessorImpl.invoke(NativeMethodAccessorImpl.java:62)
16-Mar-2020 14:44:21         at sun.reflect.DelegatingMethodAccessorImpl.invoke(DelegatingMethodAccessorImpl.java:43)
16-Mar-2020 14:44:21         at java.lang.reflect.Method.invoke(Method.java:498)
16-Mar-2020 14:44:21         at org.apache.maven.surefire.booter.SurefireBooter.runSuitesInProcess(SurefireBooter.java:350)
16-Mar-2020 14:44:21         at org.apache.maven.surefire.booter.SurefireBooter.main(SurefireBooter.java:1021)
16-Mar-2020 14:44:21 Caused by: java.lang.NumberFormatException: For input string: "${howManyDays}"
16-Mar-2020 14:44:21         at java.lang.NumberFormatException.forInputString(NumberFormatException.java:65)
16-Mar-2020 14:44:21         at java.lang.Integer.parseInt(Integer.java:569)
16-Mar-2020 14:44:21         at java.lang.Integer.valueOf(Integer.java:766)
16-Mar-2020 14:44:21         ... 43 more
16-Mar-2020 14:44:21 Tests run: 1, Failures: 0, Errors: 0, Skipped: 0, Time elapsed: 0.128 sec
16-Mar-2020 14:44:21 Running org.openmrs.validator.FieldTypeValidatorTest
16-Mar-2020 14:44:21 Tests run: 2, Failures: 0, Errors: 0, Skipped: 0, Time elapsed: 0.001 sec
16-Mar-2020 14:44:21 Running org.openmrs.PatientProgramTest
16-Mar-2020 14:44:21 Tests run: 2, Failures: 0, Errors: 0, Skipped: 0, Time elapsed: 0.001 sec
16-Mar-2020 14:44:21 Running org.openmrs.report.EvaluationContextTest
16-Mar-2020 14:44:21 Tests run: 1, Failures: 0, Errors: 0, Skipped: 0, Time elapsed: 0.002 sec
16-Mar-2020 14:44:21 Running org.openmrs.validator.PatientProgramValidatorTest
16-Mar-2020 14:44:22 Tests run: 16, Failures: 0, Errors: 0, Skipped: 0, Time elapsed: 1.481 sec
16-Mar-2020 14:44:22 Running org.openmrs.api.db.hibernate.AuditableInterceptorTest
16-Mar-2020 14:44:23 Tests run: 10, Failures: 0, Errors: 0, Skipped: 0, Time elapsed: 0.893 sec
16-Mar-2020 14:44:23 Running org.openmrs.validator.BaseAttributeTypeValidatorTest
16-Mar-2020 14:44:23 Tests run: 5, Failures: 0, Errors: 0, Skipped: 0, Time elapsed: 0.004 sec
16-Mar-2020 14:44:23 Running org.openmrs.OpenmrsTestsTest
16-Mar-2020 14:44:23 Tests run: 4, Failures: 0, Errors: 0, Skipped: 0, Time elapsed: 0.141 sec
16-Mar-2020 14:44:23 Running org.openmrs.api.VisitServiceTest
16-Mar-2020 14:44:29 Tests run: 59, Failures: 0, Errors: 0, Skipped: 0, Time elapsed: 5.589 sec
16-Mar-2020 14:44:29 Running org.openmrs.api.handler.OpenmrsObjectSaveHandlerTest
16-Mar-2020 14:44:29 Tests run: 5, Failures: 0, Errors: 0, Skipped: 0, Time elapsed: 0.003 sec
16-Mar-2020 14:44:29 Running org.openmrs.util.HttpClientTest
16-Mar-2020 14:44:29 Tests run: 1, Failures: 0, Errors: 0, Skipped: 0, Time elapsed: 0.017 sec
16-Mar-2020 14:44:29 Running org.openmrs.util.HttpUrlTest
16-Mar-2020 14:44:29 Tests run: 4, Failures: 0, Errors: 0, Skipped: 0, Time elapsed: 0.002 sec
16-Mar-2020 14:44:29 Running org.openmrs.validator.ValidateUtilTest
16-Mar-2020 14:44:29 Tests run: 4, Failures: 0, Errors: 0, Skipped: 0, Time elapsed: 0.471 sec
16-Mar-2020 14:44:29 Running org.openmrs.attribute.AttributeIntegrationTest
16-Mar-2020 14:44:29 Tests run: 1, Failures: 0, Errors: 0, Skipped: 0, Time elapsed: 0.109 sec
16-Mar-2020 14:44:29 Running org.openmrs.propertyeditor.UserEditorTest
16-Mar-2020 14:44:30 Tests run: 2, Failures: 0, Errors: 0, Skipped: 0, Time elapsed: 0.194 sec
16-Mar-2020 14:44:30 Running org.openmrs.validator.RelationshipTypeValidatorTest
16-Mar-2020 14:44:30 Tests run: 3, Failures: 0, Errors: 0, Skipped: 0, Time elapsed: 0.003 sec
16-Mar-2020 14:44:30 Running org.openmrs.validator.VisitValidatorTest
16-Mar-2020 14:44:31 Tests run: 18, Failures: 0, Errors: 0, Skipped: 1, Time elapsed: 1.847 sec
16-Mar-2020 14:44:31 Running org.openmrs.util.SecurityTest
16-Mar-2020 14:44:32 Tests run: 7, Failures: 0, Errors: 0, Skipped: 0, Time elapsed: 0.491 sec
16-Mar-2020 14:44:32 Running org.openmrs.module.ModuleUtilTest
16-Mar-2020 14:44:32 Tests run: 32, Failures: 0, Errors: 0, Skipped: 0, Time elapsed: 0.203 sec
16-Mar-2020 14:44:32 Running org.openmrs.serialization.SimpleXStreamSerializerTest
16-Mar-2020 14:44:32 Tests run: 5, Failures: 0, Errors: 0, Skipped: 0, Time elapsed: 0.065 sec
16-Mar-2020 14:44:32 Running org.openmrs.api.db.VisitDAOTest
16-Mar-2020 14:44:33 Tests run: 3, Failures: 0, Errors: 0, Skipped: 0, Time elapsed: 0.309 sec
16-Mar-2020 14:44:33 Running org.openmrs.api.handler.BaseUnvoidHandlerTest
16-Mar-2020 14:44:33 Tests run: 6, Failures: 0, Errors: 0, Skipped: 0, Time elapsed: 0.001 sec
16-Mar-2020 14:44:33 Running org.openmrs.propertyeditor.EncounterEditorTest
16-Mar-2020 14:44:33 Tests run: 2, Failures: 0, Errors: 0, Skipped: 0, Time elapsed: 0.182 sec
16-Mar-2020 14:44:33 Running org.openmrs.PersonAddressTest
16-Mar-2020 14:44:33 Tests run: 15, Failures: 0, Errors: 0, Skipped: 0, Time elapsed: 0.003 sec
16-Mar-2020 14:44:33 Running org.openmrs.api.ObsServiceTest
16-Mar-2020 14:44:39 ERROR - ImageHandler.getObs(70) |2020-03-16 14:44:39,330| Trying to read file: /tmp/appdir-for-unit-tests-3512468365992446938/complex_obs/openmrs_logo_small.gif
16-Mar-2020 14:44:39 javax.imageio.IIOException: Can't read input file!
16-Mar-2020 14:44:39         at javax.imageio.ImageIO.read(ImageIO.java:1302)
16-Mar-2020 14:44:39         at org.openmrs.obs.handler.ImageHandler.getObs(ImageHandler.java:67)
16-Mar-2020 14:44:39         at org.openmrs.api.impl.ObsServiceImpl.getComplexObs(ObsServiceImpl.java:710)
16-Mar-2020 14:44:39         at sun.reflect.NativeMethodAccessorImpl.invoke0(Native Method)
16-Mar-2020 14:44:39         at sun.reflect.NativeMethodAccessorImpl.invoke(NativeMethodAccessorImpl.java:62)
16-Mar-2020 14:44:39         at sun.reflect.DelegatingMethodAccessorImpl.invoke(DelegatingMethodAccessorImpl.java:43)
16-Mar-2020 14:44:39         at java.lang.reflect.Method.invoke(Method.java:498)
16-Mar-2020 14:44:39         at org.springframework.aop.support.AopUtils.invokeJoinpointUsingReflection(AopUtils.java:318)
16-Mar-2020 14:44:39         at org.springframework.aop.framework.ReflectiveMethodInvocation.invokeJoinpoint(ReflectiveMethodInvocation.java:183)
16-Mar-2020 14:44:39         at org.springframework.aop.framework.ReflectiveMethodInvocation.proceed(ReflectiveMethodInvocation.java:150)
16-Mar-2020 14:44:39         at org.springframework.transaction.interceptor.TransactionInterceptor.invoke(TransactionInterceptor.java:110)
16-Mar-2020 14:44:39         at org.springframework.aop.framework.ReflectiveMethodInvocation.proceed(ReflectiveMethodInvocation.java:172)
16-Mar-2020 14:44:39         at org.springframework.aop.framework.JdkDynamicAopProxy.invoke(JdkDynamicAopProxy.java:202)
16-Mar-2020 14:44:39         at com.sun.proxy.$Proxy32.getComplexObs(Unknown Source)
16-Mar-2020 14:44:39         at sun.reflect.NativeMethodAccessorImpl.invoke0(Native Method)
16-Mar-2020 14:44:39         at sun.reflect.NativeMethodAccessorImpl.invoke(NativeMethodAccessorImpl.java:62)
16-Mar-2020 14:44:39         at sun.reflect.DelegatingMethodAccessorImpl.invoke(DelegatingMethodAccessorImpl.java:43)
16-Mar-2020 14:44:39         at java.lang.reflect.Method.invoke(Method.java:498)
16-Mar-2020 14:44:39         at org.springframework.aop.support.AopUtils.invokeJoinpointUsingReflection(AopUtils.java:318)
16-Mar-2020 14:44:39         at org.springframework.aop.framework.ReflectiveMethodInvocation.invokeJoinpoint(ReflectiveMethodInvocation.java:183)
16-Mar-2020 14:44:39         at org.springframework.aop.framework.ReflectiveMethodInvocation.proceed(ReflectiveMethodInvocation.java:150)
16-Mar-2020 14:44:39         at org.springframework.transaction.interceptor.TransactionInterceptor.invoke(TransactionInterceptor.java:110)
16-Mar-2020 14:44:39         at org.springframework.aop.framework.ReflectiveMethodInvocation.proceed(ReflectiveMethodInvocation.java:172)
16-Mar-2020 14:44:39         at org.openmrs.aop.LoggingAdvice.invoke(LoggingAdvice.java:118)
16-Mar-2020 14:44:39         at org.springframework.aop.framework.ReflectiveMethodInvocation.proceed(ReflectiveMethodInvocation.java:172)
16-Mar-2020 14:44:39         at org.springframework.aop.framework.adapter.MethodBeforeAdviceInterceptor.invoke(MethodBeforeAdviceInterceptor.java:50)
16-Mar-2020 14:44:39         at org.springframework.aop.framework.ReflectiveMethodInvocation.proceed(ReflectiveMethodInvocation.java:172)
16-Mar-2020 14:44:39         at org.springframework.aop.framework.adapter.MethodBeforeAdviceInterceptor.invoke(MethodBeforeAdviceInterceptor.java:50)
16-Mar-2020 14:44:39         at org.springframework.aop.framework.ReflectiveMethodInvocation.proceed(ReflectiveMethodInvocation.java:172)
16-Mar-2020 14:44:39         at org.springframework.aop.framework.JdkDynamicAopProxy.invoke(JdkDynamicAopProxy.java:202)
16-Mar-2020 14:44:39         at com.sun.proxy.$Proxy33.getComplexObs(Unknown Source)
16-Mar-2020 14:44:39         at sun.reflect.NativeMethodAccessorImpl.invoke0(Native Method)
16-Mar-2020 14:44:39         at sun.reflect.NativeMethodAccessorImpl.invoke(NativeMethodAccessorImpl.java:62)
16-Mar-2020 14:44:39         at sun.reflect.DelegatingMethodAccessorImpl.invoke(DelegatingMethodAccessorImpl.java:43)
16-Mar-2020 14:44:39         at java.lang.reflect.Method.invoke(Method.java:498)
16-Mar-2020 14:44:39         at org.springframework.aop.support.AopUtils.invokeJoinpointUsingReflection(AopUtils.java:318)
16-Mar-2020 14:44:39         at org.springframework.aop.framework.ReflectiveMethodInvocation.invokeJoinpoint(ReflectiveMethodInvocation.java:183)
16-Mar-2020 14:44:39         at org.springframework.aop.framework.ReflectiveMethodInvocation.proceed(ReflectiveMethodInvocation.java:150)
16-Mar-2020 14:44:39         at org.springframework.transaction.interceptor.TransactionInterceptor.invoke(TransactionInterceptor.java:110)
16-Mar-2020 14:44:39         at org.springframework.aop.framework.ReflectiveMethodInvocation.proceed(ReflectiveMethodInvocation.java:172)
16-Mar-2020 14:44:39         at org.springframework.aop.framework.JdkDynamicAopProxy.invoke(JdkDynamicAopProxy.java:202)
16-Mar-2020 14:44:39         at com.sun.proxy.$Proxy33.getComplexObs(Unknown Source)
16-Mar-2020 14:44:39         at org.openmrs.api.ObsServiceTest.purgeObs_shouldDeleteTheGivenObsFromTheDatabase(ObsServiceTest.java:1198)
16-Mar-2020 14:44:39         at sun.reflect.NativeMethodAccessorImpl.invoke0(Native Method)
16-Mar-2020 14:44:39         at sun.reflect.NativeMethodAccessorImpl.invoke(NativeMethodAccessorImpl.java:62)
16-Mar-2020 14:44:39         at sun.reflect.DelegatingMethodAccessorImpl.invoke(DelegatingMethodAccessorImpl.java:43)
16-Mar-2020 14:44:39         at java.lang.reflect.Method.invoke(Method.java:498)
16-Mar-2020 14:44:39         at org.junit.runners.model.FrameworkMethod$1.runReflectiveCall(FrameworkMethod.java:47)
16-Mar-2020 14:44:39         at org.junit.internal.runners.model.ReflectiveCallable.run(ReflectiveCallable.java:12)
16-Mar-2020 14:44:39         at org.junit.runners.model.FrameworkMethod.invokeExplosively(FrameworkMethod.java:44)
16-Mar-2020 14:44:39         at org.junit.internal.runners.statements.InvokeMethod.evaluate(InvokeMethod.java:17)
16-Mar-2020 14:44:39         at org.junit.internal.runners.statements.RunBefores.evaluate(RunBefores.java:26)
16-Mar-2020 14:44:39         at org.springframework.test.context.junit4.statements.RunBeforeTestMethodCallbacks.evaluate(RunBeforeTestMethodCallbacks.java:74)
16-Mar-2020 14:44:39         at org.junit.internal.runners.statements.RunAfters.evaluate(RunAfters.java:27)
16-Mar-2020 14:44:39         at org.springframework.test.context.junit4.statements.RunAfterTestMethodCallbacks.evaluate(RunAfterTestMethodCallbacks.java:83)
16-Mar-2020 14:44:39         at org.springframework.test.context.junit4.statements.SpringRepeat.evaluate(SpringRepeat.java:72)
16-Mar-2020 14:44:39         at org.springframework.test.context.junit4.SpringJUnit4ClassRunner.runChild(SpringJUnit4ClassRunner.java:231)
16-Mar-2020 14:44:39         at org.junit.runners.BlockJUnit4ClassRunner.runChild(BlockJUnit4ClassRunner.java:50)
16-Mar-2020 14:44:39         at org.junit.runners.ParentRunner$3.run(ParentRunner.java:238)
16-Mar-2020 14:44:39         at org.junit.runners.ParentRunner$1.schedule(ParentRunner.java:63)
16-Mar-2020 14:44:39         at org.junit.runners.ParentRunner.runChildren(ParentRunner.java:236)
16-Mar-2020 14:44:39         at org.junit.runners.ParentRunner.access$000(ParentRunner.java:53)
16-Mar-2020 14:44:39         at org.junit.runners.ParentRunner$2.evaluate(ParentRunner.java:229)
16-Mar-2020 14:44:39         at org.springframework.test.context.junit4.statements.RunBeforeTestClassCallbacks.evaluate(RunBeforeTestClassCallbacks.java:61)
16-Mar-2020 14:44:39         at org.junit.internal.runners.statements.RunAfters.evaluate(RunAfters.java:27)
16-Mar-2020 14:44:39         at org.springframework.test.context.junit4.statements.RunAfterTestClassCallbacks.evaluate(RunAfterTestClassCallbacks.java:71)
16-Mar-2020 14:44:39         at org.junit.runners.ParentRunner.run(ParentRunner.java:309)
16-Mar-2020 14:44:39         at org.springframework.test.context.junit4.SpringJUnit4ClassRunner.run(SpringJUnit4ClassRunner.java:174)
16-Mar-2020 14:44:39         at org.apache.maven.surefire.junit4.JUnit4TestSet.execute(JUnit4TestSet.java:59)
16-Mar-2020 14:44:39         at org.apache.maven.surefire.suite.AbstractDirectoryTestSuite.executeTestSet(AbstractDirectoryTestSuite.java:115)
16-Mar-2020 14:44:39         at org.apache.maven.surefire.suite.AbstractDirectoryTestSuite.execute(AbstractDirectoryTestSuite.java:102)
16-Mar-2020 14:44:39         at org.apache.maven.surefire.Surefire.run(Surefire.java:180)
16-Mar-2020 14:44:39         at sun.reflect.NativeMethodAccessorImpl.invoke0(Native Method)
16-Mar-2020 14:44:39         at sun.reflect.NativeMethodAccessorImpl.invoke(NativeMethodAccessorImpl.java:62)
16-Mar-2020 14:44:39         at sun.reflect.DelegatingMethodAccessorImpl.invoke(DelegatingMethodAccessorImpl.java:43)
16-Mar-2020 14:44:39         at java.lang.reflect.Method.invoke(Method.java:498)
16-Mar-2020 14:44:39         at org.apache.maven.surefire.booter.SurefireBooter.runSuitesInProcess(SurefireBooter.java:350)
16-Mar-2020 14:44:39         at org.apache.maven.surefire.booter.SurefireBooter.main(SurefireBooter.java:1021)
16-Mar-2020 14:44:40 ERROR - ImageHandler.getObs(70) |2020-03-16 14:44:40,112| Trying to read file: /tmp/appdir-for-unit-tests-5749898755277473014/complex_obs/openmrs_logo_small.gif
16-Mar-2020 14:44:40 javax.imageio.IIOException: Can't read input file!
16-Mar-2020 14:44:40         at javax.imageio.ImageIO.read(ImageIO.java:1302)
16-Mar-2020 14:44:40         at org.openmrs.obs.handler.ImageHandler.getObs(ImageHandler.java:67)
16-Mar-2020 14:44:40         at org.openmrs.api.impl.ObsServiceImpl.getComplexObs(ObsServiceImpl.java:710)
16-Mar-2020 14:44:40         at sun.reflect.NativeMethodAccessorImpl.invoke0(Native Method)
16-Mar-2020 14:44:40         at sun.reflect.NativeMethodAccessorImpl.invoke(NativeMethodAccessorImpl.java:62)
16-Mar-2020 14:44:40         at sun.reflect.DelegatingMethodAccessorImpl.invoke(DelegatingMethodAccessorImpl.java:43)
16-Mar-2020 14:44:40         at java.lang.reflect.Method.invoke(Method.java:498)
16-Mar-2020 14:44:40         at org.springframework.aop.support.AopUtils.invokeJoinpointUsingReflection(AopUtils.java:318)
16-Mar-2020 14:44:40         at org.springframework.aop.framework.ReflectiveMethodInvocation.invokeJoinpoint(ReflectiveMethodInvocation.java:183)
16-Mar-2020 14:44:40         at org.springframework.aop.framework.ReflectiveMethodInvocation.proceed(ReflectiveMethodInvocation.java:150)
16-Mar-2020 14:44:40         at org.springframework.transaction.interceptor.TransactionInterceptor.invoke(TransactionInterceptor.java:110)
16-Mar-2020 14:44:40         at org.springframework.aop.framework.ReflectiveMethodInvocation.proceed(ReflectiveMethodInvocation.java:172)
16-Mar-2020 14:44:40         at org.springframework.aop.framework.JdkDynamicAopProxy.invoke(JdkDynamicAopProxy.java:202)
16-Mar-2020 14:44:40         at com.sun.proxy.$Proxy32.getComplexObs(Unknown Source)
16-Mar-2020 14:44:40         at sun.reflect.NativeMethodAccessorImpl.invoke0(Native Method)
16-Mar-2020 14:44:40         at sun.reflect.NativeMethodAccessorImpl.invoke(NativeMethodAccessorImpl.java:62)
16-Mar-2020 14:44:40         at sun.reflect.DelegatingMethodAccessorImpl.invoke(DelegatingMethodAccessorImpl.java:43)
16-Mar-2020 14:44:40         at java.lang.reflect.Method.invoke(Method.java:498)
16-Mar-2020 14:44:40         at org.springframework.aop.support.AopUtils.invokeJoinpointUsingReflection(AopUtils.java:318)
16-Mar-2020 14:44:40         at org.springframework.aop.framework.ReflectiveMethodInvocation.invokeJoinpoint(ReflectiveMethodInvocation.java:183)
16-Mar-2020 14:44:40         at org.springframework.aop.framework.ReflectiveMethodInvocation.proceed(ReflectiveMethodInvocation.java:150)
16-Mar-2020 14:44:40         at org.springframework.transaction.interceptor.TransactionInterceptor.invoke(TransactionInterceptor.java:110)
16-Mar-2020 14:44:40         at org.springframework.aop.framework.ReflectiveMethodInvocation.proceed(ReflectiveMethodInvocation.java:172)
16-Mar-2020 14:44:40         at org.openmrs.aop.LoggingAdvice.invoke(LoggingAdvice.java:118)
16-Mar-2020 14:44:40         at org.springframework.aop.framework.ReflectiveMethodInvocation.proceed(ReflectiveMethodInvocation.java:172)
16-Mar-2020 14:44:40         at org.springframework.aop.framework.adapter.MethodBeforeAdviceInterceptor.invoke(MethodBeforeAdviceInterceptor.java:50)
16-Mar-2020 14:44:40         at org.springframework.aop.framework.ReflectiveMethodInvocation.proceed(ReflectiveMethodInvocation.java:172)
16-Mar-2020 14:44:40         at org.springframework.aop.framework.adapter.MethodBeforeAdviceInterceptor.invoke(MethodBeforeAdviceInterceptor.java:50)
16-Mar-2020 14:44:40         at org.springframework.aop.framework.ReflectiveMethodInvocation.proceed(ReflectiveMethodInvocation.java:172)
16-Mar-2020 14:44:40         at org.springframework.aop.framework.JdkDynamicAopProxy.invoke(JdkDynamicAopProxy.java:202)
16-Mar-2020 14:44:40         at com.sun.proxy.$Proxy33.getComplexObs(Unknown Source)
16-Mar-2020 14:44:40         at sun.reflect.NativeMethodAccessorImpl.invoke0(Native Method)
16-Mar-2020 14:44:40         at sun.reflect.NativeMethodAccessorImpl.invoke(NativeMethodAccessorImpl.java:62)
16-Mar-2020 14:44:40         at sun.reflect.DelegatingMethodAccessorImpl.invoke(DelegatingMethodAccessorImpl.java:43)
16-Mar-2020 14:44:40         at java.lang.reflect.Method.invoke(Method.java:498)
16-Mar-2020 14:44:40         at org.springframework.aop.support.AopUtils.invokeJoinpointUsingReflection(AopUtils.java:318)
16-Mar-2020 14:44:40         at org.springframework.aop.framework.ReflectiveMethodInvocation.invokeJoinpoint(ReflectiveMethodInvocation.java:183)
16-Mar-2020 14:44:40         at org.springframework.aop.framework.ReflectiveMethodInvocation.proceed(ReflectiveMethodInvocation.java:150)
16-Mar-2020 14:44:40         at org.springframework.transaction.interceptor.TransactionInterceptor.invoke(TransactionInterceptor.java:110)
16-Mar-2020 14:44:40         at org.springframework.aop.framework.ReflectiveMethodInvocation.proceed(ReflectiveMethodInvocation.java:172)
16-Mar-2020 14:44:40         at org.springframework.aop.framework.JdkDynamicAopProxy.invoke(JdkDynamicAopProxy.java:202)
16-Mar-2020 14:44:40         at com.sun.proxy.$Proxy33.getComplexObs(Unknown Source)
16-Mar-2020 14:44:40         at org.openmrs.api.ObsServiceTest.getComplexObs_shouldNotFailWithNullView(ObsServiceTest.java:414)
16-Mar-2020 14:44:40         at sun.reflect.NativeMethodAccessorImpl.invoke0(Native Method)
16-Mar-2020 14:44:40         at sun.reflect.NativeMethodAccessorImpl.invoke(NativeMethodAccessorImpl.java:62)
16-Mar-2020 14:44:40         at sun.reflect.DelegatingMethodAccessorImpl.invoke(DelegatingMethodAccessorImpl.java:43)
16-Mar-2020 14:44:40         at java.lang.reflect.Method.invoke(Method.java:498)
16-Mar-2020 14:44:40         at org.junit.runners.model.FrameworkMethod$1.runReflectiveCall(FrameworkMethod.java:47)
16-Mar-2020 14:44:40         at org.junit.internal.runners.model.ReflectiveCallable.run(ReflectiveCallable.java:12)
16-Mar-2020 14:44:40         at org.junit.runners.model.FrameworkMethod.invokeExplosively(FrameworkMethod.java:44)
16-Mar-2020 14:44:40         at org.junit.internal.runners.statements.InvokeMethod.evaluate(InvokeMethod.java:17)
16-Mar-2020 14:44:40         at org.junit.internal.runners.statements.RunBefores.evaluate(RunBefores.java:26)
16-Mar-2020 14:44:40         at org.springframework.test.context.junit4.statements.RunBeforeTestMethodCallbacks.evaluate(RunBeforeTestMethodCallbacks.java:74)
16-Mar-2020 14:44:40         at org.junit.internal.runners.statements.RunAfters.evaluate(RunAfters.java:27)
16-Mar-2020 14:44:40         at org.springframework.test.context.junit4.statements.RunAfterTestMethodCallbacks.evaluate(RunAfterTestMethodCallbacks.java:83)
16-Mar-2020 14:44:40         at org.springframework.test.context.junit4.statements.SpringRepeat.evaluate(SpringRepeat.java:72)
16-Mar-2020 14:44:40         at org.springframework.test.context.junit4.SpringJUnit4ClassRunner.runChild(SpringJUnit4ClassRunner.java:231)
16-Mar-2020 14:44:40         at org.junit.runners.BlockJUnit4ClassRunner.runChild(BlockJUnit4ClassRunner.java:50)
16-Mar-2020 14:44:40         at org.junit.runners.ParentRunner$3.run(ParentRunner.java:238)
16-Mar-2020 14:44:40         at org.junit.runners.ParentRunner$1.schedule(ParentRunner.java:63)
16-Mar-2020 14:44:40         at org.junit.runners.ParentRunner.runChildren(ParentRunner.java:236)
16-Mar-2020 14:44:40         at org.junit.runners.ParentRunner.access$000(ParentRunner.java:53)
16-Mar-2020 14:44:40         at org.junit.runners.ParentRunner$2.evaluate(ParentRunner.java:229)
16-Mar-2020 14:44:40         at org.springframework.test.context.junit4.statements.RunBeforeTestClassCallbacks.evaluate(RunBeforeTestClassCallbacks.java:61)
16-Mar-2020 14:44:40         at org.junit.internal.runners.statements.RunAfters.evaluate(RunAfters.java:27)
16-Mar-2020 14:44:40         at org.springframework.test.context.junit4.statements.RunAfterTestClassCallbacks.evaluate(RunAfterTestClassCallbacks.java:71)
16-Mar-2020 14:44:40         at org.junit.runners.ParentRunner.run(ParentRunner.java:309)
16-Mar-2020 14:44:40         at org.springframework.test.context.junit4.SpringJUnit4ClassRunner.run(SpringJUnit4ClassRunner.java:174)
16-Mar-2020 14:44:40         at org.apache.maven.surefire.junit4.JUnit4TestSet.execute(JUnit4TestSet.java:59)
16-Mar-2020 14:44:40         at org.apache.maven.surefire.suite.AbstractDirectoryTestSuite.executeTestSet(AbstractDirectoryTestSuite.java:115)
16-Mar-2020 14:44:40         at org.apache.maven.surefire.suite.AbstractDirectoryTestSuite.execute(AbstractDirectoryTestSuite.java:102)
16-Mar-2020 14:44:40         at org.apache.maven.surefire.Surefire.run(Surefire.java:180)
16-Mar-2020 14:44:40         at sun.reflect.NativeMethodAccessorImpl.invoke0(Native Method)
16-Mar-2020 14:44:40         at sun.reflect.NativeMethodAccessorImpl.invoke(NativeMethodAccessorImpl.java:62)
16-Mar-2020 14:44:40         at sun.reflect.DelegatingMethodAccessorImpl.invoke(DelegatingMethodAccessorImpl.java:43)
16-Mar-2020 14:44:40         at java.lang.reflect.Method.invoke(Method.java:498)
16-Mar-2020 14:44:40         at org.apache.maven.surefire.booter.SurefireBooter.runSuitesInProcess(SurefireBooter.java:350)
16-Mar-2020 14:44:40         at org.apache.maven.surefire.booter.SurefireBooter.main(SurefireBooter.java:1021)
16-Mar-2020 14:44:40 ERROR - ImageHandler.getObs(70) |2020-03-16 14:44:40,333| Trying to read file: /tmp/appdir-for-unit-tests-2429557012644779571/complex_obs/openmrs_logo_small.gif
16-Mar-2020 14:44:40 javax.imageio.IIOException: Can't read input file!
16-Mar-2020 14:44:40         at javax.imageio.ImageIO.read(ImageIO.java:1302)
16-Mar-2020 14:44:40         at org.openmrs.obs.handler.ImageHandler.getObs(ImageHandler.java:67)
16-Mar-2020 14:44:40         at org.openmrs.api.impl.ObsServiceImpl.getComplexObs(ObsServiceImpl.java:710)
16-Mar-2020 14:44:40         at sun.reflect.NativeMethodAccessorImpl.invoke0(Native Method)
16-Mar-2020 14:44:40         at sun.reflect.NativeMethodAccessorImpl.invoke(NativeMethodAccessorImpl.java:62)
16-Mar-2020 14:44:40         at sun.reflect.DelegatingMethodAccessorImpl.invoke(DelegatingMethodAccessorImpl.java:43)
16-Mar-2020 14:44:40         at java.lang.reflect.Method.invoke(Method.java:498)
16-Mar-2020 14:44:40         at org.springframework.aop.support.AopUtils.invokeJoinpointUsingReflection(AopUtils.java:318)
16-Mar-2020 14:44:40         at org.springframework.aop.framework.ReflectiveMethodInvocation.invokeJoinpoint(ReflectiveMethodInvocation.java:183)
16-Mar-2020 14:44:40         at org.springframework.aop.framework.ReflectiveMethodInvocation.proceed(ReflectiveMethodInvocation.java:150)
16-Mar-2020 14:44:40         at org.springframework.transaction.interceptor.TransactionInterceptor.invoke(TransactionInterceptor.java:110)
16-Mar-2020 14:44:40         at org.springframework.aop.framework.ReflectiveMethodInvocation.proceed(ReflectiveMethodInvocation.java:172)
16-Mar-2020 14:44:40         at org.springframework.aop.framework.JdkDynamicAopProxy.invoke(JdkDynamicAopProxy.java:202)
16-Mar-2020 14:44:40         at com.sun.proxy.$Proxy32.getComplexObs(Unknown Source)
16-Mar-2020 14:44:40         at sun.reflect.NativeMethodAccessorImpl.invoke0(Native Method)
16-Mar-2020 14:44:40         at sun.reflect.NativeMethodAccessorImpl.invoke(NativeMethodAccessorImpl.java:62)
16-Mar-2020 14:44:40         at sun.reflect.DelegatingMethodAccessorImpl.invoke(DelegatingMethodAccessorImpl.java:43)
16-Mar-2020 14:44:40         at java.lang.reflect.Method.invoke(Method.java:498)
16-Mar-2020 14:44:40         at org.springframework.aop.support.AopUtils.invokeJoinpointUsingReflection(AopUtils.java:318)
16-Mar-2020 14:44:40         at org.springframework.aop.framework.ReflectiveMethodInvocation.invokeJoinpoint(ReflectiveMethodInvocation.java:183)
16-Mar-2020 14:44:40         at org.springframework.aop.framework.ReflectiveMethodInvocation.proceed(ReflectiveMethodInvocation.java:150)
16-Mar-2020 14:44:40         at org.springframework.transaction.interceptor.TransactionInterceptor.invoke(TransactionInterceptor.java:110)
16-Mar-2020 14:44:40         at org.springframework.aop.framework.ReflectiveMethodInvocation.proceed(ReflectiveMethodInvocation.java:172)
16-Mar-2020 14:44:40         at org.openmrs.aop.LoggingAdvice.invoke(LoggingAdvice.java:118)
16-Mar-2020 14:44:40         at org.springframework.aop.framework.ReflectiveMethodInvocation.proceed(ReflectiveMethodInvocation.java:172)
16-Mar-2020 14:44:40         at org.springframework.aop.framework.adapter.MethodBeforeAdviceInterceptor.invoke(MethodBeforeAdviceInterceptor.java:50)
16-Mar-2020 14:44:40         at org.springframework.aop.framework.ReflectiveMethodInvocation.proceed(ReflectiveMethodInvocation.java:172)
16-Mar-2020 14:44:40         at org.springframework.aop.framework.adapter.MethodBeforeAdviceInterceptor.invoke(MethodBeforeAdviceInterceptor.java:50)
16-Mar-2020 14:44:40         at org.springframework.aop.framework.ReflectiveMethodInvocation.proceed(ReflectiveMethodInvocation.java:172)
16-Mar-2020 14:44:40         at org.springframework.aop.framework.JdkDynamicAopProxy.invoke(JdkDynamicAopProxy.java:202)
16-Mar-2020 14:44:40         at com.sun.proxy.$Proxy33.getComplexObs(Unknown Source)
16-Mar-2020 14:44:40         at sun.reflect.NativeMethodAccessorImpl.invoke0(Native Method)
16-Mar-2020 14:44:40         at sun.reflect.NativeMethodAccessorImpl.invoke(NativeMethodAccessorImpl.java:62)
16-Mar-2020 14:44:40         at sun.reflect.DelegatingMethodAccessorImpl.invoke(DelegatingMethodAccessorImpl.java:43)
16-Mar-2020 14:44:40         at java.lang.reflect.Method.invoke(Method.java:498)
16-Mar-2020 14:44:40         at org.springframework.aop.support.AopUtils.invokeJoinpointUsingReflection(AopUtils.java:318)
16-Mar-2020 14:44:40         at org.springframework.aop.framework.ReflectiveMethodInvocation.invokeJoinpoint(ReflectiveMethodInvocation.java:183)
16-Mar-2020 14:44:40         at org.springframework.aop.framework.ReflectiveMethodInvocation.proceed(ReflectiveMethodInvocation.java:150)
16-Mar-2020 14:44:40         at org.springframework.transaction.interceptor.TransactionInterceptor.invoke(TransactionInterceptor.java:110)
16-Mar-2020 14:44:40         at org.springframework.aop.framework.ReflectiveMethodInvocation.proceed(ReflectiveMethodInvocation.java:172)
16-Mar-2020 14:44:40         at org.springframework.aop.framework.JdkDynamicAopProxy.invoke(JdkDynamicAopProxy.java:202)
16-Mar-2020 14:44:40         at com.sun.proxy.$Proxy33.getComplexObs(Unknown Source)
16-Mar-2020 14:44:40         at org.openmrs.api.ObsServiceTest.getComplexObs_shouldFillInComplexDataObjectForComplexObs(ObsServiceTest.java:396)
16-Mar-2020 14:44:40         at sun.reflect.NativeMethodAccessorImpl.invoke0(Native Method)
16-Mar-2020 14:44:40         at sun.reflect.NativeMethodAccessorImpl.invoke(NativeMethodAccessorImpl.java:62)
16-Mar-2020 14:44:40         at sun.reflect.DelegatingMethodAccessorImpl.invoke(DelegatingMethodAccessorImpl.java:43)
16-Mar-2020 14:44:40         at java.lang.reflect.Method.invoke(Method.java:498)
16-Mar-2020 14:44:40         at org.junit.runners.model.FrameworkMethod$1.runReflectiveCall(FrameworkMethod.java:47)
16-Mar-2020 14:44:40         at org.junit.internal.runners.model.ReflectiveCallable.run(ReflectiveCallable.java:12)
16-Mar-2020 14:44:40         at org.junit.runners.model.FrameworkMethod.invokeExplosively(FrameworkMethod.java:44)
16-Mar-2020 14:44:40         at org.junit.internal.runners.statements.InvokeMethod.evaluate(InvokeMethod.java:17)
16-Mar-2020 14:44:40         at org.junit.internal.runners.statements.RunBefores.evaluate(RunBefores.java:26)
16-Mar-2020 14:44:40         at org.springframework.test.context.junit4.statements.RunBeforeTestMethodCallbacks.evaluate(RunBeforeTestMethodCallbacks.java:74)
16-Mar-2020 14:44:40         at org.junit.internal.runners.statements.RunAfters.evaluate(RunAfters.java:27)
16-Mar-2020 14:44:40         at org.springframework.test.context.junit4.statements.RunAfterTestMethodCallbacks.evaluate(RunAfterTestMethodCallbacks.java:83)
16-Mar-2020 14:44:40         at org.springframework.test.context.junit4.statements.SpringRepeat.evaluate(SpringRepeat.java:72)
16-Mar-2020 14:44:40         at org.springframework.test.context.junit4.SpringJUnit4ClassRunner.runChild(SpringJUnit4ClassRunner.java:231)
16-Mar-2020 14:44:40         at org.junit.runners.BlockJUnit4ClassRunner.runChild(BlockJUnit4ClassRunner.java:50)
16-Mar-2020 14:44:40         at org.junit.runners.ParentRunner$3.run(ParentRunner.java:238)
16-Mar-2020 14:44:40         at org.junit.runners.ParentRunner$1.schedule(ParentRunner.java:63)
16-Mar-2020 14:44:40         at org.junit.runners.ParentRunner.runChildren(ParentRunner.java:236)
16-Mar-2020 14:44:40         at org.junit.runners.ParentRunner.access$000(ParentRunner.java:53)
16-Mar-2020 14:44:40         at org.junit.runners.ParentRunner$2.evaluate(ParentRunner.java:229)
16-Mar-2020 14:44:40         at org.springframework.test.context.junit4.statements.RunBeforeTestClassCallbacks.evaluate(RunBeforeTestClassCallbacks.java:61)
16-Mar-2020 14:44:40         at org.junit.internal.runners.statements.RunAfters.evaluate(RunAfters.java:27)
16-Mar-2020 14:44:40         at org.springframework.test.context.junit4.statements.RunAfterTestClassCallbacks.evaluate(RunAfterTestClassCallbacks.java:71)
16-Mar-2020 14:44:40         at org.junit.runners.ParentRunner.run(ParentRunner.java:309)
16-Mar-2020 14:44:40         at org.springframework.test.context.junit4.SpringJUnit4ClassRunner.run(SpringJUnit4ClassRunner.java:174)
16-Mar-2020 14:44:40         at org.apache.maven.surefire.junit4.JUnit4TestSet.execute(JUnit4TestSet.java:59)
16-Mar-2020 14:44:40         at org.apache.maven.surefire.suite.AbstractDirectoryTestSuite.executeTestSet(AbstractDirectoryTestSuite.java:115)
16-Mar-2020 14:44:40         at org.apache.maven.surefire.suite.AbstractDirectoryTestSuite.execute(AbstractDirectoryTestSuite.java:102)
16-Mar-2020 14:44:40         at org.apache.maven.surefire.Surefire.run(Surefire.java:180)
16-Mar-2020 14:44:40         at sun.reflect.NativeMethodAccessorImpl.invoke0(Native Method)
16-Mar-2020 14:44:40         at sun.reflect.NativeMethodAccessorImpl.invoke(NativeMethodAccessorImpl.java:62)
16-Mar-2020 14:44:40         at sun.reflect.DelegatingMethodAccessorImpl.invoke(DelegatingMethodAccessorImpl.java:43)
16-Mar-2020 14:44:40         at java.lang.reflect.Method.invoke(Method.java:498)
16-Mar-2020 14:44:40         at org.apache.maven.surefire.booter.SurefireBooter.runSuitesInProcess(SurefireBooter.java:350)
16-Mar-2020 14:44:40         at org.apache.maven.surefire.booter.SurefireBooter.main(SurefireBooter.java:1021)
16-Mar-2020 14:44:40 Tests run: 65, Failures: 0, Errors: 0, Skipped: 0, Time elapsed: 7.144 sec
16-Mar-2020 14:44:40 Running org.openmrs.api.AdministrationServiceTest
16-Mar-2020 14:44:42 ERROR - MutableResourceBundleMessageSource.findPropertiesFiles(319) |2020-03-16 14:44:42,549| Error generated
16-Mar-2020 14:44:42 java.io.FileNotFoundException: class path resource [WEB-INF/] cannot be resolved to URL because it does not exist
16-Mar-2020 14:44:42         at org.springframework.core.io.ClassPathResource.getURL(ClassPathResource.java:179)
16-Mar-2020 14:44:42         at org.springframework.core.io.AbstractFileResolvingResource.getFile(AbstractFileResolvingResource.java:48)
16-Mar-2020 14:44:42         at org.openmrs.messagesource.impl.MutableResourceBundleMessageSource.findPropertiesFiles(MutableResourceBundleMessageSource.java:307)
16-Mar-2020 14:44:42         at org.openmrs.messagesource.impl.MutableResourceBundleMessageSource.findLocales(MutableResourceBundleMessageSource.java:89)
16-Mar-2020 14:44:42         at org.openmrs.messagesource.impl.MutableResourceBundleMessageSource.getLocales(MutableResourceBundleMessageSource.java:66)
16-Mar-2020 14:44:42         at org.openmrs.messagesource.impl.MessageSourceServiceImpl.getLocales(MessageSourceServiceImpl.java:80)
16-Mar-2020 14:44:42         at sun.reflect.NativeMethodAccessorImpl.invoke0(Native Method)
16-Mar-2020 14:44:42         at sun.reflect.NativeMethodAccessorImpl.invoke(NativeMethodAccessorImpl.java:62)
16-Mar-2020 14:44:42         at sun.reflect.DelegatingMethodAccessorImpl.invoke(DelegatingMethodAccessorImpl.java:43)
16-Mar-2020 14:44:42         at java.lang.reflect.Method.invoke(Method.java:498)
16-Mar-2020 14:44:42         at org.springframework.aop.support.AopUtils.invokeJoinpointUsingReflection(AopUtils.java:318)
16-Mar-2020 14:44:42         at org.springframework.aop.framework.ReflectiveMethodInvocation.invokeJoinpoint(ReflectiveMethodInvocation.java:183)
16-Mar-2020 14:44:42         at org.springframework.aop.framework.ReflectiveMethodInvocation.proceed(ReflectiveMethodInvocation.java:150)
16-Mar-2020 14:44:42         at org.springframework.transaction.interceptor.TransactionInterceptor.invoke(TransactionInterceptor.java:110)
16-Mar-2020 14:44:42         at org.springframework.aop.framework.ReflectiveMethodInvocation.proceed(ReflectiveMethodInvocation.java:172)
16-Mar-2020 14:44:42         at org.openmrs.aop.LoggingAdvice.invoke(LoggingAdvice.java:118)
16-Mar-2020 14:44:42         at org.springframework.aop.framework.ReflectiveMethodInvocation.proceed(ReflectiveMethodInvocation.java:172)
16-Mar-2020 14:44:42         at org.springframework.aop.framework.adapter.MethodBeforeAdviceInterceptor.invoke(MethodBeforeAdviceInterceptor.java:50)
16-Mar-2020 14:44:42         at org.springframework.aop.framework.ReflectiveMethodInvocation.proceed(ReflectiveMethodInvocation.java:172)
16-Mar-2020 14:44:42         at org.springframework.aop.framework.adapter.MethodBeforeAdviceInterceptor.invoke(MethodBeforeAdviceInterceptor.java:50)
16-Mar-2020 14:44:42         at org.springframework.aop.framework.ReflectiveMethodInvocation.proceed(ReflectiveMethodInvocation.java:172)
16-Mar-2020 14:44:42         at org.springframework.aop.framework.JdkDynamicAopProxy.invoke(JdkDynamicAopProxy.java:202)
16-Mar-2020 14:44:42         at com.sun.proxy.$Proxy19.getLocales(Unknown Source)
16-Mar-2020 14:44:42         at sun.reflect.NativeMethodAccessorImpl.invoke0(Native Method)
16-Mar-2020 14:44:42         at sun.reflect.NativeMethodAccessorImpl.invoke(NativeMethodAccessorImpl.java:62)
16-Mar-2020 14:44:42         at sun.reflect.DelegatingMethodAccessorImpl.invoke(DelegatingMethodAccessorImpl.java:43)
16-Mar-2020 14:44:42         at java.lang.reflect.Method.invoke(Method.java:498)
16-Mar-2020 14:44:42         at org.springframework.aop.support.AopUtils.invokeJoinpointUsingReflection(AopUtils.java:318)
16-Mar-2020 14:44:42         at org.springframework.aop.framework.ReflectiveMethodInvocation.invokeJoinpoint(ReflectiveMethodInvocation.java:183)
16-Mar-2020 14:44:42         at org.springframework.aop.framework.ReflectiveMethodInvocation.proceed(ReflectiveMethodInvocation.java:150)
16-Mar-2020 14:44:42         at org.springframework.transaction.interceptor.TransactionInterceptor.invoke(TransactionInterceptor.java:110)
16-Mar-2020 14:44:42         at org.springframework.aop.framework.ReflectiveMethodInvocation.proceed(ReflectiveMethodInvocation.java:172)
16-Mar-2020 14:44:42         at org.springframework.aop.framework.JdkDynamicAopProxy.invoke(JdkDynamicAopProxy.java:202)
16-Mar-2020 14:44:42         at com.sun.proxy.$Proxy72.getLocales(Unknown Source)
16-Mar-2020 14:44:42         at org.openmrs.api.impl.AdministrationServiceImpl.getPresentationLocales(AdministrationServiceImpl.java:1001)
16-Mar-2020 14:44:42         at sun.reflect.NativeMethodAccessorImpl.invoke0(Native Method)
16-Mar-2020 14:44:42         at sun.reflect.NativeMethodAccessorImpl.invoke(NativeMethodAccessorImpl.java:62)
16-Mar-2020 14:44:42         at sun.reflect.DelegatingMethodAccessorImpl.invoke(DelegatingMethodAccessorImpl.java:43)
16-Mar-2020 14:44:42         at java.lang.reflect.Method.invoke(Method.java:498)
16-Mar-2020 14:44:42         at org.springframework.aop.support.AopUtils.invokeJoinpointUsingReflection(AopUtils.java:318)
16-Mar-2020 14:44:42         at org.springframework.aop.framework.ReflectiveMethodInvocation.invokeJoinpoint(ReflectiveMethodInvocation.java:183)
16-Mar-2020 14:44:42         at org.springframework.aop.framework.ReflectiveMethodInvocation.proceed(ReflectiveMethodInvocation.java:150)
16-Mar-2020 14:44:42         at org.springframework.transaction.interceptor.TransactionInterceptor.invoke(TransactionInterceptor.java:110)
16-Mar-2020 14:44:42         at org.springframework.aop.framework.ReflectiveMethodInvocation.proceed(ReflectiveMethodInvocation.java:172)
16-Mar-2020 14:44:42         at org.springframework.aop.framework.JdkDynamicAopProxy.invoke(JdkDynamicAopProxy.java:202)
16-Mar-2020 14:44:42         at com.sun.proxy.$Proxy22.getPresentationLocales(Unknown Source)
16-Mar-2020 14:44:42         at sun.reflect.NativeMethodAccessorImpl.invoke0(Native Method)
16-Mar-2020 14:44:42         at sun.reflect.NativeMethodAccessorImpl.invoke(NativeMethodAccessorImpl.java:62)
16-Mar-2020 14:44:42         at sun.reflect.DelegatingMethodAccessorImpl.invoke(DelegatingMethodAccessorImpl.java:43)
16-Mar-2020 14:44:42         at java.lang.reflect.Method.invoke(Method.java:498)
16-Mar-2020 14:44:42         at org.springframework.aop.support.AopUtils.invokeJoinpointUsingReflection(AopUtils.java:318)
16-Mar-2020 14:44:42         at org.springframework.aop.framework.ReflectiveMethodInvocation.invokeJoinpoint(ReflectiveMethodInvocation.java:183)
16-Mar-2020 14:44:42         at org.springframework.aop.framework.ReflectiveMethodInvocation.proceed(ReflectiveMethodInvocation.java:150)
16-Mar-2020 14:44:42         at org.springframework.transaction.interceptor.TransactionInterceptor.invoke(TransactionInterceptor.java:110)
16-Mar-2020 14:44:42         at org.springframework.aop.framework.ReflectiveMethodInvocation.proceed(ReflectiveMethodInvocation.java:172)
16-Mar-2020 14:44:42         at org.openmrs.aop.LoggingAdvice.invoke(LoggingAdvice.java:118)
16-Mar-2020 14:44:42         at org.springframework.aop.framework.ReflectiveMethodInvocation.proceed(ReflectiveMethodInvocation.java:172)
16-Mar-2020 14:44:42         at org.springframework.aop.framework.adapter.MethodBeforeAdviceInterceptor.invoke(MethodBeforeAdviceInterceptor.java:50)
16-Mar-2020 14:44:42         at org.springframework.aop.framework.ReflectiveMethodInvocation.proceed(ReflectiveMethodInvocation.java:172)
16-Mar-2020 14:44:42         at org.springframework.aop.framework.adapter.MethodBeforeAdviceInterceptor.invoke(MethodBeforeAdviceInterceptor.java:50)
16-Mar-2020 14:44:42         at org.springframework.aop.framework.ReflectiveMethodInvocation.proceed(ReflectiveMethodInvocation.java:172)
16-Mar-2020 14:44:42         at org.springframework.aop.framework.JdkDynamicAopProxy.invoke(JdkDynamicAopProxy.java:202)
16-Mar-2020 14:44:42         at com.sun.proxy.$Proxy41.getPresentationLocales(Unknown Source)
16-Mar-2020 14:44:42         at sun.reflect.NativeMethodAccessorImpl.invoke0(Native Method)
16-Mar-2020 14:44:42         at sun.reflect.NativeMethodAccessorImpl.invoke(NativeMethodAccessorImpl.java:62)
16-Mar-2020 14:44:42         at sun.reflect.DelegatingMethodAccessorImpl.invoke(DelegatingMethodAccessorImpl.java:43)
16-Mar-2020 14:44:42         at java.lang.reflect.Method.invoke(Method.java:498)
16-Mar-2020 14:44:42         at org.springframework.aop.support.AopUtils.invokeJoinpointUsingReflection(AopUtils.java:318)
16-Mar-2020 14:44:42         at org.springframework.aop.framework.ReflectiveMethodInvocation.invokeJoinpoint(ReflectiveMethodInvocation.java:183)
16-Mar-2020 14:44:42         at org.springframework.aop.framework.ReflectiveMethodInvocation.proceed(ReflectiveMethodInvocation.java:150)
16-Mar-2020 14:44:42         at org.springframework.transaction.interceptor.TransactionInterceptor.invoke(TransactionInterceptor.java:110)
16-Mar-2020 14:44:42         at org.springframework.aop.framework.ReflectiveMethodInvocation.proceed(ReflectiveMethodInvocation.java:172)
16-Mar-2020 14:44:42         at org.springframework.aop.framework.JdkDynamicAopProxy.invoke(JdkDynamicAopProxy.java:202)
16-Mar-2020 14:44:42         at com.sun.proxy.$Proxy41.getPresentationLocales(Unknown Source)
16-Mar-2020 14:44:42         at org.openmrs.api.AdministrationServiceTest.getPresentationLocales_shouldNotReturnMoreLocalesThanMessageSourceServiceLocales(AdministrationServiceTest.java:414)
16-Mar-2020 14:44:42         at sun.reflect.NativeMethodAccessorImpl.invoke0(Native Method)
16-Mar-2020 14:44:42         at sun.reflect.NativeMethodAccessorImpl.invoke(NativeMethodAccessorImpl.java:62)
16-Mar-2020 14:44:42         at sun.reflect.DelegatingMethodAccessorImpl.invoke(DelegatingMethodAccessorImpl.java:43)
16-Mar-2020 14:44:42         at java.lang.reflect.Method.invoke(Method.java:498)
16-Mar-2020 14:44:42         at org.junit.runners.model.FrameworkMethod$1.runReflectiveCall(FrameworkMethod.java:47)
16-Mar-2020 14:44:42         at org.junit.internal.runners.model.ReflectiveCallable.run(ReflectiveCallable.java:12)
16-Mar-2020 14:44:42         at org.junit.runners.model.FrameworkMethod.invokeExplosively(FrameworkMethod.java:44)
16-Mar-2020 14:44:42         at org.junit.internal.runners.statements.InvokeMethod.evaluate(InvokeMethod.java:17)
16-Mar-2020 14:44:42         at org.junit.internal.runners.statements.RunBefores.evaluate(RunBefores.java:26)
16-Mar-2020 14:44:42         at org.springframework.test.context.junit4.statements.RunBeforeTestMethodCallbacks.evaluate(RunBeforeTestMethodCallbacks.java:74)
16-Mar-2020 14:44:42         at org.junit.internal.runners.statements.RunAfters.evaluate(RunAfters.java:27)
16-Mar-2020 14:44:42         at org.springframework.test.context.junit4.statements.RunAfterTestMethodCallbacks.evaluate(RunAfterTestMethodCallbacks.java:83)
16-Mar-2020 14:44:42         at org.springframework.test.context.junit4.statements.SpringRepeat.evaluate(SpringRepeat.java:72)
16-Mar-2020 14:44:42         at org.springframework.test.context.junit4.SpringJUnit4ClassRunner.runChild(SpringJUnit4ClassRunner.java:231)
16-Mar-2020 14:44:42         at org.junit.runners.BlockJUnit4ClassRunner.runChild(BlockJUnit4ClassRunner.java:50)
16-Mar-2020 14:44:42         at org.junit.runners.ParentRunner$3.run(ParentRunner.java:238)
16-Mar-2020 14:44:42         at org.junit.runners.ParentRunner$1.schedule(ParentRunner.java:63)
16-Mar-2020 14:44:42         at org.junit.runners.ParentRunner.runChildren(ParentRunner.java:236)
16-Mar-2020 14:44:42         at org.junit.runners.ParentRunner.access$000(ParentRunner.java:53)
16-Mar-2020 14:44:42         at org.junit.runners.ParentRunner$2.evaluate(ParentRunner.java:229)
16-Mar-2020 14:44:42         at org.springframework.test.context.junit4.statements.RunBeforeTestClassCallbacks.evaluate(RunBeforeTestClassCallbacks.java:61)
16-Mar-2020 14:44:42         at org.junit.internal.runners.statements.RunAfters.evaluate(RunAfters.java:27)
16-Mar-2020 14:44:42         at org.springframework.test.context.junit4.statements.RunAfterTestClassCallbacks.evaluate(RunAfterTestClassCallbacks.java:71)
16-Mar-2020 14:44:42         at org.junit.runners.ParentRunner.run(ParentRunner.java:309)
16-Mar-2020 14:44:42         at org.springframework.test.context.junit4.SpringJUnit4ClassRunner.run(SpringJUnit4ClassRunner.java:174)
16-Mar-2020 14:44:42         at org.apache.maven.surefire.junit4.JUnit4TestSet.execute(JUnit4TestSet.java:59)
16-Mar-2020 14:44:42         at org.apache.maven.surefire.suite.AbstractDirectoryTestSuite.executeTestSet(AbstractDirectoryTestSuite.java:115)
16-Mar-2020 14:44:42         at org.apache.maven.surefire.suite.AbstractDirectoryTestSuite.execute(AbstractDirectoryTestSuite.java:102)
16-Mar-2020 14:44:42         at org.apache.maven.surefire.Surefire.run(Surefire.java:180)
16-Mar-2020 14:44:42         at sun.reflect.NativeMethodAccessorImpl.invoke0(Native Method)
16-Mar-2020 14:44:42         at sun.reflect.NativeMethodAccessorImpl.invoke(NativeMethodAccessorImpl.java:62)
16-Mar-2020 14:44:42         at sun.reflect.DelegatingMethodAccessorImpl.invoke(DelegatingMethodAccessorImpl.java:43)
16-Mar-2020 14:44:42         at java.lang.reflect.Method.invoke(Method.java:498)
16-Mar-2020 14:44:42         at org.apache.maven.surefire.booter.SurefireBooter.runSuitesInProcess(SurefireBooter.java:350)
16-Mar-2020 14:44:42         at org.apache.maven.surefire.booter.SurefireBooter.main(SurefireBooter.java:1021)
16-Mar-2020 14:44:43 Tests run: 41, Failures: 0, Errors: 0, Skipped: 4, Time elapsed: 3.558 sec
16-Mar-2020 14:44:43 Running org.openmrs.notification.MessageTest
16-Mar-2020 14:44:43 Tests run: 4, Failures: 0, Errors: 0, Skipped: 0, Time elapsed: 0.001 sec
16-Mar-2020 14:44:43 Running org.openmrs.util.OpenmrsClassLoaderTest
16-Mar-2020 14:44:43 Tests run: 1, Failures: 0, Errors: 0, Skipped: 0, Time elapsed: 0.01 sec
16-Mar-2020 14:44:43 Running org.openmrs.api.handler.BaseUnretireHandlerTest
16-Mar-2020 14:44:43 Tests run: 6, Failures: 0, Errors: 0, Skipped: 0, Time elapsed: 0.001 sec
16-Mar-2020 14:44:43 Running org.openmrs.OpenmrsTestAnnotationsTest
16-Mar-2020 14:44:44 Tests run: 2, Failures: 0, Errors: 0, Skipped: 0, Time elapsed: 0.111 sec
16-Mar-2020 14:44:44 Running org.openmrs.validator.EncounterTypeValidatorTest
16-Mar-2020 14:44:44 Tests run: 3, Failures: 0, Errors: 0, Skipped: 0, Time elapsed: 0.001 sec
16-Mar-2020 14:44:44 Running org.openmrs.UserTest
16-Mar-2020 14:44:44 Tests run: 6, Failures: 0, Errors: 0, Skipped: 0, Time elapsed: 0.001 sec
16-Mar-2020 14:44:44 Running org.openmrs.validator.ConceptReferenceTermValidatorTest
16-Mar-2020 14:44:44 [Field error in object 'term' on field 'conceptReferenceTermMaps[1].termB': rejected value [weight term(WGT234)]; codes [ConceptReferenceTerm.termToTerm.alreadyMapped.term.conceptReferenceTermMaps[1].termB,ConceptReferenceTerm.termToTerm.alreadyMapped.term.conceptReferenceTermMaps.termB,ConceptReferenceTerm.termToTerm.alreadyMapped.conceptReferenceTermMaps[1].termB,ConceptReferenceTerm.termToTerm.alreadyMapped.conceptReferenceTermMaps.termB,ConceptReferenceTerm.termToTerm.alreadyMapped.termB,ConceptReferenceTerm.termToTerm.alreadyMapped.org.openmrs.ConceptReferenceTerm,ConceptReferenceTerm.termToTerm.alreadyMapped]; arguments []; default message [Cannot map a reference term multiple times to the same concept reference term]]
16-Mar-2020 14:44:45 Tests run: 18, Failures: 0, Errors: 0, Skipped: 3, Time elapsed: 1.485 sec
16-Mar-2020 14:44:45 Running org.openmrs.api.db.PersonDAOTest
16-Mar-2020 14:44:45 Tests run: 4, Failures: 0, Errors: 0, Skipped: 0, Time elapsed: 0.364 sec
16-Mar-2020 14:44:45 Running org.openmrs.order.OrderUtilTest
16-Mar-2020 14:44:45 Tests run: 15, Failures: 0, Errors: 0, Skipped: 0, Time elapsed: 0.003 sec
16-Mar-2020 14:44:45 Running org.openmrs.report.ReportSchemaXmlNonContextTest
16-Mar-2020 14:44:45 Tests run: 1, Failures: 0, Errors: 0, Skipped: 0, Time elapsed: 0.001 sec
16-Mar-2020 14:44:45 Running org.openmrs.util.LocaleUtilityTest
16-Mar-2020 14:44:47 Tests run: 21, Failures: 0, Errors: 0, Skipped: 0, Time elapsed: 1.976 sec
16-Mar-2020 14:44:47 Running org.openmrs.validator.EncounterValidatorTest
16-Mar-2020 14:44:48 Tests run: 5, Failures: 0, Errors: 0, Skipped: 0, Time elapsed: 0.5 sec
16-Mar-2020 14:44:48 Running org.openmrs.customdatatype.CustomDatatypeUtilTest
16-Mar-2020 14:44:48 Tests run: 1, Failures: 0, Errors: 0, Skipped: 0, Time elapsed: 0.217 sec
16-Mar-2020 14:44:48 Running org.openmrs.api.PatientSetServiceTest
16-Mar-2020 14:44:51 Tests run: 28, Failures: 0, Errors: 0, Skipped: 0, Time elapsed: 3.039 sec
16-Mar-2020 14:44:51 Running org.openmrs.BaseOpenmrsObjectTest
16-Mar-2020 14:44:51 Tests run: 10, Failures: 0, Errors: 0, Skipped: 0, Time elapsed: 0.004 sec
16-Mar-2020 14:44:51 Running org.openmrs.ProviderTest
16-Mar-2020 14:44:51 Tests run: 2, Failures: 0, Errors: 0, Skipped: 0, Time elapsed: 0.001 sec
16-Mar-2020 14:44:51 Running org.openmrs.PatientTest
16-Mar-2020 14:44:51 Tests run: 7, Failures: 0, Errors: 0, Skipped: 0, Time elapsed: 0.002 sec
16-Mar-2020 14:44:51 Running org.openmrs.validator.SchedulerFormValidatorTest
16-Mar-2020 14:44:51 Tests run: 8, Failures: 0, Errors: 8, Skipped: 0, Time elapsed: 0.009 sec <<< FAILURE!
16-Mar-2020 14:44:51 Running org.openmrs.propertyeditor.DateOrDatetimeEditorTest
16-Mar-2020 14:44:51 Tests run: 6, Failures: 0, Errors: 0, Skipped: 0, Time elapsed: 0.003 sec
16-Mar-2020 14:44:51 Running org.openmrs.validator.RequireNameValidatorTest
16-Mar-2020 14:44:51 Tests run: 2, Failures: 0, Errors: 0, Skipped: 0, Time elapsed: 0.001 sec
16-Mar-2020 14:44:51 Running org.openmrs.api.context.DaemonTest
16-Mar-2020 14:44:52 Tests run: 5, Failures: 0, Errors: 0, Skipped: 0, Time elapsed: 0.466 sec
16-Mar-2020 14:44:52 Running org.openmrs.TestOrderTest
16-Mar-2020 14:44:52 Tests run: 4, Failures: 0, Errors: 0, Skipped: 0, Time elapsed: 0.001 sec
16-Mar-2020 14:44:52 Running org.openmrs.notification.AlertServiceTest
16-Mar-2020 14:44:52 Tests run: 1, Failures: 0, Errors: 0, Skipped: 0, Time elapsed: 0.095 sec
16-Mar-2020 14:44:52 Running org.openmrs.util.UpgradeUtilTest
16-Mar-2020 14:44:52 Tests run: 2, Failures: 0, Errors: 0, Skipped: 0, Time elapsed: 0.182 sec
16-Mar-2020 14:44:52 Running org.openmrs.api.impl.ConceptServiceImplTest
16-Mar-2020 14:44:53 Tests run: 13, Failures: 0, Errors: 0, Skipped: 0, Time elapsed: 1.357 sec
16-Mar-2020 14:44:53 Running org.openmrs.api.handler.BaseRetireHandlerTest
16-Mar-2020 14:44:53 Tests run: 8, Failures: 0, Errors: 0, Skipped: 0, Time elapsed: 0.002 sec
16-Mar-2020 14:44:53 Running org.openmrs.annotation.OpenmrsProfileExcludeFilterTest
16-Mar-2020 14:44:54 Tests run: 7, Failures: 0, Errors: 0, Skipped: 0, Time elapsed: 0.742 sec
16-Mar-2020 14:44:54 Running org.openmrs.api.PatientServiceTest
16-Mar-2020 14:45:11 Tests run: 161, Failures: 0, Errors: 0, Skipped: 2, Time elapsed: 16.907 sec
16-Mar-2020 14:45:11 Running org.openmrs.util.ReflectTest
16-Mar-2020 14:45:11 Tests run: 18, Failures: 0, Errors: 0, Skipped: 0, Time elapsed: 0.004 sec
16-Mar-2020 14:45:11 Running org.openmrs.report.PatientSearchTest
16-Mar-2020 14:45:11 Tests run: 1, Failures: 0, Errors: 0, Skipped: 0, Time elapsed: 0.129 sec
16-Mar-2020 14:45:11 Running org.openmrs.validator.EncounterRoleValidatorTest
16-Mar-2020 14:45:11 Tests run: 1, Failures: 0, Errors: 0, Skipped: 0, Time elapsed: 0.001 sec
16-Mar-2020 14:45:11 Running org.openmrs.api.handler.PersonUnvoidHandlerTest
16-Mar-2020 14:45:11 Tests run: 6, Failures: 0, Errors: 0, Skipped: 0, Time elapsed: 0.002 sec
16-Mar-2020 14:45:11
16-Mar-2020 14:45:11 Results :
16-Mar-2020 14:45:11
16-Mar-2020 14:45:11 Tests in error:
16-Mar-2020 14:45:11   shouldSaveLastExecutionTime(org.openmrs.scheduler.SchedulerServiceTest)
16-Mar-2020 14:45:11   shouldNotAllowTaskExecuteToRunBeforeInitializationIsComplete(org.openmrs.scheduler.SchedulerServiceTest)
16-Mar-2020 14:45:11   saveTask_shouldSaveTaskToTheDatabase(org.openmrs.scheduler.SchedulerServiceTest)
16-Mar-2020 14:45:11   shouldNotThrowExceptionWhenTaskDefinitionIsNull(org.openmrs.scheduler.SchedulerServiceTest)
16-Mar-2020 14:45:11   validate_shouldFailValidationIfClassIsNotAccessible(org.openmrs.validator.SchedulerFormValidatorTest)
16-Mar-2020 14:45:11   validate_shouldFailValidationIfClassNotFound(org.openmrs.validator.SchedulerFormValidatorTest)
16-Mar-2020 14:45:11   validate_shouldFailValidationIfNameIsNullOrEmptyOrWhitespace(org.openmrs.validator.SchedulerFormValidatorTest)
16-Mar-2020 14:45:11   validate_shouldPassValidationIfAllRequiredFieldsHaveProperValues(org.openmrs.validator.SchedulerFormValidatorTest)
16-Mar-2020 14:45:11   validate_shouldFailValidationIfClassIsNotInstanceOfTask(org.openmrs.validator.SchedulerFormValidatorTest)
16-Mar-2020 14:45:11   validate_shouldFailValidationIfTaskClassIsEmptyOrWhitespace(org.openmrs.validator.SchedulerFormValidatorTest)
16-Mar-2020 14:45:11   validate_shouldFailValidationIfClassCannotBeInstantiated(org.openmrs.validator.SchedulerFormValidatorTest)
16-Mar-2020 14:45:11   validate_shouldFailValidationIfRepeatIntervalIsNullOrEmptyOrWhitespace(org.openmrs.validator.SchedulerFormValidatorTest)
16-Mar-2020 14:45:11
16-Mar-2020 14:45:11 Tests run: 2634, Failures: 0, Errors: 12, Skipped: 26
16-Mar-2020 14:45:11
16-Mar-2020 14:45:15 [INFO] ------------------------------------------------------------------------
16-Mar-2020 14:45:15 [INFO] Reactor Summary:
16-Mar-2020 14:45:15 [INFO]
16-Mar-2020 14:45:15 [INFO] OpenMRS ............................................ SUCCESS [  0.551 s]
16-Mar-2020 14:45:15 [INFO] openmrs-tools ...................................... SUCCESS [  1.027 s]
16-Mar-2020 14:45:15 [INFO] openmrs-test ....................................... SUCCESS [  0.004 s]
16-Mar-2020 14:45:15 [INFO] openmrs-api ........................................ FAILURE [05:27 min]
16-Mar-2020 14:45:15 [INFO] openmrs-web ........................................ SKIPPED
16-Mar-2020 14:45:15 [INFO] openmrs-webapp ..................................... SKIPPED
16-Mar-2020 14:45:15 [INFO] ------------------------------------------------------------------------
16-Mar-2020 14:45:15 [INFO] BUILD FAILURE
16-Mar-2020 14:45:15 [INFO] ------------------------------------------------------------------------
16-Mar-2020 14:45:15 [INFO] Total time: 05:29 min
16-Mar-2020 14:45:15 [INFO] Finished at: 2020-03-16T14:45:15+00:00
16-Mar-2020 14:45:15 [INFO] Final Memory: 49M/411M
16-Mar-2020 14:45:15 [INFO] ------------------------------------------------------------------------
16-Mar-2020 14:45:15 [WARNING] The requested profile "skip-default-test" could not be activated because it does not exist.
16-Mar-2020 14:45:15 [WARNING] The requested profile "integration-test" could not be activated because it does not exist.
16-Mar-2020 14:45:15 [ERROR] Failed to execute goal org.apache.maven.plugins:maven-surefire-plugin:2.5:test (default-test) on project openmrs-api: There are test failures.
16-Mar-2020 14:45:15 [ERROR]
16-Mar-2020 14:45:15 [ERROR] Please refer to /home/bamboo-agent/bamboo-agent/xml-data/build-dir/TRUNK-ONEPOINTTENX-IT/api/target/surefire-reports for the individual test results.
16-Mar-2020 14:45:15 [ERROR] -> [Help 1]
16-Mar-2020 14:45:15 [ERROR]
16-Mar-2020 14:45:15 [ERROR] To see the full stack trace of the errors, re-run Maven with the -e switch.
16-Mar-2020 14:45:15 [ERROR] Re-run Maven using the -X switch to enable full debug logging.
16-Mar-2020 14:45:15 [ERROR]
16-Mar-2020 14:45:15 [ERROR] For more information about the errors and possible solutions, please read the following articles:
16-Mar-2020 14:45:15 [ERROR] [Help 1] http://cwiki.apache.org/confluence/display/MAVEN/MojoFailureException
16-Mar-2020 14:45:15 [ERROR]
16-Mar-2020 14:45:15 [ERROR] After correcting the problems, you can resume the build with the command
16-Mar-2020 14:45:15 [ERROR]   mvn <goals> -rf :openmrs-api
16-Mar-2020 14:45:15 Failing task since return code of [/usr/share/apache-maven-3.2.5/bin/mvn --batch-mode -Djava.io.tmpdir=/home/bamboo-agent/bamboo-agent/.agent_tmp/TRUNK-ONEPOINTTENX-IT clean test -Pskip-default-test -Pintegration-test] was 1 while expected 0
16-Mar-2020 14:45:15 Parsing test results under /home/bamboo-agent/bamboo-agent/xml-data/build-dir/TRUNK-ONEPOINTTENX-IT...
16-Mar-2020 14:45:17 Finished task 'Maven 3.x' with result: Failed
16-Mar-2020 14:45:17 Running post build plugin 'Docker Container Cleanup'
16-Mar-2020 14:45:17 Running post build plugin 'NCover Results Collector'
16-Mar-2020 14:45:17 Running post build plugin 'Clover Results Collector'
16-Mar-2020 14:45:17 Running post build plugin 'Sauce OnDemand Post Runner'
16-Mar-2020 14:45:17 Running post build plugin 'npm Cache Cleanup'
16-Mar-2020 14:45:17 Running post build plugin 'Artifact Copier'
16-Mar-2020 14:45:17 Publishing an artifact: openmrs-war
16-Mar-2020 14:45:17 Unable to publish artifact [openmrs-war]: the source directory /home/bamboo-agent/bamboo-agent/xml-data/build-dir/TRUNK-ONEPOINTTENX-IT/webapp/target does not exist.
16-Mar-2020 14:45:17 The artifact hasn't been successfully published after 362.4 μs
16-Mar-2020 14:45:17 Publishing an artifact: openmrs-api
16-Mar-2020 14:45:17 Unable to publish artifact [openmrs-api]: the source directory /home/bamboo-agent/bamboo-agent/xml-data/build-dir/TRUNK-ONEPOINTTENX-IT/webapp/target/openmrs/WEB-INF/lib does not exist.
16-Mar-2020 14:45:17 The artifact hasn't been successfully published after 76.23 μs
16-Mar-2020 14:45:17 Publishing an artifact: sonar-report
16-Mar-2020 14:45:17 Unable to publish artifact [sonar-report]: the source directory /home/bamboo-agent/bamboo-agent/xml-data/build-dir/TRUNK-ONEPOINTTENX-IT/target/sonar/issues-report does not exist.
16-Mar-2020 14:45:17 The artifact hasn't been successfully published after 82.91 μs
16-Mar-2020 14:45:17 Finalising the build...
16-Mar-2020 14:45:17 Stopping timer.
16-Mar-2020 14:45:17 Build TRUNK-ONEPOINTTENX-IT-531 completed.
16-Mar-2020 14:45:17 Running on server: post build plugin 'NCover Results Collector'
16-Mar-2020 14:45:17 Running on server: post build plugin 'Build Hanging Detection Configuration'
16-Mar-2020 14:45:17 Running on server: post build plugin 'Clover Delta Calculator'
16-Mar-2020 14:45:17 Running on server: post build plugin 'Maven Dependencies Postprocessor'
16-Mar-2020 14:45:17 All post build plugins have finished
16-Mar-2020 14:45:17 Generating build results summary...
16-Mar-2020 14:45:19 Saving build results to disk...
16-Mar-2020 14:45:19 Logging substituted variables...
16-Mar-2020 14:45:19 Indexing build results...
16-Mar-2020 14:45:19 Finished building TRUNK-ONEPOINTTENX-IT-531.