Plan disabled (and will eventuall be deleted) because Platform 1.8 is EOL

Build: #41 failed

Job: Default Job was successful

Stages & jobs

  1. Default Stage

  2. Release

    Requires a user to start manually

Build log

The build generated 4,814 lines of output.The output is too long and has been truncated to the last 1,000 lines. Download or view full build log

26-Nov-2015 22:32:55         at ca.uhn.hl7v2.app.MessageTypeRouter.processMessage(MessageTypeRouter.java:54)
26-Nov-2015 22:32:55         at org.openmrs.hl7.handler.ORUR01HandlerTest.processMessage_shouldFailIfQuestionDatatypeIsCodedAndABooleanIsNotAValidAnswer(ORUR01HandlerTest.java:712)
26-Nov-2015 22:32:55         at sun.reflect.NativeMethodAccessorImpl.invoke0(Native Method)
26-Nov-2015 22:32:55         at sun.reflect.NativeMethodAccessorImpl.invoke(NativeMethodAccessorImpl.java:57)
26-Nov-2015 22:32:55         at sun.reflect.DelegatingMethodAccessorImpl.invoke(DelegatingMethodAccessorImpl.java:43)
26-Nov-2015 22:32:55         at java.lang.reflect.Method.invoke(Method.java:622)
26-Nov-2015 22:32:55         at org.junit.runners.model.FrameworkMethod$1.runReflectiveCall(FrameworkMethod.java:47)
26-Nov-2015 22:32:55         at org.junit.internal.runners.model.ReflectiveCallable.run(ReflectiveCallable.java:12)
26-Nov-2015 22:32:55         at org.junit.runners.model.FrameworkMethod.invokeExplosively(FrameworkMethod.java:44)
26-Nov-2015 22:32:55         at org.junit.internal.runners.statements.InvokeMethod.evaluate(InvokeMethod.java:17)
26-Nov-2015 22:32:55         at org.junit.internal.runners.statements.ExpectException.evaluate(ExpectException.java:19)
26-Nov-2015 22:32:55         at org.junit.internal.runners.statements.RunBefores.evaluate(RunBefores.java:26)
26-Nov-2015 22:32:55         at org.springframework.test.context.junit4.statements.RunBeforeTestMethodCallbacks.evaluate(RunBeforeTestMethodCallbacks.java:74)
26-Nov-2015 22:32:55         at org.junit.internal.runners.statements.RunAfters.evaluate(RunAfters.java:27)
26-Nov-2015 22:32:55         at org.springframework.test.context.junit4.statements.RunAfterTestMethodCallbacks.evaluate(RunAfterTestMethodCallbacks.java:82)
26-Nov-2015 22:32:55         at org.springframework.test.context.junit4.statements.SpringRepeat.evaluate(SpringRepeat.java:72)
26-Nov-2015 22:32:55         at org.springframework.test.context.junit4.SpringJUnit4ClassRunner.runChild(SpringJUnit4ClassRunner.java:240)
26-Nov-2015 22:32:55         at org.junit.runners.BlockJUnit4ClassRunner.runChild(BlockJUnit4ClassRunner.java:50)
26-Nov-2015 22:32:55         at org.junit.runners.ParentRunner$3.run(ParentRunner.java:238)
26-Nov-2015 22:32:55         at org.junit.runners.ParentRunner$1.schedule(ParentRunner.java:63)
26-Nov-2015 22:32:55         at org.junit.runners.ParentRunner.runChildren(ParentRunner.java:236)
26-Nov-2015 22:32:55         at org.junit.runners.ParentRunner.access$000(ParentRunner.java:53)
26-Nov-2015 22:32:55         at org.junit.runners.ParentRunner$2.evaluate(ParentRunner.java:229)
26-Nov-2015 22:32:55         at org.springframework.test.context.junit4.statements.RunBeforeTestClassCallbacks.evaluate(RunBeforeTestClassCallbacks.java:61)
26-Nov-2015 22:32:55         at org.junit.internal.runners.statements.RunAfters.evaluate(RunAfters.java:27)
26-Nov-2015 22:32:55         at org.springframework.test.context.junit4.statements.RunAfterTestClassCallbacks.evaluate(RunAfterTestClassCallbacks.java:70)
26-Nov-2015 22:32:55         at org.junit.runners.ParentRunner.run(ParentRunner.java:309)
26-Nov-2015 22:32:55         at org.springframework.test.context.junit4.SpringJUnit4ClassRunner.run(SpringJUnit4ClassRunner.java:180)
26-Nov-2015 22:32:55         at org.apache.maven.surefire.junit4.JUnit4TestSet.execute(JUnit4TestSet.java:59)
26-Nov-2015 22:32:55         at org.apache.maven.surefire.suite.AbstractDirectoryTestSuite.executeTestSet(AbstractDirectoryTestSuite.java:115)
26-Nov-2015 22:32:55         at org.apache.maven.surefire.suite.AbstractDirectoryTestSuite.execute(AbstractDirectoryTestSuite.java:102)
26-Nov-2015 22:32:55         at org.apache.maven.surefire.Surefire.run(Surefire.java:180)
26-Nov-2015 22:32:55         at sun.reflect.NativeMethodAccessorImpl.invoke0(Native Method)
26-Nov-2015 22:32:55         at sun.reflect.NativeMethodAccessorImpl.invoke(NativeMethodAccessorImpl.java:57)
26-Nov-2015 22:32:55         at sun.reflect.DelegatingMethodAccessorImpl.invoke(DelegatingMethodAccessorImpl.java:43)
26-Nov-2015 22:32:55         at java.lang.reflect.Method.invoke(Method.java:622)
26-Nov-2015 22:32:55         at org.apache.maven.surefire.booter.SurefireBooter.runSuitesInProcess(SurefireBooter.java:350)
26-Nov-2015 22:32:55         at org.apache.maven.surefire.booter.SurefireBooter.main(SurefireBooter.java:1021)
26-Nov-2015 22:32:55 Caused by: ca.uhn.hl7v2.HL7Exception: 7 is not a valid answer for obs with uuid JqnfhKKtouEz8kzTk6Zo
26-Nov-2015 22:32:55         at org.openmrs.hl7.handler.ORUR01Handler.parseObs(ORUR01Handler.java:659)
26-Nov-2015 22:32:55         at org.openmrs.hl7.handler.ORUR01Handler.processORU_R01(ORUR01Handler.java:292)
26-Nov-2015 22:32:55         ... 39 more
26-Nov-2015 22:32:55 ERROR - ORUR01Handler.processMessage(151) |2015-11-26 22:32:55,964| Error while processing ORU_R01 message
26-Nov-2015 22:32:55 ca.uhn.hl7v2.HL7Exception: Improperly formatted OBX: OBX|1|CWE|6042^PROBLEM ADDED^99DCT||PROPOSED^^99DCT|||||||||20080208+0000
26-Nov-2015 22:32:55         at org.openmrs.hl7.handler.ORUR01Handler.processORU_R01(ORUR01Handler.java:337)
26-Nov-2015 22:32:55         at org.openmrs.hl7.handler.ORUR01Handler.processMessage(ORUR01Handler.java:144)
26-Nov-2015 22:32:55         at ca.uhn.hl7v2.app.MessageTypeRouter.processMessage(MessageTypeRouter.java:54)
26-Nov-2015 22:32:55         at org.openmrs.hl7.handler.ORUR01HandlerTest.processMessage_shouldFailOnEmptyConceptProposals(ORUR01HandlerTest.java:442)
26-Nov-2015 22:32:55         at sun.reflect.NativeMethodAccessorImpl.invoke0(Native Method)
26-Nov-2015 22:32:55         at sun.reflect.NativeMethodAccessorImpl.invoke(NativeMethodAccessorImpl.java:57)
26-Nov-2015 22:32:55         at sun.reflect.DelegatingMethodAccessorImpl.invoke(DelegatingMethodAccessorImpl.java:43)
26-Nov-2015 22:32:55         at java.lang.reflect.Method.invoke(Method.java:622)
26-Nov-2015 22:32:55         at org.junit.runners.model.FrameworkMethod$1.runReflectiveCall(FrameworkMethod.java:47)
26-Nov-2015 22:32:55         at org.junit.internal.runners.model.ReflectiveCallable.run(ReflectiveCallable.java:12)
26-Nov-2015 22:32:55         at org.junit.runners.model.FrameworkMethod.invokeExplosively(FrameworkMethod.java:44)
26-Nov-2015 22:32:55         at org.junit.internal.runners.statements.InvokeMethod.evaluate(InvokeMethod.java:17)
26-Nov-2015 22:32:55         at org.junit.internal.runners.statements.ExpectException.evaluate(ExpectException.java:19)
26-Nov-2015 22:32:55         at org.junit.internal.runners.statements.RunBefores.evaluate(RunBefores.java:26)
26-Nov-2015 22:32:55         at org.springframework.test.context.junit4.statements.RunBeforeTestMethodCallbacks.evaluate(RunBeforeTestMethodCallbacks.java:74)
26-Nov-2015 22:32:55         at org.junit.internal.runners.statements.RunAfters.evaluate(RunAfters.java:27)
26-Nov-2015 22:32:55         at org.springframework.test.context.junit4.statements.RunAfterTestMethodCallbacks.evaluate(RunAfterTestMethodCallbacks.java:82)
26-Nov-2015 22:32:55         at org.springframework.test.context.junit4.statements.SpringRepeat.evaluate(SpringRepeat.java:72)
26-Nov-2015 22:32:55         at org.springframework.test.context.junit4.SpringJUnit4ClassRunner.runChild(SpringJUnit4ClassRunner.java:240)
26-Nov-2015 22:32:55         at org.junit.runners.BlockJUnit4ClassRunner.runChild(BlockJUnit4ClassRunner.java:50)
26-Nov-2015 22:32:55         at org.junit.runners.ParentRunner$3.run(ParentRunner.java:238)
26-Nov-2015 22:32:55         at org.junit.runners.ParentRunner$1.schedule(ParentRunner.java:63)
26-Nov-2015 22:32:55         at org.junit.runners.ParentRunner.runChildren(ParentRunner.java:236)
26-Nov-2015 22:32:55         at org.junit.runners.ParentRunner.access$000(ParentRunner.java:53)
26-Nov-2015 22:32:55         at org.junit.runners.ParentRunner$2.evaluate(ParentRunner.java:229)
26-Nov-2015 22:32:55         at org.springframework.test.context.junit4.statements.RunBeforeTestClassCallbacks.evaluate(RunBeforeTestClassCallbacks.java:61)
26-Nov-2015 22:32:55         at org.junit.internal.runners.statements.RunAfters.evaluate(RunAfters.java:27)
26-Nov-2015 22:32:55         at org.springframework.test.context.junit4.statements.RunAfterTestClassCallbacks.evaluate(RunAfterTestClassCallbacks.java:70)
26-Nov-2015 22:32:55         at org.junit.runners.ParentRunner.run(ParentRunner.java:309)
26-Nov-2015 22:32:55         at org.springframework.test.context.junit4.SpringJUnit4ClassRunner.run(SpringJUnit4ClassRunner.java:180)
26-Nov-2015 22:32:55         at org.apache.maven.surefire.junit4.JUnit4TestSet.execute(JUnit4TestSet.java:59)
26-Nov-2015 22:32:55         at org.apache.maven.surefire.suite.AbstractDirectoryTestSuite.executeTestSet(AbstractDirectoryTestSuite.java:115)
26-Nov-2015 22:32:55         at org.apache.maven.surefire.suite.AbstractDirectoryTestSuite.execute(AbstractDirectoryTestSuite.java:102)
26-Nov-2015 22:32:55         at org.apache.maven.surefire.Surefire.run(Surefire.java:180)
26-Nov-2015 22:32:55         at sun.reflect.NativeMethodAccessorImpl.invoke0(Native Method)
26-Nov-2015 22:32:55         at sun.reflect.NativeMethodAccessorImpl.invoke(NativeMethodAccessorImpl.java:57)
26-Nov-2015 22:32:55         at sun.reflect.DelegatingMethodAccessorImpl.invoke(DelegatingMethodAccessorImpl.java:43)
26-Nov-2015 22:32:55         at java.lang.reflect.Method.invoke(Method.java:622)
26-Nov-2015 22:32:55         at org.apache.maven.surefire.booter.SurefireBooter.runSuitesInProcess(SurefireBooter.java:350)
26-Nov-2015 22:32:55         at org.apache.maven.surefire.booter.SurefireBooter.main(SurefireBooter.java:1021)
26-Nov-2015 22:32:55 Caused by: ca.uhn.hl7v2.HL7Exception: Hl7.proposed.concept.name.empty
26-Nov-2015 22:32:55         at org.openmrs.hl7.handler.ORUR01Handler.processORU_R01(ORUR01Handler.java:325)
26-Nov-2015 22:32:55         ... 39 more
26-Nov-2015 22:32:55 Caused by: org.openmrs.hl7.handler.ProposingConceptException
26-Nov-2015 22:32:55         at org.openmrs.hl7.handler.ORUR01Handler.parseObs(ORUR01Handler.java:684)
26-Nov-2015 22:32:55         at org.openmrs.hl7.handler.ORUR01Handler.processORU_R01(ORUR01Handler.java:292)
26-Nov-2015 22:32:55         ... 39 more
26-Nov-2015 22:32:56 ERROR - EncounterSaveHandler.handle(51) |2015-11-26 22:32:56,399| Unable to save complex obs
26-Nov-2015 22:32:56 java.lang.NullPointerException
26-Nov-2015 22:32:56         at org.openmrs.api.handler.EncounterSaveHandler.handle(EncounterSaveHandler.java:43)
26-Nov-2015 22:32:56         at org.openmrs.api.handler.EncounterSaveHandler.handle(EncounterSaveHandler.java:29)
26-Nov-2015 22:32:56         at org.openmrs.aop.RequiredDataAdvice.recursivelyHandle(RequiredDataAdvice.java:258)
26-Nov-2015 22:32:56         at org.openmrs.aop.RequiredDataAdvice.recursivelyHandle(RequiredDataAdvice.java:221)
26-Nov-2015 22:32:56         at org.openmrs.aop.RequiredDataAdvice.before(RequiredDataAdvice.java:131)
26-Nov-2015 22:32:56         at org.springframework.aop.framework.adapter.MethodBeforeAdviceInterceptor.invoke(MethodBeforeAdviceInterceptor.java:49)
26-Nov-2015 22:32:56         at org.springframework.aop.framework.ReflectiveMethodInvocation.proceed(ReflectiveMethodInvocation.java:172)
26-Nov-2015 22:32:56         at org.springframework.aop.framework.adapter.MethodBeforeAdviceInterceptor.invoke(MethodBeforeAdviceInterceptor.java:50)
26-Nov-2015 22:32:56         at org.springframework.aop.framework.ReflectiveMethodInvocation.proceed(ReflectiveMethodInvocation.java:172)
26-Nov-2015 22:32:56         at org.springframework.aop.framework.JdkDynamicAopProxy.invoke(JdkDynamicAopProxy.java:202)
26-Nov-2015 22:32:56         at com.sun.proxy.$Proxy31.saveEncounter(Unknown Source)
26-Nov-2015 22:32:56         at sun.reflect.GeneratedMethodAccessor209.invoke(Unknown Source)
26-Nov-2015 22:32:56         at sun.reflect.DelegatingMethodAccessorImpl.invoke(DelegatingMethodAccessorImpl.java:43)
26-Nov-2015 22:32:56         at java.lang.reflect.Method.invoke(Method.java:622)
26-Nov-2015 22:32:56         at org.springframework.aop.support.AopUtils.invokeJoinpointUsingReflection(AopUtils.java:309)
26-Nov-2015 22:32:56         at org.springframework.aop.framework.ReflectiveMethodInvocation.invokeJoinpoint(ReflectiveMethodInvocation.java:183)
26-Nov-2015 22:32:56         at org.springframework.aop.framework.ReflectiveMethodInvocation.proceed(ReflectiveMethodInvocation.java:150)
26-Nov-2015 22:32:56         at org.springframework.transaction.interceptor.TransactionInterceptor.invoke(TransactionInterceptor.java:110)
26-Nov-2015 22:32:56         at org.springframework.aop.framework.ReflectiveMethodInvocation.proceed(ReflectiveMethodInvocation.java:172)
26-Nov-2015 22:32:56         at org.springframework.aop.framework.JdkDynamicAopProxy.invoke(JdkDynamicAopProxy.java:202)
26-Nov-2015 22:32:56         at com.sun.proxy.$Proxy31.saveEncounter(Unknown Source)
26-Nov-2015 22:32:56         at org.openmrs.hl7.handler.ORUR01Handler.processORU_R01(ORUR01Handler.java:351)
26-Nov-2015 22:32:56         at org.openmrs.hl7.handler.ORUR01Handler.processMessage(ORUR01Handler.java:144)
26-Nov-2015 22:32:56         at ca.uhn.hl7v2.app.MessageTypeRouter.processMessage(MessageTypeRouter.java:54)
26-Nov-2015 22:32:56         at org.openmrs.hl7.handler.ORUR01HandlerTest.processMessage_shouldAppendToAnExistingEncounter(ORUR01HandlerTest.java:241)
26-Nov-2015 22:32:56         at sun.reflect.NativeMethodAccessorImpl.invoke0(Native Method)
26-Nov-2015 22:32:56         at sun.reflect.NativeMethodAccessorImpl.invoke(NativeMethodAccessorImpl.java:57)
26-Nov-2015 22:32:56         at sun.reflect.DelegatingMethodAccessorImpl.invoke(DelegatingMethodAccessorImpl.java:43)
26-Nov-2015 22:32:56         at java.lang.reflect.Method.invoke(Method.java:622)
26-Nov-2015 22:32:56         at org.junit.runners.model.FrameworkMethod$1.runReflectiveCall(FrameworkMethod.java:47)
26-Nov-2015 22:32:56         at org.junit.internal.runners.model.ReflectiveCallable.run(ReflectiveCallable.java:12)
26-Nov-2015 22:32:56         at org.junit.runners.model.FrameworkMethod.invokeExplosively(FrameworkMethod.java:44)
26-Nov-2015 22:32:56         at org.junit.internal.runners.statements.InvokeMethod.evaluate(InvokeMethod.java:17)
26-Nov-2015 22:32:56         at org.junit.internal.runners.statements.RunBefores.evaluate(RunBefores.java:26)
26-Nov-2015 22:32:56         at org.springframework.test.context.junit4.statements.RunBeforeTestMethodCallbacks.evaluate(RunBeforeTestMethodCallbacks.java:74)
26-Nov-2015 22:32:56         at org.junit.internal.runners.statements.RunAfters.evaluate(RunAfters.java:27)
26-Nov-2015 22:32:56         at org.springframework.test.context.junit4.statements.RunAfterTestMethodCallbacks.evaluate(RunAfterTestMethodCallbacks.java:82)
26-Nov-2015 22:32:56         at org.springframework.test.context.junit4.statements.SpringRepeat.evaluate(SpringRepeat.java:72)
26-Nov-2015 22:32:56         at org.springframework.test.context.junit4.SpringJUnit4ClassRunner.runChild(SpringJUnit4ClassRunner.java:240)
26-Nov-2015 22:32:56         at org.junit.runners.BlockJUnit4ClassRunner.runChild(BlockJUnit4ClassRunner.java:50)
26-Nov-2015 22:32:56         at org.junit.runners.ParentRunner$3.run(ParentRunner.java:238)
26-Nov-2015 22:32:56         at org.junit.runners.ParentRunner$1.schedule(ParentRunner.java:63)
26-Nov-2015 22:32:56         at org.junit.runners.ParentRunner.runChildren(ParentRunner.java:236)
26-Nov-2015 22:32:56         at org.junit.runners.ParentRunner.access$000(ParentRunner.java:53)
26-Nov-2015 22:32:56         at org.junit.runners.ParentRunner$2.evaluate(ParentRunner.java:229)
26-Nov-2015 22:32:56         at org.springframework.test.context.junit4.statements.RunBeforeTestClassCallbacks.evaluate(RunBeforeTestClassCallbacks.java:61)
26-Nov-2015 22:32:56         at org.junit.internal.runners.statements.RunAfters.evaluate(RunAfters.java:27)
26-Nov-2015 22:32:56         at org.springframework.test.context.junit4.statements.RunAfterTestClassCallbacks.evaluate(RunAfterTestClassCallbacks.java:70)
26-Nov-2015 22:32:56         at org.junit.runners.ParentRunner.run(ParentRunner.java:309)
26-Nov-2015 22:32:56         at org.springframework.test.context.junit4.SpringJUnit4ClassRunner.run(SpringJUnit4ClassRunner.java:180)
26-Nov-2015 22:32:56         at org.apache.maven.surefire.junit4.JUnit4TestSet.execute(JUnit4TestSet.java:59)
26-Nov-2015 22:32:56         at org.apache.maven.surefire.suite.AbstractDirectoryTestSuite.executeTestSet(AbstractDirectoryTestSuite.java:115)
26-Nov-2015 22:32:56         at org.apache.maven.surefire.suite.AbstractDirectoryTestSuite.execute(AbstractDirectoryTestSuite.java:102)
26-Nov-2015 22:32:56         at org.apache.maven.surefire.Surefire.run(Surefire.java:180)
26-Nov-2015 22:32:56         at sun.reflect.NativeMethodAccessorImpl.invoke0(Native Method)
26-Nov-2015 22:32:56         at sun.reflect.NativeMethodAccessorImpl.invoke(NativeMethodAccessorImpl.java:57)
26-Nov-2015 22:32:56         at sun.reflect.DelegatingMethodAccessorImpl.invoke(DelegatingMethodAccessorImpl.java:43)
26-Nov-2015 22:32:56         at java.lang.reflect.Method.invoke(Method.java:622)
26-Nov-2015 22:32:56         at org.apache.maven.surefire.booter.SurefireBooter.runSuitesInProcess(SurefireBooter.java:350)
26-Nov-2015 22:32:56         at org.apache.maven.surefire.booter.SurefireBooter.main(SurefireBooter.java:1021)
26-Nov-2015 22:32:56 ERROR - EncounterSaveHandler.handle(51) |2015-11-26 22:32:56,546| Unable to save complex obs
26-Nov-2015 22:32:56 java.lang.NullPointerException
26-Nov-2015 22:32:56         at org.openmrs.api.handler.EncounterSaveHandler.handle(EncounterSaveHandler.java:43)
26-Nov-2015 22:32:56         at org.openmrs.api.handler.EncounterSaveHandler.handle(EncounterSaveHandler.java:29)
26-Nov-2015 22:32:56         at org.openmrs.aop.RequiredDataAdvice.recursivelyHandle(RequiredDataAdvice.java:258)
26-Nov-2015 22:32:56         at org.openmrs.aop.RequiredDataAdvice.recursivelyHandle(RequiredDataAdvice.java:221)
26-Nov-2015 22:32:56         at org.openmrs.aop.RequiredDataAdvice.before(RequiredDataAdvice.java:131)
26-Nov-2015 22:32:56         at org.springframework.aop.framework.adapter.MethodBeforeAdviceInterceptor.invoke(MethodBeforeAdviceInterceptor.java:49)
26-Nov-2015 22:32:56         at org.springframework.aop.framework.ReflectiveMethodInvocation.proceed(ReflectiveMethodInvocation.java:172)
26-Nov-2015 22:32:56         at org.springframework.aop.framework.adapter.MethodBeforeAdviceInterceptor.invoke(MethodBeforeAdviceInterceptor.java:50)
26-Nov-2015 22:32:56         at org.springframework.aop.framework.ReflectiveMethodInvocation.proceed(ReflectiveMethodInvocation.java:172)
26-Nov-2015 22:32:56         at org.springframework.aop.framework.JdkDynamicAopProxy.invoke(JdkDynamicAopProxy.java:202)
26-Nov-2015 22:32:56         at com.sun.proxy.$Proxy31.saveEncounter(Unknown Source)
26-Nov-2015 22:32:56         at sun.reflect.GeneratedMethodAccessor209.invoke(Unknown Source)
26-Nov-2015 22:32:56         at sun.reflect.DelegatingMethodAccessorImpl.invoke(DelegatingMethodAccessorImpl.java:43)
26-Nov-2015 22:32:56         at java.lang.reflect.Method.invoke(Method.java:622)
26-Nov-2015 22:32:56         at org.springframework.aop.support.AopUtils.invokeJoinpointUsingReflection(AopUtils.java:309)
26-Nov-2015 22:32:56         at org.springframework.aop.framework.ReflectiveMethodInvocation.invokeJoinpoint(ReflectiveMethodInvocation.java:183)
26-Nov-2015 22:32:56         at org.springframework.aop.framework.ReflectiveMethodInvocation.proceed(ReflectiveMethodInvocation.java:150)
26-Nov-2015 22:32:56         at org.springframework.transaction.interceptor.TransactionInterceptor.invoke(TransactionInterceptor.java:110)
26-Nov-2015 22:32:56         at org.springframework.aop.framework.ReflectiveMethodInvocation.proceed(ReflectiveMethodInvocation.java:172)
26-Nov-2015 22:32:56         at org.springframework.aop.framework.JdkDynamicAopProxy.invoke(JdkDynamicAopProxy.java:202)
26-Nov-2015 22:32:56         at com.sun.proxy.$Proxy31.saveEncounter(Unknown Source)
26-Nov-2015 22:32:56         at org.openmrs.hl7.handler.ORUR01Handler.processORU_R01(ORUR01Handler.java:351)
26-Nov-2015 22:32:56         at org.openmrs.hl7.handler.ORUR01Handler.processMessage(ORUR01Handler.java:144)
26-Nov-2015 22:32:56         at ca.uhn.hl7v2.app.MessageTypeRouter.processMessage(MessageTypeRouter.java:54)
26-Nov-2015 22:32:56         at org.openmrs.hl7.handler.ORUR01HandlerTest.processMessage_shouldCreateConceptProposalAndWithObsAlongside(ORUR01HandlerTest.java:307)
26-Nov-2015 22:32:56         at sun.reflect.NativeMethodAccessorImpl.invoke0(Native Method)
26-Nov-2015 22:32:56         at sun.reflect.NativeMethodAccessorImpl.invoke(NativeMethodAccessorImpl.java:57)
26-Nov-2015 22:32:56         at sun.reflect.DelegatingMethodAccessorImpl.invoke(DelegatingMethodAccessorImpl.java:43)
26-Nov-2015 22:32:56         at java.lang.reflect.Method.invoke(Method.java:622)
26-Nov-2015 22:32:56         at org.junit.runners.model.FrameworkMethod$1.runReflectiveCall(FrameworkMethod.java:47)
26-Nov-2015 22:32:56         at org.junit.internal.runners.model.ReflectiveCallable.run(ReflectiveCallable.java:12)
26-Nov-2015 22:32:56         at org.junit.runners.model.FrameworkMethod.invokeExplosively(FrameworkMethod.java:44)
26-Nov-2015 22:32:56         at org.junit.internal.runners.statements.InvokeMethod.evaluate(InvokeMethod.java:17)
26-Nov-2015 22:32:56         at org.junit.internal.runners.statements.RunBefores.evaluate(RunBefores.java:26)
26-Nov-2015 22:32:56         at org.springframework.test.context.junit4.statements.RunBeforeTestMethodCallbacks.evaluate(RunBeforeTestMethodCallbacks.java:74)
26-Nov-2015 22:32:56         at org.junit.internal.runners.statements.RunAfters.evaluate(RunAfters.java:27)
26-Nov-2015 22:32:56         at org.springframework.test.context.junit4.statements.RunAfterTestMethodCallbacks.evaluate(RunAfterTestMethodCallbacks.java:82)
26-Nov-2015 22:32:56         at org.springframework.test.context.junit4.statements.SpringRepeat.evaluate(SpringRepeat.java:72)
26-Nov-2015 22:32:56         at org.springframework.test.context.junit4.SpringJUnit4ClassRunner.runChild(SpringJUnit4ClassRunner.java:240)
26-Nov-2015 22:32:56         at org.junit.runners.BlockJUnit4ClassRunner.runChild(BlockJUnit4ClassRunner.java:50)
26-Nov-2015 22:32:56         at org.junit.runners.ParentRunner$3.run(ParentRunner.java:238)
26-Nov-2015 22:32:56         at org.junit.runners.ParentRunner$1.schedule(ParentRunner.java:63)
26-Nov-2015 22:32:56         at org.junit.runners.ParentRunner.runChildren(ParentRunner.java:236)
26-Nov-2015 22:32:56         at org.junit.runners.ParentRunner.access$000(ParentRunner.java:53)
26-Nov-2015 22:32:56         at org.junit.runners.ParentRunner$2.evaluate(ParentRunner.java:229)
26-Nov-2015 22:32:56         at org.springframework.test.context.junit4.statements.RunBeforeTestClassCallbacks.evaluate(RunBeforeTestClassCallbacks.java:61)
26-Nov-2015 22:32:56         at org.junit.internal.runners.statements.RunAfters.evaluate(RunAfters.java:27)
26-Nov-2015 22:32:56         at org.springframework.test.context.junit4.statements.RunAfterTestClassCallbacks.evaluate(RunAfterTestClassCallbacks.java:70)
26-Nov-2015 22:32:56         at org.junit.runners.ParentRunner.run(ParentRunner.java:309)
26-Nov-2015 22:32:56         at org.springframework.test.context.junit4.SpringJUnit4ClassRunner.run(SpringJUnit4ClassRunner.java:180)
26-Nov-2015 22:32:56         at org.apache.maven.surefire.junit4.JUnit4TestSet.execute(JUnit4TestSet.java:59)
26-Nov-2015 22:32:56         at org.apache.maven.surefire.suite.AbstractDirectoryTestSuite.executeTestSet(AbstractDirectoryTestSuite.java:115)
26-Nov-2015 22:32:56         at org.apache.maven.surefire.suite.AbstractDirectoryTestSuite.execute(AbstractDirectoryTestSuite.java:102)
26-Nov-2015 22:32:56         at org.apache.maven.surefire.Surefire.run(Surefire.java:180)
26-Nov-2015 22:32:56         at sun.reflect.NativeMethodAccessorImpl.invoke0(Native Method)
26-Nov-2015 22:32:56         at sun.reflect.NativeMethodAccessorImpl.invoke(NativeMethodAccessorImpl.java:57)
26-Nov-2015 22:32:56         at sun.reflect.DelegatingMethodAccessorImpl.invoke(DelegatingMethodAccessorImpl.java:43)
26-Nov-2015 22:32:56         at java.lang.reflect.Method.invoke(Method.java:622)
26-Nov-2015 22:32:56         at org.apache.maven.surefire.booter.SurefireBooter.runSuitesInProcess(SurefireBooter.java:350)
26-Nov-2015 22:32:56         at org.apache.maven.surefire.booter.SurefireBooter.main(SurefireBooter.java:1021)
26-Nov-2015 22:32:56 ERROR - EncounterSaveHandler.handle(51) |2015-11-26 22:32:56,548| Unable to save complex obs
26-Nov-2015 22:32:56 java.lang.NullPointerException
26-Nov-2015 22:32:56         at org.openmrs.api.handler.EncounterSaveHandler.handle(EncounterSaveHandler.java:43)
26-Nov-2015 22:32:56         at org.openmrs.api.handler.EncounterSaveHandler.handle(EncounterSaveHandler.java:29)
26-Nov-2015 22:32:56         at org.openmrs.aop.RequiredDataAdvice.recursivelyHandle(RequiredDataAdvice.java:258)
26-Nov-2015 22:32:56         at org.openmrs.aop.RequiredDataAdvice.recursivelyHandle(RequiredDataAdvice.java:221)
26-Nov-2015 22:32:56         at org.openmrs.aop.RequiredDataAdvice.before(RequiredDataAdvice.java:131)
26-Nov-2015 22:32:56         at org.springframework.aop.framework.adapter.MethodBeforeAdviceInterceptor.invoke(MethodBeforeAdviceInterceptor.java:49)
26-Nov-2015 22:32:56         at org.springframework.aop.framework.ReflectiveMethodInvocation.proceed(ReflectiveMethodInvocation.java:172)
26-Nov-2015 22:32:56         at org.springframework.aop.framework.adapter.MethodBeforeAdviceInterceptor.invoke(MethodBeforeAdviceInterceptor.java:50)
26-Nov-2015 22:32:56         at org.springframework.aop.framework.ReflectiveMethodInvocation.proceed(ReflectiveMethodInvocation.java:172)
26-Nov-2015 22:32:56         at org.springframework.aop.framework.JdkDynamicAopProxy.invoke(JdkDynamicAopProxy.java:202)
26-Nov-2015 22:32:56         at com.sun.proxy.$Proxy31.saveEncounter(Unknown Source)
26-Nov-2015 22:32:56         at sun.reflect.GeneratedMethodAccessor209.invoke(Unknown Source)
26-Nov-2015 22:32:56         at sun.reflect.DelegatingMethodAccessorImpl.invoke(DelegatingMethodAccessorImpl.java:43)
26-Nov-2015 22:32:56         at java.lang.reflect.Method.invoke(Method.java:622)
26-Nov-2015 22:32:56         at org.springframework.aop.support.AopUtils.invokeJoinpointUsingReflection(AopUtils.java:309)
26-Nov-2015 22:32:56         at org.springframework.aop.framework.ReflectiveMethodInvocation.invokeJoinpoint(ReflectiveMethodInvocation.java:183)
26-Nov-2015 22:32:56         at org.springframework.aop.framework.ReflectiveMethodInvocation.proceed(ReflectiveMethodInvocation.java:150)
26-Nov-2015 22:32:56         at org.springframework.transaction.interceptor.TransactionInterceptor.invoke(TransactionInterceptor.java:110)
26-Nov-2015 22:32:56         at org.springframework.aop.framework.ReflectiveMethodInvocation.proceed(ReflectiveMethodInvocation.java:172)
26-Nov-2015 22:32:56         at org.springframework.aop.framework.JdkDynamicAopProxy.invoke(JdkDynamicAopProxy.java:202)
26-Nov-2015 22:32:56         at com.sun.proxy.$Proxy31.saveEncounter(Unknown Source)
26-Nov-2015 22:32:56         at org.openmrs.hl7.handler.ORUR01Handler.processORU_R01(ORUR01Handler.java:351)
26-Nov-2015 22:32:56         at org.openmrs.hl7.handler.ORUR01Handler.processMessage(ORUR01Handler.java:144)
26-Nov-2015 22:32:56         at ca.uhn.hl7v2.app.MessageTypeRouter.processMessage(MessageTypeRouter.java:54)
26-Nov-2015 22:32:56         at org.openmrs.hl7.handler.ORUR01HandlerTest.processMessage_shouldCreateConceptProposalAndWithObsAlongside(ORUR01HandlerTest.java:307)
26-Nov-2015 22:32:56         at sun.reflect.NativeMethodAccessorImpl.invoke0(Native Method)
26-Nov-2015 22:32:56         at sun.reflect.NativeMethodAccessorImpl.invoke(NativeMethodAccessorImpl.java:57)
26-Nov-2015 22:32:56         at sun.reflect.DelegatingMethodAccessorImpl.invoke(DelegatingMethodAccessorImpl.java:43)
26-Nov-2015 22:32:56         at java.lang.reflect.Method.invoke(Method.java:622)
26-Nov-2015 22:32:56         at org.junit.runners.model.FrameworkMethod$1.runReflectiveCall(FrameworkMethod.java:47)
26-Nov-2015 22:32:56         at org.junit.internal.runners.model.ReflectiveCallable.run(ReflectiveCallable.java:12)
26-Nov-2015 22:32:56         at org.junit.runners.model.FrameworkMethod.invokeExplosively(FrameworkMethod.java:44)
26-Nov-2015 22:32:56         at org.junit.internal.runners.statements.InvokeMethod.evaluate(InvokeMethod.java:17)
26-Nov-2015 22:32:56         at org.junit.internal.runners.statements.RunBefores.evaluate(RunBefores.java:26)
26-Nov-2015 22:32:56         at org.springframework.test.context.junit4.statements.RunBeforeTestMethodCallbacks.evaluate(RunBeforeTestMethodCallbacks.java:74)
26-Nov-2015 22:32:56         at org.junit.internal.runners.statements.RunAfters.evaluate(RunAfters.java:27)
26-Nov-2015 22:32:56         at org.springframework.test.context.junit4.statements.RunAfterTestMethodCallbacks.evaluate(RunAfterTestMethodCallbacks.java:82)
26-Nov-2015 22:32:56         at org.springframework.test.context.junit4.statements.SpringRepeat.evaluate(SpringRepeat.java:72)
26-Nov-2015 22:32:56         at org.springframework.test.context.junit4.SpringJUnit4ClassRunner.runChild(SpringJUnit4ClassRunner.java:240)
26-Nov-2015 22:32:56         at org.junit.runners.BlockJUnit4ClassRunner.runChild(BlockJUnit4ClassRunner.java:50)
26-Nov-2015 22:32:56         at org.junit.runners.ParentRunner$3.run(ParentRunner.java:238)
26-Nov-2015 22:32:56         at org.junit.runners.ParentRunner$1.schedule(ParentRunner.java:63)
26-Nov-2015 22:32:56         at org.junit.runners.ParentRunner.runChildren(ParentRunner.java:236)
26-Nov-2015 22:32:56         at org.junit.runners.ParentRunner.access$000(ParentRunner.java:53)
26-Nov-2015 22:32:56         at org.junit.runners.ParentRunner$2.evaluate(ParentRunner.java:229)
26-Nov-2015 22:32:56         at org.springframework.test.context.junit4.statements.RunBeforeTestClassCallbacks.evaluate(RunBeforeTestClassCallbacks.java:61)
26-Nov-2015 22:32:56         at org.junit.internal.runners.statements.RunAfters.evaluate(RunAfters.java:27)
26-Nov-2015 22:32:56         at org.springframework.test.context.junit4.statements.RunAfterTestClassCallbacks.evaluate(RunAfterTestClassCallbacks.java:70)
26-Nov-2015 22:32:56         at org.junit.runners.ParentRunner.run(ParentRunner.java:309)
26-Nov-2015 22:32:56         at org.springframework.test.context.junit4.SpringJUnit4ClassRunner.run(SpringJUnit4ClassRunner.java:180)
26-Nov-2015 22:32:56         at org.apache.maven.surefire.junit4.JUnit4TestSet.execute(JUnit4TestSet.java:59)
26-Nov-2015 22:32:56         at org.apache.maven.surefire.suite.AbstractDirectoryTestSuite.executeTestSet(AbstractDirectoryTestSuite.java:115)
26-Nov-2015 22:32:56         at org.apache.maven.surefire.suite.AbstractDirectoryTestSuite.execute(AbstractDirectoryTestSuite.java:102)
26-Nov-2015 22:32:56         at org.apache.maven.surefire.Surefire.run(Surefire.java:180)
26-Nov-2015 22:32:56         at sun.reflect.NativeMethodAccessorImpl.invoke0(Native Method)
26-Nov-2015 22:32:56         at sun.reflect.NativeMethodAccessorImpl.invoke(NativeMethodAccessorImpl.java:57)
26-Nov-2015 22:32:56         at sun.reflect.DelegatingMethodAccessorImpl.invoke(DelegatingMethodAccessorImpl.java:43)
26-Nov-2015 22:32:56         at java.lang.reflect.Method.invoke(Method.java:622)
26-Nov-2015 22:32:56         at org.apache.maven.surefire.booter.SurefireBooter.runSuitesInProcess(SurefireBooter.java:350)
26-Nov-2015 22:32:56         at org.apache.maven.surefire.booter.SurefireBooter.main(SurefireBooter.java:1021)
26-Nov-2015 22:32:56 ERROR - EncounterSaveHandler.handle(51) |2015-11-26 22:32:56,550| Unable to save complex obs
26-Nov-2015 22:32:56 java.lang.NullPointerException
26-Nov-2015 22:32:56         at org.openmrs.api.handler.EncounterSaveHandler.handle(EncounterSaveHandler.java:43)
26-Nov-2015 22:32:56         at org.openmrs.api.handler.EncounterSaveHandler.handle(EncounterSaveHandler.java:29)
26-Nov-2015 22:32:56         at org.openmrs.aop.RequiredDataAdvice.recursivelyHandle(RequiredDataAdvice.java:258)
26-Nov-2015 22:32:56         at org.openmrs.aop.RequiredDataAdvice.recursivelyHandle(RequiredDataAdvice.java:221)
26-Nov-2015 22:32:56         at org.openmrs.aop.RequiredDataAdvice.before(RequiredDataAdvice.java:131)
26-Nov-2015 22:32:56         at org.springframework.aop.framework.adapter.MethodBeforeAdviceInterceptor.invoke(MethodBeforeAdviceInterceptor.java:49)
26-Nov-2015 22:32:56         at org.springframework.aop.framework.ReflectiveMethodInvocation.proceed(ReflectiveMethodInvocation.java:172)
26-Nov-2015 22:32:56         at org.springframework.aop.framework.adapter.MethodBeforeAdviceInterceptor.invoke(MethodBeforeAdviceInterceptor.java:50)
26-Nov-2015 22:32:56         at org.springframework.aop.framework.ReflectiveMethodInvocation.proceed(ReflectiveMethodInvocation.java:172)
26-Nov-2015 22:32:56         at org.springframework.aop.framework.JdkDynamicAopProxy.invoke(JdkDynamicAopProxy.java:202)
26-Nov-2015 22:32:56         at com.sun.proxy.$Proxy31.saveEncounter(Unknown Source)
26-Nov-2015 22:32:56         at sun.reflect.GeneratedMethodAccessor209.invoke(Unknown Source)
26-Nov-2015 22:32:56         at sun.reflect.DelegatingMethodAccessorImpl.invoke(DelegatingMethodAccessorImpl.java:43)
26-Nov-2015 22:32:56         at java.lang.reflect.Method.invoke(Method.java:622)
26-Nov-2015 22:32:56         at org.springframework.aop.support.AopUtils.invokeJoinpointUsingReflection(AopUtils.java:309)
26-Nov-2015 22:32:56         at org.springframework.aop.framework.ReflectiveMethodInvocation.invokeJoinpoint(ReflectiveMethodInvocation.java:183)
26-Nov-2015 22:32:56         at org.springframework.aop.framework.ReflectiveMethodInvocation.proceed(ReflectiveMethodInvocation.java:150)
26-Nov-2015 22:32:56         at org.springframework.transaction.interceptor.TransactionInterceptor.invoke(TransactionInterceptor.java:110)
26-Nov-2015 22:32:56         at org.springframework.aop.framework.ReflectiveMethodInvocation.proceed(ReflectiveMethodInvocation.java:172)
26-Nov-2015 22:32:56         at org.springframework.aop.framework.JdkDynamicAopProxy.invoke(JdkDynamicAopProxy.java:202)
26-Nov-2015 22:32:56         at com.sun.proxy.$Proxy31.saveEncounter(Unknown Source)
26-Nov-2015 22:32:56         at org.openmrs.hl7.handler.ORUR01Handler.processORU_R01(ORUR01Handler.java:351)
26-Nov-2015 22:32:56         at org.openmrs.hl7.handler.ORUR01Handler.processMessage(ORUR01Handler.java:144)
26-Nov-2015 22:32:56         at ca.uhn.hl7v2.app.MessageTypeRouter.processMessage(MessageTypeRouter.java:54)
26-Nov-2015 22:32:56         at org.openmrs.hl7.handler.ORUR01HandlerTest.processMessage_shouldCreateConceptProposalAndWithObsAlongside(ORUR01HandlerTest.java:307)
26-Nov-2015 22:32:56         at sun.reflect.NativeMethodAccessorImpl.invoke0(Native Method)
26-Nov-2015 22:32:56         at sun.reflect.NativeMethodAccessorImpl.invoke(NativeMethodAccessorImpl.java:57)
26-Nov-2015 22:32:56         at sun.reflect.DelegatingMethodAccessorImpl.invoke(DelegatingMethodAccessorImpl.java:43)
26-Nov-2015 22:32:56         at java.lang.reflect.Method.invoke(Method.java:622)
26-Nov-2015 22:32:56         at org.junit.runners.model.FrameworkMethod$1.runReflectiveCall(FrameworkMethod.java:47)
26-Nov-2015 22:32:56         at org.junit.internal.runners.model.ReflectiveCallable.run(ReflectiveCallable.java:12)
26-Nov-2015 22:32:56         at org.junit.runners.model.FrameworkMethod.invokeExplosively(FrameworkMethod.java:44)
26-Nov-2015 22:32:56         at org.junit.internal.runners.statements.InvokeMethod.evaluate(InvokeMethod.java:17)
26-Nov-2015 22:32:56         at org.junit.internal.runners.statements.RunBefores.evaluate(RunBefores.java:26)
26-Nov-2015 22:32:56         at org.springframework.test.context.junit4.statements.RunBeforeTestMethodCallbacks.evaluate(RunBeforeTestMethodCallbacks.java:74)
26-Nov-2015 22:32:56         at org.junit.internal.runners.statements.RunAfters.evaluate(RunAfters.java:27)
26-Nov-2015 22:32:56         at org.springframework.test.context.junit4.statements.RunAfterTestMethodCallbacks.evaluate(RunAfterTestMethodCallbacks.java:82)
26-Nov-2015 22:32:56         at org.springframework.test.context.junit4.statements.SpringRepeat.evaluate(SpringRepeat.java:72)
26-Nov-2015 22:32:56         at org.springframework.test.context.junit4.SpringJUnit4ClassRunner.runChild(SpringJUnit4ClassRunner.java:240)
26-Nov-2015 22:32:56         at org.junit.runners.BlockJUnit4ClassRunner.runChild(BlockJUnit4ClassRunner.java:50)
26-Nov-2015 22:32:56         at org.junit.runners.ParentRunner$3.run(ParentRunner.java:238)
26-Nov-2015 22:32:56         at org.junit.runners.ParentRunner$1.schedule(ParentRunner.java:63)
26-Nov-2015 22:32:56         at org.junit.runners.ParentRunner.runChildren(ParentRunner.java:236)
26-Nov-2015 22:32:56         at org.junit.runners.ParentRunner.access$000(ParentRunner.java:53)
26-Nov-2015 22:32:56         at org.junit.runners.ParentRunner$2.evaluate(ParentRunner.java:229)
26-Nov-2015 22:32:56         at org.springframework.test.context.junit4.statements.RunBeforeTestClassCallbacks.evaluate(RunBeforeTestClassCallbacks.java:61)
26-Nov-2015 22:32:56         at org.junit.internal.runners.statements.RunAfters.evaluate(RunAfters.java:27)
26-Nov-2015 22:32:56         at org.springframework.test.context.junit4.statements.RunAfterTestClassCallbacks.evaluate(RunAfterTestClassCallbacks.java:70)
26-Nov-2015 22:32:56         at org.junit.runners.ParentRunner.run(ParentRunner.java:309)
26-Nov-2015 22:32:56         at org.springframework.test.context.junit4.SpringJUnit4ClassRunner.run(SpringJUnit4ClassRunner.java:180)
26-Nov-2015 22:32:56         at org.apache.maven.surefire.junit4.JUnit4TestSet.execute(JUnit4TestSet.java:59)
26-Nov-2015 22:32:56         at org.apache.maven.surefire.suite.AbstractDirectoryTestSuite.executeTestSet(AbstractDirectoryTestSuite.java:115)
26-Nov-2015 22:32:56         at org.apache.maven.surefire.suite.AbstractDirectoryTestSuite.execute(AbstractDirectoryTestSuite.java:102)
26-Nov-2015 22:32:56         at org.apache.maven.surefire.Surefire.run(Surefire.java:180)
26-Nov-2015 22:32:56         at sun.reflect.NativeMethodAccessorImpl.invoke0(Native Method)
26-Nov-2015 22:32:56         at sun.reflect.NativeMethodAccessorImpl.invoke(NativeMethodAccessorImpl.java:57)
26-Nov-2015 22:32:56         at sun.reflect.DelegatingMethodAccessorImpl.invoke(DelegatingMethodAccessorImpl.java:43)
26-Nov-2015 22:32:56         at java.lang.reflect.Method.invoke(Method.java:622)
26-Nov-2015 22:32:56         at org.apache.maven.surefire.booter.SurefireBooter.runSuitesInProcess(SurefireBooter.java:350)
26-Nov-2015 22:32:56         at org.apache.maven.surefire.booter.SurefireBooter.main(SurefireBooter.java:1021)
26-Nov-2015 22:32:56 ERROR - EncounterSaveHandler.handle(51) |2015-11-26 22:32:56,702| Unable to save complex obs
26-Nov-2015 22:32:56 java.lang.NullPointerException
26-Nov-2015 22:32:56         at org.openmrs.api.handler.EncounterSaveHandler.handle(EncounterSaveHandler.java:43)
26-Nov-2015 22:32:56         at org.openmrs.api.handler.EncounterSaveHandler.handle(EncounterSaveHandler.java:29)
26-Nov-2015 22:32:56         at org.openmrs.aop.RequiredDataAdvice.recursivelyHandle(RequiredDataAdvice.java:258)
26-Nov-2015 22:32:56         at org.openmrs.aop.RequiredDataAdvice.recursivelyHandle(RequiredDataAdvice.java:221)
26-Nov-2015 22:32:56         at org.openmrs.aop.RequiredDataAdvice.before(RequiredDataAdvice.java:131)
26-Nov-2015 22:32:56         at org.springframework.aop.framework.adapter.MethodBeforeAdviceInterceptor.invoke(MethodBeforeAdviceInterceptor.java:49)
26-Nov-2015 22:32:56         at org.springframework.aop.framework.ReflectiveMethodInvocation.proceed(ReflectiveMethodInvocation.java:172)
26-Nov-2015 22:32:56         at org.springframework.aop.framework.adapter.MethodBeforeAdviceInterceptor.invoke(MethodBeforeAdviceInterceptor.java:50)
26-Nov-2015 22:32:56         at org.springframework.aop.framework.ReflectiveMethodInvocation.proceed(ReflectiveMethodInvocation.java:172)
26-Nov-2015 22:32:56         at org.springframework.aop.framework.JdkDynamicAopProxy.invoke(JdkDynamicAopProxy.java:202)
26-Nov-2015 22:32:56         at com.sun.proxy.$Proxy31.saveEncounter(Unknown Source)
26-Nov-2015 22:32:56         at sun.reflect.GeneratedMethodAccessor209.invoke(Unknown Source)
26-Nov-2015 22:32:56         at sun.reflect.DelegatingMethodAccessorImpl.invoke(DelegatingMethodAccessorImpl.java:43)
26-Nov-2015 22:32:56         at java.lang.reflect.Method.invoke(Method.java:622)
26-Nov-2015 22:32:56         at org.springframework.aop.support.AopUtils.invokeJoinpointUsingReflection(AopUtils.java:309)
26-Nov-2015 22:32:56         at org.springframework.aop.framework.ReflectiveMethodInvocation.invokeJoinpoint(ReflectiveMethodInvocation.java:183)
26-Nov-2015 22:32:56         at org.springframework.aop.framework.ReflectiveMethodInvocation.proceed(ReflectiveMethodInvocation.java:150)
26-Nov-2015 22:32:56         at org.springframework.transaction.interceptor.TransactionInterceptor.invoke(TransactionInterceptor.java:110)
26-Nov-2015 22:32:56         at org.springframework.aop.framework.ReflectiveMethodInvocation.proceed(ReflectiveMethodInvocation.java:172)
26-Nov-2015 22:32:56         at org.springframework.aop.framework.JdkDynamicAopProxy.invoke(JdkDynamicAopProxy.java:202)
26-Nov-2015 22:32:56         at com.sun.proxy.$Proxy31.saveEncounter(Unknown Source)
26-Nov-2015 22:32:56         at org.openmrs.hl7.handler.ORUR01Handler.processORU_R01(ORUR01Handler.java:351)
26-Nov-2015 22:32:56         at org.openmrs.hl7.handler.ORUR01Handler.processMessage(ORUR01Handler.java:144)
26-Nov-2015 22:32:56         at ca.uhn.hl7v2.app.MessageTypeRouter.processMessage(MessageTypeRouter.java:54)
26-Nov-2015 22:32:56         at org.openmrs.hl7.handler.ORUR01HandlerTest.parseObs_shouldAddCommentsToAnObservationGroup(ORUR01HandlerTest.java:938)
26-Nov-2015 22:32:56         at sun.reflect.NativeMethodAccessorImpl.invoke0(Native Method)
26-Nov-2015 22:32:56         at sun.reflect.NativeMethodAccessorImpl.invoke(NativeMethodAccessorImpl.java:57)
26-Nov-2015 22:32:56         at sun.reflect.DelegatingMethodAccessorImpl.invoke(DelegatingMethodAccessorImpl.java:43)
26-Nov-2015 22:32:56         at java.lang.reflect.Method.invoke(Method.java:622)
26-Nov-2015 22:32:56         at org.junit.runners.model.FrameworkMethod$1.runReflectiveCall(FrameworkMethod.java:47)
26-Nov-2015 22:32:56         at org.junit.internal.runners.model.ReflectiveCallable.run(ReflectiveCallable.java:12)
26-Nov-2015 22:32:56         at org.junit.runners.model.FrameworkMethod.invokeExplosively(FrameworkMethod.java:44)
26-Nov-2015 22:32:56         at org.junit.internal.runners.statements.InvokeMethod.evaluate(InvokeMethod.java:17)
26-Nov-2015 22:32:56         at org.junit.internal.runners.statements.RunBefores.evaluate(RunBefores.java:26)
26-Nov-2015 22:32:56         at org.springframework.test.context.junit4.statements.RunBeforeTestMethodCallbacks.evaluate(RunBeforeTestMethodCallbacks.java:74)
26-Nov-2015 22:32:56         at org.junit.internal.runners.statements.RunAfters.evaluate(RunAfters.java:27)
26-Nov-2015 22:32:56         at org.springframework.test.context.junit4.statements.RunAfterTestMethodCallbacks.evaluate(RunAfterTestMethodCallbacks.java:82)
26-Nov-2015 22:32:56         at org.springframework.test.context.junit4.statements.SpringRepeat.evaluate(SpringRepeat.java:72)
26-Nov-2015 22:32:56         at org.springframework.test.context.junit4.SpringJUnit4ClassRunner.runChild(SpringJUnit4ClassRunner.java:240)
26-Nov-2015 22:32:56         at org.junit.runners.BlockJUnit4ClassRunner.runChild(BlockJUnit4ClassRunner.java:50)
26-Nov-2015 22:32:56         at org.junit.runners.ParentRunner$3.run(ParentRunner.java:238)
26-Nov-2015 22:32:56         at org.junit.runners.ParentRunner$1.schedule(ParentRunner.java:63)
26-Nov-2015 22:32:56         at org.junit.runners.ParentRunner.runChildren(ParentRunner.java:236)
26-Nov-2015 22:32:56         at org.junit.runners.ParentRunner.access$000(ParentRunner.java:53)
26-Nov-2015 22:32:56         at org.junit.runners.ParentRunner$2.evaluate(ParentRunner.java:229)
26-Nov-2015 22:32:56         at org.springframework.test.context.junit4.statements.RunBeforeTestClassCallbacks.evaluate(RunBeforeTestClassCallbacks.java:61)
26-Nov-2015 22:32:56         at org.junit.internal.runners.statements.RunAfters.evaluate(RunAfters.java:27)
26-Nov-2015 22:32:56         at org.springframework.test.context.junit4.statements.RunAfterTestClassCallbacks.evaluate(RunAfterTestClassCallbacks.java:70)
26-Nov-2015 22:32:56         at org.junit.runners.ParentRunner.run(ParentRunner.java:309)
26-Nov-2015 22:32:56         at org.springframework.test.context.junit4.SpringJUnit4ClassRunner.run(SpringJUnit4ClassRunner.java:180)
26-Nov-2015 22:32:56         at org.apache.maven.surefire.junit4.JUnit4TestSet.execute(JUnit4TestSet.java:59)
26-Nov-2015 22:32:56         at org.apache.maven.surefire.suite.AbstractDirectoryTestSuite.executeTestSet(AbstractDirectoryTestSuite.java:115)
26-Nov-2015 22:32:56         at org.apache.maven.surefire.suite.AbstractDirectoryTestSuite.execute(AbstractDirectoryTestSuite.java:102)
26-Nov-2015 22:32:56         at org.apache.maven.surefire.Surefire.run(Surefire.java:180)
26-Nov-2015 22:32:56         at sun.reflect.NativeMethodAccessorImpl.invoke0(Native Method)
26-Nov-2015 22:32:56         at sun.reflect.NativeMethodAccessorImpl.invoke(NativeMethodAccessorImpl.java:57)
26-Nov-2015 22:32:56         at sun.reflect.DelegatingMethodAccessorImpl.invoke(DelegatingMethodAccessorImpl.java:43)
26-Nov-2015 22:32:56         at java.lang.reflect.Method.invoke(Method.java:622)
26-Nov-2015 22:32:56         at org.apache.maven.surefire.booter.SurefireBooter.runSuitesInProcess(SurefireBooter.java:350)
26-Nov-2015 22:32:56         at org.apache.maven.surefire.booter.SurefireBooter.main(SurefireBooter.java:1021)
26-Nov-2015 22:32:56 Tests run: 29, Failures: 0, Errors: 0, Skipped: 0, Time elapsed: 3.525 sec
26-Nov-2015 22:32:56 Running org.openmrs.report.RowPerProgramEnrollmentDatasetTest
26-Nov-2015 22:32:56 Tests run: 1, Failures: 0, Errors: 0, Skipped: 0, Time elapsed: 0.137 sec
26-Nov-2015 22:32:56
26-Nov-2015 22:32:56 Results :
26-Nov-2015 22:32:56
26-Nov-2015 22:32:56 Tests run: 1578, Failures: 0, Errors: 0, Skipped: 20
26-Nov-2015 22:32:56
26-Nov-2015 22:32:56 [INFO]
26-Nov-2015 22:32:56 [INFO] --- maven-jar-plugin:2.4:jar (default-jar) @ openmrs-api ---
26-Nov-2015 22:32:57 [INFO] Building jar: /home/bamboo-agent-2/bamboo-agent/xml-data/build-dir/TRUNK-ONEPRIOR-JOB1/api/target/openmrs-api-1.8.5-SNAPSHOT.jar
26-Nov-2015 22:32:58 [INFO]
26-Nov-2015 22:32:58 [INFO] --- maven-jar-plugin:2.4:test-jar (default) @ openmrs-api ---
26-Nov-2015 22:32:58 [INFO] Building jar: /home/bamboo-agent-2/bamboo-agent/xml-data/build-dir/TRUNK-ONEPRIOR-JOB1/api/target/openmrs-api-1.8.5-SNAPSHOT-tests.jar
26-Nov-2015 22:32:58 [INFO]
26-Nov-2015 22:32:58 [INFO] --- maven-install-plugin:2.4:install (default-install) @ openmrs-api ---
26-Nov-2015 22:32:58 [INFO] Installing /home/bamboo-agent-2/bamboo-agent/xml-data/build-dir/TRUNK-ONEPRIOR-JOB1/api/target/openmrs-api-1.8.5-SNAPSHOT.jar to /home/bamboo-agent-2/.m2/repository/org/openmrs/api/openmrs-api/1.8.5-SNAPSHOT/openmrs-api-1.8.5-SNAPSHOT.jar
26-Nov-2015 22:32:58 [INFO] Installing /home/bamboo-agent-2/bamboo-agent/xml-data/build-dir/TRUNK-ONEPRIOR-JOB1/api/pom.xml to /home/bamboo-agent-2/.m2/repository/org/openmrs/api/openmrs-api/1.8.5-SNAPSHOT/openmrs-api-1.8.5-SNAPSHOT.pom
26-Nov-2015 22:32:58 [INFO] Installing /home/bamboo-agent-2/bamboo-agent/xml-data/build-dir/TRUNK-ONEPRIOR-JOB1/api/target/openmrs-api-1.8.5-SNAPSHOT-tests.jar to /home/bamboo-agent-2/.m2/repository/org/openmrs/api/openmrs-api/1.8.5-SNAPSHOT/openmrs-api-1.8.5-SNAPSHOT-tests.jar
26-Nov-2015 22:32:58 [INFO]
26-Nov-2015 22:32:58 [INFO] --- maven-deploy-plugin:2.7:deploy (default-deploy) @ openmrs-api ---
26-Nov-2015 22:32:58 [INFO] Downloading: http://mavenrepo.openmrs.org/nexus/content/repositories/snapshots/org/openmrs/api/openmrs-api/1.8.5-SNAPSHOT/maven-metadata.xml
26-Nov-2015 22:32:58 [INFO] Downloaded: http://mavenrepo.openmrs.org/nexus/content/repositories/snapshots/org/openmrs/api/openmrs-api/1.8.5-SNAPSHOT/maven-metadata.xml (992 B at 8.4 KB/sec)
26-Nov-2015 22:32:58 [INFO] Uploading: http://mavenrepo.openmrs.org/nexus/content/repositories/snapshots/org/openmrs/api/openmrs-api/1.8.5-SNAPSHOT/openmrs-api-1.8.5-20151126.223258-96.jar
26-Nov-2015 22:32:58 [INFO] Uploaded: http://mavenrepo.openmrs.org/nexus/content/repositories/snapshots/org/openmrs/api/openmrs-api/1.8.5-SNAPSHOT/openmrs-api-1.8.5-20151126.223258-96.jar (1502 KB at 7322.4 KB/sec)
26-Nov-2015 22:32:58 [INFO] Uploading: http://mavenrepo.openmrs.org/nexus/content/repositories/snapshots/org/openmrs/api/openmrs-api/1.8.5-SNAPSHOT/openmrs-api-1.8.5-20151126.223258-96.pom
26-Nov-2015 22:32:59 [INFO] Uploaded: http://mavenrepo.openmrs.org/nexus/content/repositories/snapshots/org/openmrs/api/openmrs-api/1.8.5-SNAPSHOT/openmrs-api-1.8.5-20151126.223258-96.pom (9 KB at 106.1 KB/sec)
26-Nov-2015 22:32:59 [INFO] Downloading: http://mavenrepo.openmrs.org/nexus/content/repositories/snapshots/org/openmrs/api/openmrs-api/maven-metadata.xml
26-Nov-2015 22:32:59 [INFO] Downloaded: http://mavenrepo.openmrs.org/nexus/content/repositories/snapshots/org/openmrs/api/openmrs-api/maven-metadata.xml (651 B at 19.9 KB/sec)
26-Nov-2015 22:32:59 [INFO] Uploading: http://mavenrepo.openmrs.org/nexus/content/repositories/snapshots/org/openmrs/api/openmrs-api/1.8.5-SNAPSHOT/maven-metadata.xml
26-Nov-2015 22:32:59 [INFO] Uploaded: http://mavenrepo.openmrs.org/nexus/content/repositories/snapshots/org/openmrs/api/openmrs-api/1.8.5-SNAPSHOT/maven-metadata.xml (992 B at 12.7 KB/sec)
26-Nov-2015 22:32:59 [INFO] Uploading: http://mavenrepo.openmrs.org/nexus/content/repositories/snapshots/org/openmrs/api/openmrs-api/maven-metadata.xml
26-Nov-2015 22:32:59 [INFO] Uploaded: http://mavenrepo.openmrs.org/nexus/content/repositories/snapshots/org/openmrs/api/openmrs-api/maven-metadata.xml (651 B at 9.9 KB/sec)
26-Nov-2015 22:32:59 [INFO] Uploading: http://mavenrepo.openmrs.org/nexus/content/repositories/snapshots/org/openmrs/api/openmrs-api/1.8.5-SNAPSHOT/openmrs-api-1.8.5-20151126.223258-96-tests.jar
26-Nov-2015 22:32:59 [INFO] Uploaded: http://mavenrepo.openmrs.org/nexus/content/repositories/snapshots/org/openmrs/api/openmrs-api/1.8.5-SNAPSHOT/openmrs-api-1.8.5-20151126.223258-96-tests.jar (1824 KB at 12660.7 KB/sec)
26-Nov-2015 22:32:59 [INFO] Uploading: http://mavenrepo.openmrs.org/nexus/content/repositories/snapshots/org/openmrs/api/openmrs-api/1.8.5-SNAPSHOT/maven-metadata.xml
26-Nov-2015 22:32:59 [INFO] Uploaded: http://mavenrepo.openmrs.org/nexus/content/repositories/snapshots/org/openmrs/api/openmrs-api/1.8.5-SNAPSHOT/maven-metadata.xml (992 B at 16.1 KB/sec)
26-Nov-2015 22:32:59 [INFO]                                                                         
26-Nov-2015 22:32:59 [INFO] ------------------------------------------------------------------------
26-Nov-2015 22:32:59 [INFO] Building openmrs-web 1.8.5-SNAPSHOT
26-Nov-2015 22:32:59 [INFO] ------------------------------------------------------------------------
26-Nov-2015 22:32:59 [INFO] Downloading: http://mavenrepo.openmrs.org/nexus/content/repositories/public/org/openmrs/api/openmrs-api/1.8.5-SNAPSHOT/maven-metadata.xml
26-Nov-2015 22:32:59 [INFO] Downloaded: http://mavenrepo.openmrs.org/nexus/content/repositories/public/org/openmrs/api/openmrs-api/1.8.5-SNAPSHOT/maven-metadata.xml (992 B at 23.6 KB/sec)
26-Nov-2015 22:32:59 [INFO]
26-Nov-2015 22:32:59 [INFO] --- maven-clean-plugin:2.5:clean (default-clean) @ openmrs-web ---
26-Nov-2015 22:32:59 [INFO]
26-Nov-2015 22:32:59 [INFO] --- buildnumber-maven-plugin:1.1:create (default) @ openmrs-web ---
26-Nov-2015 22:32:59 [INFO]
26-Nov-2015 22:32:59 [INFO] --- build-helper-maven-plugin:1.5:parse-version (parse-version) @ openmrs-web ---
26-Nov-2015 22:32:59 [INFO]
26-Nov-2015 22:32:59 [INFO] --- maven-java-formatter-plugin:0.2.0:format (default) @ openmrs-web ---
26-Nov-2015 22:32:59 [INFO] Number of files to be formatted: 326
26-Nov-2015 22:33:00 [INFO] Successfully formatted: 0 file(s)
26-Nov-2015 22:33:00 [INFO] Fail to format        : 0 file(s)
26-Nov-2015 22:33:00 [INFO] Skipped               : 326 file(s)
26-Nov-2015 22:33:00 [INFO] Approximate time taken: 0s
26-Nov-2015 22:33:00 [INFO]
26-Nov-2015 22:33:00 [INFO] --- maven-resources-plugin:2.6:resources (default-resources) @ openmrs-web ---
26-Nov-2015 22:33:00 [INFO] Using 'UTF-8' encoding to copy filtered resources.
26-Nov-2015 22:33:00 [INFO] Copying 18 resources
26-Nov-2015 22:33:00 [INFO]
26-Nov-2015 22:33:00 [INFO] --- maven-compiler-plugin:3.1:compile (default-compile) @ openmrs-web ---
26-Nov-2015 22:33:00 [INFO] Changes detected - recompiling the module!
26-Nov-2015 22:33:00 [INFO] Compiling 284 source files to /home/bamboo-agent-2/bamboo-agent/xml-data/build-dir/TRUNK-ONEPRIOR-JOB1/web/target/classes
26-Nov-2015 22:33:01 [WARNING] /home/bamboo-agent-2/bamboo-agent/xml-data/build-dir/TRUNK-ONEPRIOR-JOB1/web/src/main/java/org/openmrs/web/controller/program/StateConversionFormController.java: Some input files use or override a deprecated API.
26-Nov-2015 22:33:01 [WARNING] /home/bamboo-agent-2/bamboo-agent/xml-data/build-dir/TRUNK-ONEPRIOR-JOB1/web/src/main/java/org/openmrs/web/controller/program/StateConversionFormController.java: Recompile with -Xlint:deprecation for details.
26-Nov-2015 22:33:01 [WARNING] /home/bamboo-agent-2/bamboo-agent/xml-data/build-dir/TRUNK-ONEPRIOR-JOB1/web/src/main/java/org/openmrs/web/filter/StartupFilter.java: Some input files use unchecked or unsafe operations.
26-Nov-2015 22:33:01 [WARNING] /home/bamboo-agent-2/bamboo-agent/xml-data/build-dir/TRUNK-ONEPRIOR-JOB1/web/src/main/java/org/openmrs/web/filter/StartupFilter.java: Recompile with -Xlint:unchecked for details.
26-Nov-2015 22:33:01 [INFO]
26-Nov-2015 22:33:01 [INFO] --- maven-resources-plugin:2.6:testResources (default-testResources) @ openmrs-web ---
26-Nov-2015 22:33:01 [INFO] Using 'UTF-8' encoding to copy filtered resources.
26-Nov-2015 22:33:01 [INFO] Copying 14 resources
26-Nov-2015 22:33:01 [INFO]
26-Nov-2015 22:33:01 [INFO] --- maven-compiler-plugin:3.1:testCompile (default-testCompile) @ openmrs-web ---
26-Nov-2015 22:33:01 [INFO] Changes detected - recompiling the module!
26-Nov-2015 22:33:01 [INFO] Compiling 42 source files to /home/bamboo-agent-2/bamboo-agent/xml-data/build-dir/TRUNK-ONEPRIOR-JOB1/web/target/test-classes
26-Nov-2015 22:33:02 [WARNING] /home/bamboo-agent-2/bamboo-agent/xml-data/build-dir/TRUNK-ONEPRIOR-JOB1/web/src/test/java/org/openmrs/web/controller/encounter/EncounterTypeListControllerTest.java: Some input files use or override a deprecated API.
26-Nov-2015 22:33:02 [WARNING] /home/bamboo-agent-2/bamboo-agent/xml-data/build-dir/TRUNK-ONEPRIOR-JOB1/web/src/test/java/org/openmrs/web/controller/encounter/EncounterTypeListControllerTest.java: Recompile with -Xlint:deprecation for details.
26-Nov-2015 22:33:02 [WARNING] /home/bamboo-agent-2/bamboo-agent/xml-data/build-dir/TRUNK-ONEPRIOR-JOB1/web/src/test/java/org/openmrs/web/controller/PortletControllerTest.java: /home/bamboo-agent-2/bamboo-agent/xml-data/build-dir/TRUNK-ONEPRIOR-JOB1/web/src/test/java/org/openmrs/web/controller/PortletControllerTest.java uses unchecked or unsafe operations.
26-Nov-2015 22:33:02 [WARNING] /home/bamboo-agent-2/bamboo-agent/xml-data/build-dir/TRUNK-ONEPRIOR-JOB1/web/src/test/java/org/openmrs/web/controller/PortletControllerTest.java: Recompile with -Xlint:unchecked for details.
26-Nov-2015 22:33:02 [INFO]
26-Nov-2015 22:33:02 [INFO] --- maven-surefire-plugin:2.5:test (default-test) @ openmrs-web ---
26-Nov-2015 22:33:02 [INFO] Surefire report directory: /home/bamboo-agent-2/bamboo-agent/xml-data/build-dir/TRUNK-ONEPRIOR-JOB1/web/target/surefire-reports
26-Nov-2015 22:33:02
26-Nov-2015 22:33:02 -------------------------------------------------------
26-Nov-2015 22:33:02 T E S T S
26-Nov-2015 22:33:02 -------------------------------------------------------
26-Nov-2015 22:33:02 Running org.openmrs.web.controller.encounter.LocationFormControllerTest
26-Nov-2015 22:33:21 Tests run: 3, Failures: 0, Errors: 0, Skipped: 0, Time elapsed: 18.796 sec
26-Nov-2015 22:33:21 Running org.openmrs.web.controller.user.RoleFormControllerTest
26-Nov-2015 22:33:21 Tests run: 1, Failures: 0, Errors: 0, Skipped: 0, Time elapsed: 0.56 sec
26-Nov-2015 22:33:21 Running org.openmrs.web.dwr.DWRConceptServiceTest
26-Nov-2015 22:33:23 Tests run: 2, Failures: 0, Errors: 0, Skipped: 0, Time elapsed: 1.631 sec
26-Nov-2015 22:33:23 Running org.openmrs.web.controller.concept.ConceptSourceListControllerTest
26-Nov-2015 22:33:23 Tests run: 1, Failures: 0, Errors: 0, Skipped: 0, Time elapsed: 0.398 sec
26-Nov-2015 22:33:23 Running org.openmrs.web.controller.patient.ShortPatientFormControllerTest
26-Nov-2015 22:33:28 Tests run: 12, Failures: 0, Errors: 0, Skipped: 0, Time elapsed: 4.377 sec
26-Nov-2015 22:33:28 Running org.openmrs.web.controller.UserPropertiesTest
26-Nov-2015 22:33:28 Tests run: 6, Failures: 0, Errors: 0, Skipped: 0, Time elapsed: 0.012 sec
26-Nov-2015 22:33:28 Running org.openmrs.web.controller.OptionsFormControllerTest
26-Nov-2015 22:33:28 ERROR - MutableResourceBundleMessageSource.findPropertiesFiles(323) |2015-11-26 22:33:28,355| Error generated
26-Nov-2015 22:33:28 java.io.FileNotFoundException: class path resource [WEB-INF/] cannot be resolved to URL because it does not exist
26-Nov-2015 22:33:28         at org.springframework.core.io.ClassPathResource.getURL(ClassPathResource.java:179)
26-Nov-2015 22:33:28         at org.springframework.core.io.AbstractFileResolvingResource.getFile(AbstractFileResolvingResource.java:48)
26-Nov-2015 22:33:28         at org.openmrs.messagesource.impl.MutableResourceBundleMessageSource.findPropertiesFiles(MutableResourceBundleMessageSource.java:311)
26-Nov-2015 22:33:28         at org.openmrs.messagesource.impl.MutableResourceBundleMessageSource.findLocales(MutableResourceBundleMessageSource.java:93)
26-Nov-2015 22:33:28         at org.openmrs.messagesource.impl.MutableResourceBundleMessageSource.getLocales(MutableResourceBundleMessageSource.java:70)
26-Nov-2015 22:33:28         at sun.reflect.NativeMethodAccessorImpl.invoke0(Native Method)
26-Nov-2015 22:33:28         at sun.reflect.NativeMethodAccessorImpl.invoke(NativeMethodAccessorImpl.java:57)
26-Nov-2015 22:33:28         at sun.reflect.DelegatingMethodAccessorImpl.invoke(DelegatingMethodAccessorImpl.java:43)
26-Nov-2015 22:33:28         at java.lang.reflect.Method.invoke(Method.java:622)
26-Nov-2015 22:33:28         at org.springframework.aop.support.AopUtils.invokeJoinpointUsingReflection(AopUtils.java:309)
26-Nov-2015 22:33:28         at org.springframework.aop.framework.ReflectiveMethodInvocation.invokeJoinpoint(ReflectiveMethodInvocation.java:183)
26-Nov-2015 22:33:28         at org.springframework.aop.framework.ReflectiveMethodInvocation.proceed(ReflectiveMethodInvocation.java:150)
26-Nov-2015 22:33:28         at org.springframework.transaction.interceptor.TransactionInterceptor.invoke(TransactionInterceptor.java:110)
26-Nov-2015 22:33:28         at org.springframework.aop.framework.ReflectiveMethodInvocation.proceed(ReflectiveMethodInvocation.java:172)
26-Nov-2015 22:33:28         at org.springframework.aop.framework.JdkDynamicAopProxy.invoke(JdkDynamicAopProxy.java:202)
26-Nov-2015 22:33:28         at com.sun.proxy.$Proxy21.getLocales(Unknown Source)
26-Nov-2015 22:33:28         at org.openmrs.messagesource.impl.MessageSourceServiceImpl.getLocales(MessageSourceServiceImpl.java:84)
26-Nov-2015 22:33:28         at sun.reflect.NativeMethodAccessorImpl.invoke0(Native Method)
26-Nov-2015 22:33:28         at sun.reflect.NativeMethodAccessorImpl.invoke(NativeMethodAccessorImpl.java:57)
26-Nov-2015 22:33:28         at sun.reflect.DelegatingMethodAccessorImpl.invoke(DelegatingMethodAccessorImpl.java:43)
26-Nov-2015 22:33:28         at java.lang.reflect.Method.invoke(Method.java:622)
26-Nov-2015 22:33:28         at org.springframework.aop.support.AopUtils.invokeJoinpointUsingReflection(AopUtils.java:309)
26-Nov-2015 22:33:28         at org.springframework.aop.framework.ReflectiveMethodInvocation.invokeJoinpoint(ReflectiveMethodInvocation.java:183)
26-Nov-2015 22:33:28         at org.springframework.aop.framework.ReflectiveMethodInvocation.proceed(ReflectiveMethodInvocation.java:150)
26-Nov-2015 22:33:28         at org.springframework.transaction.interceptor.TransactionInterceptor.invoke(TransactionInterceptor.java:110)
26-Nov-2015 22:33:28         at org.springframework.aop.framework.ReflectiveMethodInvocation.proceed(ReflectiveMethodInvocation.java:172)
26-Nov-2015 22:33:28         at org.openmrs.aop.LoggingAdvice.invoke(LoggingAdvice.java:114)
26-Nov-2015 22:33:28         at org.springframework.aop.framework.ReflectiveMethodInvocation.proceed(ReflectiveMethodInvocation.java:172)
26-Nov-2015 22:33:28         at org.springframework.aop.framework.adapter.MethodBeforeAdviceInterceptor.invoke(MethodBeforeAdviceInterceptor.java:50)
26-Nov-2015 22:33:28         at org.springframework.aop.framework.ReflectiveMethodInvocation.proceed(ReflectiveMethodInvocation.java:172)
26-Nov-2015 22:33:28         at org.springframework.aop.framework.adapter.MethodBeforeAdviceInterceptor.invoke(MethodBeforeAdviceInterceptor.java:50)
26-Nov-2015 22:33:28         at org.springframework.aop.framework.ReflectiveMethodInvocation.proceed(ReflectiveMethodInvocation.java:172)
26-Nov-2015 22:33:28         at org.springframework.aop.framework.JdkDynamicAopProxy.invoke(JdkDynamicAopProxy.java:202)
26-Nov-2015 22:33:28         at com.sun.proxy.$Proxy20.getLocales(Unknown Source)
26-Nov-2015 22:33:28         at sun.reflect.NativeMethodAccessorImpl.invoke0(Native Method)
26-Nov-2015 22:33:28         at sun.reflect.NativeMethodAccessorImpl.invoke(NativeMethodAccessorImpl.java:57)
26-Nov-2015 22:33:28         at sun.reflect.DelegatingMethodAccessorImpl.invoke(DelegatingMethodAccessorImpl.java:43)
26-Nov-2015 22:33:28         at java.lang.reflect.Method.invoke(Method.java:622)
26-Nov-2015 22:33:28         at org.springframework.aop.support.AopUtils.invokeJoinpointUsingReflection(AopUtils.java:309)
26-Nov-2015 22:33:28         at org.springframework.aop.framework.ReflectiveMethodInvocation.invokeJoinpoint(ReflectiveMethodInvocation.java:183)
26-Nov-2015 22:33:28         at org.springframework.aop.framework.ReflectiveMethodInvocation.proceed(ReflectiveMethodInvocation.java:150)
26-Nov-2015 22:33:28         at org.springframework.transaction.interceptor.TransactionInterceptor.invoke(TransactionInterceptor.java:110)
26-Nov-2015 22:33:28         at org.springframework.aop.framework.ReflectiveMethodInvocation.proceed(ReflectiveMethodInvocation.java:172)
26-Nov-2015 22:33:28         at org.springframework.aop.framework.JdkDynamicAopProxy.invoke(JdkDynamicAopProxy.java:202)
26-Nov-2015 22:33:28         at com.sun.proxy.$Proxy66.getLocales(Unknown Source)
26-Nov-2015 22:33:28         at org.openmrs.api.impl.AdministrationServiceImpl.getPresentationLocales(AdministrationServiceImpl.java:1003)
26-Nov-2015 22:33:28         at sun.reflect.NativeMethodAccessorImpl.invoke0(Native Method)
26-Nov-2015 22:33:28         at sun.reflect.NativeMethodAccessorImpl.invoke(NativeMethodAccessorImpl.java:57)
26-Nov-2015 22:33:28         at sun.reflect.DelegatingMethodAccessorImpl.invoke(DelegatingMethodAccessorImpl.java:43)
26-Nov-2015 22:33:28         at java.lang.reflect.Method.invoke(Method.java:622)
26-Nov-2015 22:33:28         at org.springframework.aop.support.AopUtils.invokeJoinpointUsingReflection(AopUtils.java:309)
26-Nov-2015 22:33:28         at org.springframework.aop.framework.ReflectiveMethodInvocation.invokeJoinpoint(ReflectiveMethodInvocation.java:183)
26-Nov-2015 22:33:28         at org.springframework.aop.framework.ReflectiveMethodInvocation.proceed(ReflectiveMethodInvocation.java:150)
26-Nov-2015 22:33:28         at org.springframework.transaction.interceptor.TransactionInterceptor.invoke(TransactionInterceptor.java:110)
26-Nov-2015 22:33:28         at org.springframework.aop.framework.ReflectiveMethodInvocation.proceed(ReflectiveMethodInvocation.java:172)
26-Nov-2015 22:33:28         at org.springframework.aop.framework.JdkDynamicAopProxy.invoke(JdkDynamicAopProxy.java:202)
26-Nov-2015 22:33:28         at com.sun.proxy.$Proxy23.getPresentationLocales(Unknown Source)
26-Nov-2015 22:33:28         at sun.reflect.NativeMethodAccessorImpl.invoke0(Native Method)
26-Nov-2015 22:33:28         at sun.reflect.NativeMethodAccessorImpl.invoke(NativeMethodAccessorImpl.java:57)
26-Nov-2015 22:33:28         at sun.reflect.DelegatingMethodAccessorImpl.invoke(DelegatingMethodAccessorImpl.java:43)
26-Nov-2015 22:33:28         at java.lang.reflect.Method.invoke(Method.java:622)
26-Nov-2015 22:33:28         at org.springframework.aop.support.AopUtils.invokeJoinpointUsingReflection(AopUtils.java:309)
26-Nov-2015 22:33:28         at org.springframework.aop.framework.ReflectiveMethodInvocation.invokeJoinpoint(ReflectiveMethodInvocation.java:183)
26-Nov-2015 22:33:28         at org.springframework.aop.framework.ReflectiveMethodInvocation.proceed(ReflectiveMethodInvocation.java:150)
26-Nov-2015 22:33:28         at org.springframework.transaction.interceptor.TransactionInterceptor.invoke(TransactionInterceptor.java:110)
26-Nov-2015 22:33:28         at org.springframework.aop.framework.ReflectiveMethodInvocation.proceed(ReflectiveMethodInvocation.java:172)
26-Nov-2015 22:33:28         at org.openmrs.aop.LoggingAdvice.invoke(LoggingAdvice.java:114)
26-Nov-2015 22:33:28         at org.springframework.aop.framework.ReflectiveMethodInvocation.proceed(ReflectiveMethodInvocation.java:172)
26-Nov-2015 22:33:28         at org.springframework.aop.framework.adapter.MethodBeforeAdviceInterceptor.invoke(MethodBeforeAdviceInterceptor.java:50)
26-Nov-2015 22:33:28         at org.springframework.aop.framework.ReflectiveMethodInvocation.proceed(ReflectiveMethodInvocation.java:172)
26-Nov-2015 22:33:28         at org.springframework.aop.framework.adapter.MethodBeforeAdviceInterceptor.invoke(MethodBeforeAdviceInterceptor.java:50)
26-Nov-2015 22:33:28         at org.springframework.aop.framework.ReflectiveMethodInvocation.proceed(ReflectiveMethodInvocation.java:172)
26-Nov-2015 22:33:28         at org.springframework.aop.framework.JdkDynamicAopProxy.invoke(JdkDynamicAopProxy.java:202)
26-Nov-2015 22:33:28         at com.sun.proxy.$Proxy41.getPresentationLocales(Unknown Source)
26-Nov-2015 22:33:28         at sun.reflect.NativeMethodAccessorImpl.invoke0(Native Method)
26-Nov-2015 22:33:28         at sun.reflect.NativeMethodAccessorImpl.invoke(NativeMethodAccessorImpl.java:57)
26-Nov-2015 22:33:28         at sun.reflect.DelegatingMethodAccessorImpl.invoke(DelegatingMethodAccessorImpl.java:43)
26-Nov-2015 22:33:28         at java.lang.reflect.Method.invoke(Method.java:622)
26-Nov-2015 22:33:28         at org.springframework.aop.support.AopUtils.invokeJoinpointUsingReflection(AopUtils.java:309)
26-Nov-2015 22:33:28         at org.springframework.aop.framework.ReflectiveMethodInvocation.invokeJoinpoint(ReflectiveMethodInvocation.java:183)
26-Nov-2015 22:33:28         at org.springframework.aop.framework.ReflectiveMethodInvocation.proceed(ReflectiveMethodInvocation.java:150)
26-Nov-2015 22:33:28         at org.springframework.transaction.interceptor.TransactionInterceptor.invoke(TransactionInterceptor.java:110)
26-Nov-2015 22:33:28         at org.springframework.aop.framework.ReflectiveMethodInvocation.proceed(ReflectiveMethodInvocation.java:172)
26-Nov-2015 22:33:28         at org.springframework.aop.framework.JdkDynamicAopProxy.invoke(JdkDynamicAopProxy.java:202)
26-Nov-2015 22:33:28         at com.sun.proxy.$Proxy41.getPresentationLocales(Unknown Source)
26-Nov-2015 22:33:28         at org.openmrs.web.controller.OptionsFormController.referenceData(OptionsFormController.java:306)
26-Nov-2015 22:33:28         at org.springframework.web.servlet.mvc.SimpleFormController.referenceData(SimpleFormController.java:218)
26-Nov-2015 22:33:28         at org.springframework.web.servlet.mvc.AbstractFormController.showForm(AbstractFormController.java:578)
26-Nov-2015 22:33:28         at org.springframework.web.servlet.mvc.SimpleFormController.showForm(SimpleFormController.java:201)
26-Nov-2015 22:33:28         at org.springframework.web.servlet.mvc.SimpleFormController.showForm(SimpleFormController.java:178)
26-Nov-2015 22:33:28         at org.springframework.web.servlet.mvc.SimpleFormController.processFormSubmission(SimpleFormController.java:263)
26-Nov-2015 22:33:28         at org.openmrs.web.controller.OptionsFormController.processFormSubmission(OptionsFormController.java:98)
26-Nov-2015 22:33:28         at org.springframework.web.servlet.mvc.AbstractFormController.handleRequestInternal(AbstractFormController.java:268)
26-Nov-2015 22:33:28         at org.springframework.web.servlet.mvc.AbstractController.handleRequest(AbstractController.java:153)
26-Nov-2015 22:33:28         at org.openmrs.web.controller.OptionsFormControllerTest.shouldRejectEmptySecretAnswer(OptionsFormControllerTest.java:62)
26-Nov-2015 22:33:28         at sun.reflect.NativeMethodAccessorImpl.invoke0(Native Method)
26-Nov-2015 22:33:28         at sun.reflect.NativeMethodAccessorImpl.invoke(NativeMethodAccessorImpl.java:57)
26-Nov-2015 22:33:28         at sun.reflect.DelegatingMethodAccessorImpl.invoke(DelegatingMethodAccessorImpl.java:43)
26-Nov-2015 22:33:28         at java.lang.reflect.Method.invoke(Method.java:622)
26-Nov-2015 22:33:28         at org.junit.runners.model.FrameworkMethod$1.runReflectiveCall(FrameworkMethod.java:47)
26-Nov-2015 22:33:28         at org.junit.internal.runners.model.ReflectiveCallable.run(ReflectiveCallable.java:12)
26-Nov-2015 22:33:28         at org.junit.runners.model.FrameworkMethod.invokeExplosively(FrameworkMethod.java:44)
26-Nov-2015 22:33:28         at org.junit.internal.runners.statements.InvokeMethod.evaluate(InvokeMethod.java:17)
26-Nov-2015 22:33:28         at org.junit.internal.runners.statements.RunBefores.evaluate(RunBefores.java:26)
26-Nov-2015 22:33:28         at org.springframework.test.context.junit4.statements.RunBeforeTestMethodCallbacks.evaluate(RunBeforeTestMethodCallbacks.java:74)
26-Nov-2015 22:33:28         at org.junit.internal.runners.statements.RunAfters.evaluate(RunAfters.java:27)
26-Nov-2015 22:33:28         at org.springframework.test.context.junit4.statements.RunAfterTestMethodCallbacks.evaluate(RunAfterTestMethodCallbacks.java:82)
26-Nov-2015 22:33:28         at org.springframework.test.context.junit4.statements.SpringRepeat.evaluate(SpringRepeat.java:72)
26-Nov-2015 22:33:28         at org.springframework.test.context.junit4.SpringJUnit4ClassRunner.runChild(SpringJUnit4ClassRunner.java:240)
26-Nov-2015 22:33:28         at org.junit.runners.BlockJUnit4ClassRunner.runChild(BlockJUnit4ClassRunner.java:50)
26-Nov-2015 22:33:28         at org.junit.runners.ParentRunner$3.run(ParentRunner.java:238)
26-Nov-2015 22:33:28         at org.junit.runners.ParentRunner$1.schedule(ParentRunner.java:63)
26-Nov-2015 22:33:28         at org.junit.runners.ParentRunner.runChildren(ParentRunner.java:236)
26-Nov-2015 22:33:28         at org.junit.runners.ParentRunner.access$000(ParentRunner.java:53)
26-Nov-2015 22:33:28         at org.junit.runners.ParentRunner$2.evaluate(ParentRunner.java:229)
26-Nov-2015 22:33:28         at org.springframework.test.context.junit4.statements.RunBeforeTestClassCallbacks.evaluate(RunBeforeTestClassCallbacks.java:61)
26-Nov-2015 22:33:28         at org.junit.internal.runners.statements.RunAfters.evaluate(RunAfters.java:27)
26-Nov-2015 22:33:28         at org.springframework.test.context.junit4.statements.RunAfterTestClassCallbacks.evaluate(RunAfterTestClassCallbacks.java:70)
26-Nov-2015 22:33:28         at org.junit.runners.ParentRunner.run(ParentRunner.java:309)
26-Nov-2015 22:33:28         at org.springframework.test.context.junit4.SpringJUnit4ClassRunner.run(SpringJUnit4ClassRunner.java:180)
26-Nov-2015 22:33:28         at org.apache.maven.surefire.junit4.JUnit4TestSet.execute(JUnit4TestSet.java:59)
26-Nov-2015 22:33:28         at org.apache.maven.surefire.suite.AbstractDirectoryTestSuite.executeTestSet(AbstractDirectoryTestSuite.java:115)
26-Nov-2015 22:33:28         at org.apache.maven.surefire.suite.AbstractDirectoryTestSuite.execute(AbstractDirectoryTestSuite.java:102)
26-Nov-2015 22:33:28         at org.apache.maven.surefire.Surefire.run(Surefire.java:180)
26-Nov-2015 22:33:28         at sun.reflect.NativeMethodAccessorImpl.invoke0(Native Method)
26-Nov-2015 22:33:28         at sun.reflect.NativeMethodAccessorImpl.invoke(NativeMethodAccessorImpl.java:57)
26-Nov-2015 22:33:28         at sun.reflect.DelegatingMethodAccessorImpl.invoke(DelegatingMethodAccessorImpl.java:43)
26-Nov-2015 22:33:28         at java.lang.reflect.Method.invoke(Method.java:622)
26-Nov-2015 22:33:28         at org.apache.maven.surefire.booter.SurefireBooter.runSuitesInProcess(SurefireBooter.java:350)
26-Nov-2015 22:33:28         at org.apache.maven.surefire.booter.SurefireBooter.main(SurefireBooter.java:1021)
26-Nov-2015 22:33:28 Tests run: 3, Failures: 0, Errors: 0, Skipped: 0, Time elapsed: 0.586 sec
26-Nov-2015 22:33:28 Running org.openmrs.web.dwr.PersonListItemTest
26-Nov-2015 22:33:29 Tests run: 3, Failures: 0, Errors: 0, Skipped: 0, Time elapsed: 0.371 sec
26-Nov-2015 22:33:29 Running org.openmrs.web.taglib.RequireTagTest
26-Nov-2015 22:33:29 Tests run: 6, Failures: 0, Errors: 0, Skipped: 0, Time elapsed: 0.332 sec
26-Nov-2015 22:33:29 Running org.openmrs.web.controller.encounter.EncounterTypeFormControllerTest
26-Nov-2015 22:33:29 Tests run: 2, Failures: 0, Errors: 0, Skipped: 0, Time elapsed: 0.306 sec
26-Nov-2015 22:33:29 Running org.openmrs.web.filter.update.UpdateFilterTest
26-Nov-2015 22:33:30 Tests run: 5, Failures: 0, Errors: 0, Skipped: 0, Time elapsed: 0.62 sec
26-Nov-2015 22:33:30 Running org.openmrs.web.controller.person.PersonAttributeTypeListControllerTest
26-Nov-2015 22:33:31 Tests run: 9, Failures: 0, Errors: 0, Skipped: 0, Time elapsed: 1.194 sec
26-Nov-2015 22:33:31 Running org.openmrs.web.taglib.PortletTagTest
26-Nov-2015 22:33:33 Tests run: 7, Failures: 0, Errors: 0, Skipped: 0, Time elapsed: 2.208 sec
26-Nov-2015 22:33:33 Running org.openmrs.web.encounter.EncounterDisplayControllerTest
26-Nov-2015 22:33:34 Tests run: 2, Failures: 0, Errors: 0, Skipped: 0, Time elapsed: 0.278 sec
26-Nov-2015 22:33:34 Running org.openmrs.web.obs.ObsFormControllerTest
26-Nov-2015 22:33:34 Tests run: 2, Failures: 0, Errors: 0, Skipped: 0, Time elapsed: 0.258 sec
26-Nov-2015 22:33:34 Running org.openmrs.web.controller.person.AddPersonControllerTest
26-Nov-2015 22:33:34 Tests run: 2, Failures: 0, Errors: 0, Skipped: 0, Time elapsed: 0.338 sec
26-Nov-2015 22:33:34 Running org.openmrs.web.controller.form.FieldFormControllerTest
26-Nov-2015 22:33:35 Tests run: 2, Failures: 0, Errors: 0, Skipped: 0, Time elapsed: 0.373 sec
26-Nov-2015 22:33:35 Running org.openmrs.web.controller.form.FieldTypeListControllerTest
26-Nov-2015 22:33:35 ERROR - JDBCExceptionReporter.logExceptions(78) |2015-11-26 22:33:35,222| Referential integrity constraint violation: "FK5CEA0FA808FB57F: PUBLIC.FIELD FOREIGN KEY(FIELD_TYPE) REFERENCES PUBLIC.FIELD_TYPE(FIELD_TYPE_ID)"; SQL statement:
26-Nov-2015 22:33:35 delete from field_type where field_type_id=? [23003-135]
26-Nov-2015 22:33:35 ERROR - JDBCExceptionReporter.logExceptions(78) |2015-11-26 22:33:35,225| Referential integrity constraint violation: "FK5CEA0FA808FB57F: PUBLIC.FIELD FOREIGN KEY(FIELD_TYPE) REFERENCES PUBLIC.FIELD_TYPE(FIELD_TYPE_ID)"; SQL statement:
26-Nov-2015 22:33:35 delete from field_type where field_type_id=? [23003-135]
26-Nov-2015 22:33:35 ERROR - AbstractFlushingEventListener.performExecutions(301) |2015-11-26 22:33:35,226| Could not synchronize database state with session
26-Nov-2015 22:33:35 org.hibernate.exception.ConstraintViolationException: Could not execute JDBC batch update
26-Nov-2015 22:33:35         at org.hibernate.exception.SQLStateConverter.convert(SQLStateConverter.java:71)
26-Nov-2015 22:33:35         at org.hibernate.exception.JDBCExceptionHelper.convert(JDBCExceptionHelper.java:43)
26-Nov-2015 22:33:35         at org.hibernate.jdbc.AbstractBatcher.executeBatch(AbstractBatcher.java:253)
26-Nov-2015 22:33:35         at org.hibernate.engine.ActionQueue.executeActions(ActionQueue.java:237)
26-Nov-2015 22:33:35         at org.hibernate.engine.ActionQueue.executeActions(ActionQueue.java:146)
26-Nov-2015 22:33:35         at org.hibernate.event.def.AbstractFlushingEventListener.performExecutions(AbstractFlushingEventListener.java:298)
26-Nov-2015 22:33:35         at org.hibernate.event.def.DefaultFlushEventListener.onFlush(DefaultFlushEventListener.java:27)
26-Nov-2015 22:33:35         at org.hibernate.impl.SessionImpl.flush(SessionImpl.java:1000)
26-Nov-2015 22:33:35         at org.hibernate.impl.SessionImpl.managedFlush(SessionImpl.java:338)
26-Nov-2015 22:33:35         at org.hibernate.transaction.JDBCTransaction.commit(JDBCTransaction.java:106)
26-Nov-2015 22:33:35         at org.springframework.orm.hibernate3.HibernateTransactionManager.doCommit(HibernateTransactionManager.java:656)
26-Nov-2015 22:33:35         at org.springframework.transaction.support.AbstractPlatformTransactionManager.processCommit(AbstractPlatformTransactionManager.java:754)
26-Nov-2015 22:33:35         at org.springframework.transaction.support.AbstractPlatformTransactionManager.commit(AbstractPlatformTransactionManager.java:723)
26-Nov-2015 22:33:35         at org.springframework.transaction.interceptor.TransactionAspectSupport.commitTransactionAfterReturning(TransactionAspectSupport.java:393)
26-Nov-2015 22:33:35         at org.springframework.transaction.interceptor.TransactionInterceptor.invoke(TransactionInterceptor.java:120)
26-Nov-2015 22:33:35         at org.springframework.aop.framework.ReflectiveMethodInvocation.proceed(ReflectiveMethodInvocation.java:172)
26-Nov-2015 22:33:35         at org.springframework.aop.framework.JdkDynamicAopProxy.invoke(JdkDynamicAopProxy.java:202)
26-Nov-2015 22:33:35         at com.sun.proxy.$Proxy40.purgeFieldType(Unknown Source)
26-Nov-2015 22:33:35         at org.openmrs.web.controller.form.FieldTypeListController.onSubmit(FieldTypeListController.java:75)
26-Nov-2015 22:33:35         at org.springframework.web.servlet.mvc.SimpleFormController.processFormSubmission(SimpleFormController.java:272)
26-Nov-2015 22:33:35         at org.springframework.web.servlet.mvc.AbstractFormController.handleRequestInternal(AbstractFormController.java:268)
26-Nov-2015 22:33:35         at org.springframework.web.servlet.mvc.AbstractController.handleRequest(AbstractController.java:153)
26-Nov-2015 22:33:35         at org.springframework.web.servlet.mvc.SimpleControllerHandlerAdapter.handle(SimpleControllerHandlerAdapter.java:48)
26-Nov-2015 22:33:35         at org.openmrs.web.test.WebTestHelper.handle(WebTestHelper.java:130)
26-Nov-2015 22:33:35         at org.openmrs.web.controller.form.FieldTypeListControllerTest.onSubmit_shouldDisplayAUserFriendlyErrorMessage(FieldTypeListControllerTest.java:48)
26-Nov-2015 22:33:35         at sun.reflect.NativeMethodAccessorImpl.invoke0(Native Method)
26-Nov-2015 22:33:35         at sun.reflect.NativeMethodAccessorImpl.invoke(NativeMethodAccessorImpl.java:57)
26-Nov-2015 22:33:35         at sun.reflect.DelegatingMethodAccessorImpl.invoke(DelegatingMethodAccessorImpl.java:43)
26-Nov-2015 22:33:35         at java.lang.reflect.Method.invoke(Method.java:622)
26-Nov-2015 22:33:35         at org.junit.runners.model.FrameworkMethod$1.runReflectiveCall(FrameworkMethod.java:47)
26-Nov-2015 22:33:35         at org.junit.internal.runners.model.ReflectiveCallable.run(ReflectiveCallable.java:12)
26-Nov-2015 22:33:35         at org.junit.runners.model.FrameworkMethod.invokeExplosively(FrameworkMethod.java:44)
26-Nov-2015 22:33:35         at org.junit.internal.runners.statements.InvokeMethod.evaluate(InvokeMethod.java:17)
26-Nov-2015 22:33:35         at org.junit.internal.runners.statements.RunBefores.evaluate(RunBefores.java:26)
26-Nov-2015 22:33:35         at org.springframework.test.context.junit4.statements.RunBeforeTestMethodCallbacks.evaluate(RunBeforeTestMethodCallbacks.java:74)
26-Nov-2015 22:33:35         at org.junit.internal.runners.statements.RunAfters.evaluate(RunAfters.java:27)
26-Nov-2015 22:33:35         at org.springframework.test.context.junit4.statements.RunAfterTestMethodCallbacks.evaluate(RunAfterTestMethodCallbacks.java:82)
26-Nov-2015 22:33:35         at org.springframework.test.context.junit4.statements.SpringRepeat.evaluate(SpringRepeat.java:72)
26-Nov-2015 22:33:35         at org.springframework.test.context.junit4.SpringJUnit4ClassRunner.runChild(SpringJUnit4ClassRunner.java:240)
26-Nov-2015 22:33:35         at org.junit.runners.BlockJUnit4ClassRunner.runChild(BlockJUnit4ClassRunner.java:50)
26-Nov-2015 22:33:35         at org.junit.runners.ParentRunner$3.run(ParentRunner.java:238)
26-Nov-2015 22:33:35         at org.junit.runners.ParentRunner$1.schedule(ParentRunner.java:63)
26-Nov-2015 22:33:35         at org.junit.runners.ParentRunner.runChildren(ParentRunner.java:236)
26-Nov-2015 22:33:35         at org.junit.runners.ParentRunner.access$000(ParentRunner.java:53)
26-Nov-2015 22:33:35         at org.junit.runners.ParentRunner$2.evaluate(ParentRunner.java:229)
26-Nov-2015 22:33:35         at org.springframework.test.context.junit4.statements.RunBeforeTestClassCallbacks.evaluate(RunBeforeTestClassCallbacks.java:61)
26-Nov-2015 22:33:35         at org.junit.internal.runners.statements.RunAfters.evaluate(RunAfters.java:27)
26-Nov-2015 22:33:35         at org.springframework.test.context.junit4.statements.RunAfterTestClassCallbacks.evaluate(RunAfterTestClassCallbacks.java:70)
26-Nov-2015 22:33:35         at org.junit.runners.ParentRunner.run(ParentRunner.java:309)
26-Nov-2015 22:33:35         at org.springframework.test.context.junit4.SpringJUnit4ClassRunner.run(SpringJUnit4ClassRunner.java:180)
26-Nov-2015 22:33:35         at org.apache.maven.surefire.junit4.JUnit4TestSet.execute(JUnit4TestSet.java:59)
26-Nov-2015 22:33:35         at org.apache.maven.surefire.suite.AbstractDirectoryTestSuite.executeTestSet(AbstractDirectoryTestSuite.java:115)
26-Nov-2015 22:33:35         at org.apache.maven.surefire.suite.AbstractDirectoryTestSuite.execute(AbstractDirectoryTestSuite.java:102)
26-Nov-2015 22:33:35         at org.apache.maven.surefire.Surefire.run(Surefire.java:180)
26-Nov-2015 22:33:35         at sun.reflect.NativeMethodAccessorImpl.invoke0(Native Method)
26-Nov-2015 22:33:35         at sun.reflect.NativeMethodAccessorImpl.invoke(NativeMethodAccessorImpl.java:57)
26-Nov-2015 22:33:35         at sun.reflect.DelegatingMethodAccessorImpl.invoke(DelegatingMethodAccessorImpl.java:43)
26-Nov-2015 22:33:35         at java.lang.reflect.Method.invoke(Method.java:622)
26-Nov-2015 22:33:35         at org.apache.maven.surefire.booter.SurefireBooter.runSuitesInProcess(SurefireBooter.java:350)
26-Nov-2015 22:33:35         at org.apache.maven.surefire.booter.SurefireBooter.main(SurefireBooter.java:1021)
26-Nov-2015 22:33:35 Caused by: org.h2.jdbc.JdbcBatchUpdateException: Referential integrity constraint violation: "FK5CEA0FA808FB57F: PUBLIC.FIELD FOREIGN KEY(FIELD_TYPE) REFERENCES PUBLIC.FIELD_TYPE(FIELD_TYPE_ID)"; SQL statement:
26-Nov-2015 22:33:35 delete from field_type where field_type_id=? [23003-135]
26-Nov-2015 22:33:35         at org.h2.jdbc.JdbcPreparedStatement.executeBatch(JdbcPreparedStatement.java:1098)
26-Nov-2015 22:33:35         at com.mchange.v2.c3p0.impl.NewProxyPreparedStatement.executeBatch(NewProxyPreparedStatement.java:1723)
26-Nov-2015 22:33:35         at org.hibernate.jdbc.BatchingBatcher.doExecuteBatch(BatchingBatcher.java:48)
26-Nov-2015 22:33:35         at org.hibernate.jdbc.AbstractBatcher.executeBatch(AbstractBatcher.java:246)
26-Nov-2015 22:33:35         ... 57 more
26-Nov-2015 22:33:35 ERROR - FieldTypeListController.onSubmit(87) |2015-11-26 22:33:35,238| Unable to delete a field type because it is in use. fieldTypeId: 1
26-Nov-2015 22:33:35 org.springframework.dao.DataIntegrityViolationException: Could not execute JDBC batch update; SQL [delete from field_type where field_type_id=?]; constraint ["FK5CEA0FA808FB57F: PUBLIC.FIELD FOREIGN KEY(FIELD_TYPE) REFERENCES PUBLIC.FIELD_TYPE(FIELD_TYPE_ID)"; SQL statement:
26-Nov-2015 22:33:35 delete from field_type where field_type_id=? [23003-135]]; nested exception is org.hibernate.exception.ConstraintViolationException: Could not execute JDBC batch update
26-Nov-2015 22:33:35         at org.springframework.orm.hibernate3.SessionFactoryUtils.convertHibernateAccessException(SessionFactoryUtils.java:637)
26-Nov-2015 22:33:35         at org.springframework.orm.hibernate3.HibernateTransactionManager.convertHibernateAccessException(HibernateTransactionManager.java:793)
26-Nov-2015 22:33:35         at org.springframework.orm.hibernate3.HibernateTransactionManager.doCommit(HibernateTransactionManager.java:664)
26-Nov-2015 22:33:35         at org.springframework.transaction.support.AbstractPlatformTransactionManager.processCommit(AbstractPlatformTransactionManager.java:754)
26-Nov-2015 22:33:35         at org.springframework.transaction.support.AbstractPlatformTransactionManager.commit(AbstractPlatformTransactionManager.java:723)
26-Nov-2015 22:33:35         at org.springframework.transaction.interceptor.TransactionAspectSupport.commitTransactionAfterReturning(TransactionAspectSupport.java:393)
26-Nov-2015 22:33:35         at org.springframework.transaction.interceptor.TransactionInterceptor.invoke(TransactionInterceptor.java:120)
26-Nov-2015 22:33:35         at org.springframework.aop.framework.ReflectiveMethodInvocation.proceed(ReflectiveMethodInvocation.java:172)
26-Nov-2015 22:33:35         at org.springframework.aop.framework.JdkDynamicAopProxy.invoke(JdkDynamicAopProxy.java:202)
26-Nov-2015 22:33:35         at com.sun.proxy.$Proxy40.purgeFieldType(Unknown Source)
26-Nov-2015 22:33:35         at org.openmrs.web.controller.form.FieldTypeListController.onSubmit(FieldTypeListController.java:75)
26-Nov-2015 22:33:35         at org.springframework.web.servlet.mvc.SimpleFormController.processFormSubmission(SimpleFormController.java:272)
26-Nov-2015 22:33:35         at org.springframework.web.servlet.mvc.AbstractFormController.handleRequestInternal(AbstractFormController.java:268)
26-Nov-2015 22:33:35         at org.springframework.web.servlet.mvc.AbstractController.handleRequest(AbstractController.java:153)
26-Nov-2015 22:33:35         at org.springframework.web.servlet.mvc.SimpleControllerHandlerAdapter.handle(SimpleControllerHandlerAdapter.java:48)
26-Nov-2015 22:33:35         at org.openmrs.web.test.WebTestHelper.handle(WebTestHelper.java:130)
26-Nov-2015 22:33:35         at org.openmrs.web.controller.form.FieldTypeListControllerTest.onSubmit_shouldDisplayAUserFriendlyErrorMessage(FieldTypeListControllerTest.java:48)
26-Nov-2015 22:33:35         at sun.reflect.NativeMethodAccessorImpl.invoke0(Native Method)
26-Nov-2015 22:33:35         at sun.reflect.NativeMethodAccessorImpl.invoke(NativeMethodAccessorImpl.java:57)
26-Nov-2015 22:33:35         at sun.reflect.DelegatingMethodAccessorImpl.invoke(DelegatingMethodAccessorImpl.java:43)
26-Nov-2015 22:33:35         at java.lang.reflect.Method.invoke(Method.java:622)
26-Nov-2015 22:33:35         at org.junit.runners.model.FrameworkMethod$1.runReflectiveCall(FrameworkMethod.java:47)
26-Nov-2015 22:33:35         at org.junit.internal.runners.model.ReflectiveCallable.run(ReflectiveCallable.java:12)
26-Nov-2015 22:33:35         at org.junit.runners.model.FrameworkMethod.invokeExplosively(FrameworkMethod.java:44)
26-Nov-2015 22:33:35         at org.junit.internal.runners.statements.InvokeMethod.evaluate(InvokeMethod.java:17)
26-Nov-2015 22:33:35         at org.junit.internal.runners.statements.RunBefores.evaluate(RunBefores.java:26)
26-Nov-2015 22:33:35         at org.springframework.test.context.junit4.statements.RunBeforeTestMethodCallbacks.evaluate(RunBeforeTestMethodCallbacks.java:74)
26-Nov-2015 22:33:35         at org.junit.internal.runners.statements.RunAfters.evaluate(RunAfters.java:27)
26-Nov-2015 22:33:35         at org.springframework.test.context.junit4.statements.RunAfterTestMethodCallbacks.evaluate(RunAfterTestMethodCallbacks.java:82)
26-Nov-2015 22:33:35         at org.springframework.test.context.junit4.statements.SpringRepeat.evaluate(SpringRepeat.java:72)
26-Nov-2015 22:33:35         at org.springframework.test.context.junit4.SpringJUnit4ClassRunner.runChild(SpringJUnit4ClassRunner.java:240)
26-Nov-2015 22:33:35         at org.junit.runners.BlockJUnit4ClassRunner.runChild(BlockJUnit4ClassRunner.java:50)
26-Nov-2015 22:33:35         at org.junit.runners.ParentRunner$3.run(ParentRunner.java:238)
26-Nov-2015 22:33:35         at org.junit.runners.ParentRunner$1.schedule(ParentRunner.java:63)
26-Nov-2015 22:33:35         at org.junit.runners.ParentRunner.runChildren(ParentRunner.java:236)
26-Nov-2015 22:33:35         at org.junit.runners.ParentRunner.access$000(ParentRunner.java:53)
26-Nov-2015 22:33:35         at org.junit.runners.ParentRunner$2.evaluate(ParentRunner.java:229)
26-Nov-2015 22:33:35         at org.springframework.test.context.junit4.statements.RunBeforeTestClassCallbacks.evaluate(RunBeforeTestClassCallbacks.java:61)
26-Nov-2015 22:33:35         at org.junit.internal.runners.statements.RunAfters.evaluate(RunAfters.java:27)
26-Nov-2015 22:33:35         at org.springframework.test.context.junit4.statements.RunAfterTestClassCallbacks.evaluate(RunAfterTestClassCallbacks.java:70)
26-Nov-2015 22:33:35         at org.junit.runners.ParentRunner.run(ParentRunner.java:309)
26-Nov-2015 22:33:35         at org.springframework.test.context.junit4.SpringJUnit4ClassRunner.run(SpringJUnit4ClassRunner.java:180)
26-Nov-2015 22:33:35         at org.apache.maven.surefire.junit4.JUnit4TestSet.execute(JUnit4TestSet.java:59)
26-Nov-2015 22:33:35         at org.apache.maven.surefire.suite.AbstractDirectoryTestSuite.executeTestSet(AbstractDirectoryTestSuite.java:115)
26-Nov-2015 22:33:35         at org.apache.maven.surefire.suite.AbstractDirectoryTestSuite.execute(AbstractDirectoryTestSuite.java:102)
26-Nov-2015 22:33:35         at org.apache.maven.surefire.Surefire.run(Surefire.java:180)
26-Nov-2015 22:33:35         at sun.reflect.NativeMethodAccessorImpl.invoke0(Native Method)
26-Nov-2015 22:33:35         at sun.reflect.NativeMethodAccessorImpl.invoke(NativeMethodAccessorImpl.java:57)
26-Nov-2015 22:33:35         at sun.reflect.DelegatingMethodAccessorImpl.invoke(DelegatingMethodAccessorImpl.java:43)
26-Nov-2015 22:33:35         at java.lang.reflect.Method.invoke(Method.java:622)
26-Nov-2015 22:33:35         at org.apache.maven.surefire.booter.SurefireBooter.runSuitesInProcess(SurefireBooter.java:350)
26-Nov-2015 22:33:35         at org.apache.maven.surefire.booter.SurefireBooter.main(SurefireBooter.java:1021)
26-Nov-2015 22:33:35 Caused by: org.hibernate.exception.ConstraintViolationException: Could not execute JDBC batch update
26-Nov-2015 22:33:35         at org.hibernate.exception.SQLStateConverter.convert(SQLStateConverter.java:71)
26-Nov-2015 22:33:35         at org.hibernate.exception.JDBCExceptionHelper.convert(JDBCExceptionHelper.java:43)
26-Nov-2015 22:33:35         at org.hibernate.jdbc.AbstractBatcher.executeBatch(AbstractBatcher.java:253)
26-Nov-2015 22:33:35         at org.hibernate.engine.ActionQueue.executeActions(ActionQueue.java:237)
26-Nov-2015 22:33:35         at org.hibernate.engine.ActionQueue.executeActions(ActionQueue.java:146)
26-Nov-2015 22:33:35         at org.hibernate.event.def.AbstractFlushingEventListener.performExecutions(AbstractFlushingEventListener.java:298)
26-Nov-2015 22:33:35         at org.hibernate.event.def.DefaultFlushEventListener.onFlush(DefaultFlushEventListener.java:27)
26-Nov-2015 22:33:35         at org.hibernate.impl.SessionImpl.flush(SessionImpl.java:1000)
26-Nov-2015 22:33:35         at org.hibernate.impl.SessionImpl.managedFlush(SessionImpl.java:338)
26-Nov-2015 22:33:35         at org.hibernate.transaction.JDBCTransaction.commit(JDBCTransaction.java:106)
26-Nov-2015 22:33:35         at org.springframework.orm.hibernate3.HibernateTransactionManager.doCommit(HibernateTransactionManager.java:656)
26-Nov-2015 22:33:35         ... 49 more
26-Nov-2015 22:33:35 Caused by: org.h2.jdbc.JdbcBatchUpdateException: Referential integrity constraint violation: "FK5CEA0FA808FB57F: PUBLIC.FIELD FOREIGN KEY(FIELD_TYPE) REFERENCES PUBLIC.FIELD_TYPE(FIELD_TYPE_ID)"; SQL statement:
26-Nov-2015 22:33:35 delete from field_type where field_type_id=? [23003-135]
26-Nov-2015 22:33:35         at org.h2.jdbc.JdbcPreparedStatement.executeBatch(JdbcPreparedStatement.java:1098)
26-Nov-2015 22:33:35         at com.mchange.v2.c3p0.impl.NewProxyPreparedStatement.executeBatch(NewProxyPreparedStatement.java:1723)
26-Nov-2015 22:33:35         at org.hibernate.jdbc.BatchingBatcher.doExecuteBatch(BatchingBatcher.java:48)
26-Nov-2015 22:33:35         at org.hibernate.jdbc.AbstractBatcher.executeBatch(AbstractBatcher.java:246)
26-Nov-2015 22:33:35         ... 57 more
26-Nov-2015 22:33:35 Tests run: 1, Failures: 0, Errors: 0, Skipped: 0, Time elapsed: 0.231 sec
26-Nov-2015 22:33:35 Running org.openmrs.web.controller.maintenance.GlobalPropertyControllerTest
26-Nov-2015 22:33:35 Tests run: 2, Failures: 0, Errors: 0, Skipped: 0, Time elapsed: 0.387 sec
26-Nov-2015 22:33:35 Running org.openmrs.web.controller.PortletControllerTest
26-Nov-2015 22:33:36 Tests run: 2, Failures: 0, Errors: 0, Skipped: 0, Time elapsed: 0.465 sec
26-Nov-2015 22:33:36 Running org.openmrs.web.controller.program.ProgramFormControllerTest
26-Nov-2015 22:33:36 Tests run: 1, Failures: 0, Errors: 0, Skipped: 0, Time elapsed: 0.13 sec
26-Nov-2015 22:33:36 Running org.openmrs.web.order.OrderTest
26-Nov-2015 22:33:36 Tests run: 1, Failures: 0, Errors: 0, Skipped: 0, Time elapsed: 0.151 sec
26-Nov-2015 22:33:36 Running org.openmrs.web.servlet.ShowGraphServletTest
26-Nov-2015 22:33:38 Tests run: 7, Failures: 0, Errors: 0, Skipped: 0, Time elapsed: 2.166 sec
26-Nov-2015 22:33:38 Running org.openmrs.web.controller.GlobalPropertyPortletControllerTest
26-Nov-2015 22:33:39 Tests run: 4, Failures: 0, Errors: 0, Skipped: 0, Time elapsed: 0.429 sec
26-Nov-2015 22:33:39 Running org.openmrs.web.controller.encounter.EncounterTypeListControllerTest
26-Nov-2015 22:33:39 Tests run: 1, Failures: 0, Errors: 0, Skipped: 0, Time elapsed: 0.117 sec
26-Nov-2015 22:33:39 Running org.openmrs.web.controller.ConceptFormControllerTest
26-Nov-2015 22:33:42 Tests run: 20, Failures: 0, Errors: 0, Skipped: 0, Time elapsed: 3.323 sec
26-Nov-2015 22:33:42 Running org.openmrs.web.taglib.ForEachEncounterTagTest
26-Nov-2015 22:33:42 Tests run: 2, Failures: 0, Errors: 0, Skipped: 0, Time elapsed: 0.348 sec
26-Nov-2015 22:33:42 Running org.openmrs.web.dwr.DWRPatientServiceTest
26-Nov-2015 22:33:43 Tests run: 6, Failures: 0, Errors: 0, Skipped: 2, Time elapsed: 0.562 sec
26-Nov-2015 22:33:43 Running org.openmrs.web.servlet.LoginServletTest
26-Nov-2015 22:33:43 Tests run: 3, Failures: 0, Errors: 0, Skipped: 0, Time elapsed: 0.368 sec
26-Nov-2015 22:33:43 Running org.openmrs.web.dwr.ConceptListItemTest
26-Nov-2015 22:33:43 Tests run: 4, Failures: 0, Errors: 0, Skipped: 0, Time elapsed: 0.005 sec
26-Nov-2015 22:33:43 Running org.openmrs.web.ForgotPasswordFormControllerTest
26-Nov-2015 22:33:44 WARN - HibernateUserDAO.getUserByUsername(107) |2015-11-26 22:33:44,082| request for username 'invaliduser' not found
26-Nov-2015 22:33:44 WARN - HibernateUserDAO.getUserByUsername(107) |2015-11-26 22:33:44,084| request for username 'invaliduser' not found
26-Nov-2015 22:33:44 WARN - HibernateUserDAO.getUserByUsername(107) |2015-11-26 22:33:44,087| request for username 'invaliduser' not found
26-Nov-2015 22:33:44 WARN - HibernateUserDAO.getUserByUsername(107) |2015-11-26 22:33:44,089| request for username 'invaliduser' not found
26-Nov-2015 22:33:44 WARN - HibernateUserDAO.getUserByUsername(107) |2015-11-26 22:33:44,209| request for username 'invaliduser' not found
26-Nov-2015 22:33:44 WARN - HibernateUserDAO.getUserByUsername(107) |2015-11-26 22:33:44,210| request for username 'invaliduser' not found
26-Nov-2015 22:33:44 WARN - HibernateUserDAO.getUserByUsername(107) |2015-11-26 22:33:44,212| request for username 'invaliduser' not found
26-Nov-2015 22:33:44 WARN - HibernateUserDAO.getUserByUsername(107) |2015-11-26 22:33:44,213| request for username 'invaliduser' not found
26-Nov-2015 22:33:44 WARN - HibernateUserDAO.getUserByUsername(107) |2015-11-26 22:33:44,214| request for username 'invaliduser' not found
26-Nov-2015 22:33:44 WARN - HibernateUserDAO.getUserByUsername(107) |2015-11-26 22:33:44,429| request for username 'invaliduser' not found
26-Nov-2015 22:33:44 WARN - HibernateUserDAO.getUserByUsername(107) |2015-11-26 22:33:44,431| request for username 'invaliduser' not found
26-Nov-2015 22:33:44 WARN - HibernateUserDAO.getUserByUsername(107) |2015-11-26 22:33:44,432| request for username 'invaliduser' not found
26-Nov-2015 22:33:44 WARN - HibernateUserDAO.getUserByUsername(107) |2015-11-26 22:33:44,434| request for username 'invaliduser' not found
26-Nov-2015 22:33:44 WARN - HibernateUserDAO.getUserByUsername(107) |2015-11-26 22:33:44,435| request for username 'invaliduser' not found
26-Nov-2015 22:33:44 Tests run: 8, Failures: 0, Errors: 0, Skipped: 0, Time elapsed: 0.931 sec
26-Nov-2015 22:33:44 Running org.openmrs.web.dwr.DWRPersonServiceTest
26-Nov-2015 22:33:44 Tests run: 2, Failures: 0, Errors: 0, Skipped: 0, Time elapsed: 0.224 sec
26-Nov-2015 22:33:44 Running org.openmrs.web.patient.PatientDashboardGraphControllerTest
26-Nov-2015 22:33:45 Tests run: 2, Failures: 0, Errors: 0, Skipped: 0, Time elapsed: 0.306 sec
26-Nov-2015 22:33:45 Running org.openmrs.web.taglib.OpenmrsMessageTagTest
26-Nov-2015 22:33:46 Tests run: 8, Failures: 0, Errors: 0, Skipped: 0, Time elapsed: 0.879 sec
26-Nov-2015 22:33:46 Running org.openmrs.web.controller.concept.ConceptProposalFormControllerTest
26-Nov-2015 22:33:46 Tests run: 1, Failures: 0, Errors: 0, Skipped: 0, Time elapsed: 0.17 sec
26-Nov-2015 22:33:46 Running org.openmrs.web.controller.user.UserFormControllerTest
26-Nov-2015 22:33:46 Tests run: 1, Failures: 0, Errors: 0, Skipped: 0, Time elapsed: 0.13 sec
26-Nov-2015 22:33:46 Running org.openmrs.web.controller.user.ChangePasswordFormControllerTest
26-Nov-2015 22:33:47 Tests run: 13, Failures: 0, Errors: 0, Skipped: 0, Time elapsed: 1.566 sec
26-Nov-2015 22:33:47 Running org.openmrs.web.controller.patient.ShortPatientFormValidatorTest
26-Nov-2015 22:33:49 Tests run: 14, Failures: 0, Errors: 0, Skipped: 0, Time elapsed: 1.588 sec
26-Nov-2015 22:33:49 Running org.openmrs.web.controller.user.UserListControllerTest
26-Nov-2015 22:33:49 Tests run: 4, Failures: 0, Errors: 0, Skipped: 0, Time elapsed: 0.45 sec
26-Nov-2015 22:33:49
26-Nov-2015 22:33:49 Results :
26-Nov-2015 22:33:49
26-Nov-2015 22:33:49 Tests run: 175, Failures: 0, Errors: 0, Skipped: 2
26-Nov-2015 22:33:49
26-Nov-2015 22:33:50 [INFO]
26-Nov-2015 22:33:50 [INFO] --- maven-jar-plugin:2.4:jar (default-jar) @ openmrs-web ---
26-Nov-2015 22:33:50 [INFO] Building jar: /home/bamboo-agent-2/bamboo-agent/xml-data/build-dir/TRUNK-ONEPRIOR-JOB1/web/target/openmrs-web-1.8.5-SNAPSHOT.jar
26-Nov-2015 22:33:50 [INFO]
26-Nov-2015 22:33:50 [INFO] --- maven-jar-plugin:2.4:test-jar (default) @ openmrs-web ---
26-Nov-2015 22:33:50 [INFO] Building jar: /home/bamboo-agent-2/bamboo-agent/xml-data/build-dir/TRUNK-ONEPRIOR-JOB1/web/target/openmrs-web-1.8.5-SNAPSHOT-tests.jar
26-Nov-2015 22:33:50 [INFO]
26-Nov-2015 22:33:50 [INFO] --- maven-install-plugin:2.4:install (default-install) @ openmrs-web ---
26-Nov-2015 22:33:50 [INFO] Installing /home/bamboo-agent-2/bamboo-agent/xml-data/build-dir/TRUNK-ONEPRIOR-JOB1/web/target/openmrs-web-1.8.5-SNAPSHOT.jar to /home/bamboo-agent-2/.m2/repository/org/openmrs/web/openmrs-web/1.8.5-SNAPSHOT/openmrs-web-1.8.5-SNAPSHOT.jar
26-Nov-2015 22:33:50 [INFO] Installing /home/bamboo-agent-2/bamboo-agent/xml-data/build-dir/TRUNK-ONEPRIOR-JOB1/web/pom.xml to /home/bamboo-agent-2/.m2/repository/org/openmrs/web/openmrs-web/1.8.5-SNAPSHOT/openmrs-web-1.8.5-SNAPSHOT.pom
26-Nov-2015 22:33:50 [INFO] Installing /home/bamboo-agent-2/bamboo-agent/xml-data/build-dir/TRUNK-ONEPRIOR-JOB1/web/target/openmrs-web-1.8.5-SNAPSHOT-tests.jar to /home/bamboo-agent-2/.m2/repository/org/openmrs/web/openmrs-web/1.8.5-SNAPSHOT/openmrs-web-1.8.5-SNAPSHOT-tests.jar
26-Nov-2015 22:33:50 [INFO]
26-Nov-2015 22:33:50 [INFO] --- maven-deploy-plugin:2.7:deploy (default-deploy) @ openmrs-web ---
26-Nov-2015 22:33:50 [INFO] Downloading: http://mavenrepo.openmrs.org/nexus/content/repositories/snapshots/org/openmrs/web/openmrs-web/1.8.5-SNAPSHOT/maven-metadata.xml
26-Nov-2015 22:33:50 [INFO] Downloaded: http://mavenrepo.openmrs.org/nexus/content/repositories/snapshots/org/openmrs/web/openmrs-web/1.8.5-SNAPSHOT/maven-metadata.xml (992 B at 26.9 KB/sec)
26-Nov-2015 22:33:50 [INFO] Uploading: http://mavenrepo.openmrs.org/nexus/content/repositories/snapshots/org/openmrs/web/openmrs-web/1.8.5-SNAPSHOT/openmrs-web-1.8.5-20151126.223350-95.jar
26-Nov-2015 22:33:51 [INFO] Uploaded: http://mavenrepo.openmrs.org/nexus/content/repositories/snapshots/org/openmrs/web/openmrs-web/1.8.5-SNAPSHOT/openmrs-web-1.8.5-20151126.223350-95.jar (710 KB at 5414.3 KB/sec)
26-Nov-2015 22:33:51 [INFO] Uploading: http://mavenrepo.openmrs.org/nexus/content/repositories/snapshots/org/openmrs/web/openmrs-web/1.8.5-SNAPSHOT/openmrs-web-1.8.5-20151126.223350-95.pom
26-Nov-2015 22:33:51 [INFO] Uploaded: http://mavenrepo.openmrs.org/nexus/content/repositories/snapshots/org/openmrs/web/openmrs-web/1.8.5-SNAPSHOT/openmrs-web-1.8.5-20151126.223350-95.pom (6 KB at 100.0 KB/sec)
26-Nov-2015 22:33:51 [INFO] Downloading: http://mavenrepo.openmrs.org/nexus/content/repositories/snapshots/org/openmrs/web/openmrs-web/maven-metadata.xml
26-Nov-2015 22:33:51 [INFO] Downloaded: http://mavenrepo.openmrs.org/nexus/content/repositories/snapshots/org/openmrs/web/openmrs-web/maven-metadata.xml (651 B at 25.4 KB/sec)
26-Nov-2015 22:33:51 [INFO] Uploading: http://mavenrepo.openmrs.org/nexus/content/repositories/snapshots/org/openmrs/web/openmrs-web/1.8.5-SNAPSHOT/maven-metadata.xml
26-Nov-2015 22:33:51 [INFO] Uploaded: http://mavenrepo.openmrs.org/nexus/content/repositories/snapshots/org/openmrs/web/openmrs-web/1.8.5-SNAPSHOT/maven-metadata.xml (992 B at 15.9 KB/sec)
26-Nov-2015 22:33:51 [INFO] Uploading: http://mavenrepo.openmrs.org/nexus/content/repositories/snapshots/org/openmrs/web/openmrs-web/maven-metadata.xml
26-Nov-2015 22:33:51 [INFO] Uploaded: http://mavenrepo.openmrs.org/nexus/content/repositories/snapshots/org/openmrs/web/openmrs-web/maven-metadata.xml (651 B at 12.5 KB/sec)
26-Nov-2015 22:33:51 [INFO] Uploading: http://mavenrepo.openmrs.org/nexus/content/repositories/snapshots/org/openmrs/web/openmrs-web/1.8.5-SNAPSHOT/openmrs-web-1.8.5-20151126.223350-95-tests.jar
26-Nov-2015 22:33:51 [INFO] Uploaded: http://mavenrepo.openmrs.org/nexus/content/repositories/snapshots/org/openmrs/web/openmrs-web/1.8.5-SNAPSHOT/openmrs-web-1.8.5-20151126.223350-95-tests.jar (102 KB at 1660.7 KB/sec)
26-Nov-2015 22:33:51 [INFO] Uploading: http://mavenrepo.openmrs.org/nexus/content/repositories/snapshots/org/openmrs/web/openmrs-web/1.8.5-SNAPSHOT/maven-metadata.xml
26-Nov-2015 22:33:51 [INFO] Uploaded: http://mavenrepo.openmrs.org/nexus/content/repositories/snapshots/org/openmrs/web/openmrs-web/1.8.5-SNAPSHOT/maven-metadata.xml (992 B at 21.5 KB/sec)
26-Nov-2015 22:33:51 [INFO]                                                                         
26-Nov-2015 22:33:51 [INFO] ------------------------------------------------------------------------
26-Nov-2015 22:33:51 [INFO] Building openmrs-webapp 1.8.5-SNAPSHOT
26-Nov-2015 22:33:51 [INFO] ------------------------------------------------------------------------
26-Nov-2015 22:33:51 [INFO]
26-Nov-2015 22:33:51 [INFO] --- maven-clean-plugin:2.5:clean (default-clean) @ openmrs-webapp ---
26-Nov-2015 22:33:51 [INFO]
26-Nov-2015 22:33:51 [INFO] --- buildnumber-maven-plugin:1.1:create (default) @ openmrs-webapp ---
26-Nov-2015 22:33:51 [INFO]
26-Nov-2015 22:33:51 [INFO] --- build-helper-maven-plugin:1.5:parse-version (parse-version) @ openmrs-webapp ---
26-Nov-2015 22:33:51 [INFO]
26-Nov-2015 22:33:51 [INFO] --- maven-resources-plugin:2.6:resources (default-resources) @ openmrs-webapp ---
26-Nov-2015 22:33:51 [INFO] Using 'UTF-8' encoding to copy filtered resources.
26-Nov-2015 22:33:51 [INFO] Copying 7 resources
26-Nov-2015 22:33:51 [INFO] Copying 1 resource to ../jetty
26-Nov-2015 22:33:51 [INFO]
26-Nov-2015 22:33:51 [INFO] --- maven-antrun-plugin:1.4:run (default) @ openmrs-webapp ---
26-Nov-2015 22:33:52 project.artifactId
26-Nov-2015 22:33:52 [INFO] Executing tasks
26-Nov-2015 22:33:52     [unzip] Expanding: /home/bamboo-agent-2/bamboo-agent/xml-data/build-dir/TRUNK-ONEPRIOR-JOB1/webapp/src/main/resources/liquibase-data.zip into /home/bamboo-agent-2/bamboo-agent/xml-data/build-dir/TRUNK-ONEPRIOR-JOB1/webapp/target/classes
26-Nov-2015 22:33:52 [INFO] Executed tasks
26-Nov-2015 22:33:52 [INFO]
26-Nov-2015 22:33:52 [INFO] --- maven-compiler-plugin:3.1:compile (default-compile) @ openmrs-webapp ---
26-Nov-2015 22:33:52 [INFO] No sources to compile
26-Nov-2015 22:33:52 [INFO]
26-Nov-2015 22:33:52 [INFO] --- maven-resources-plugin:2.6:testResources (default-testResources) @ openmrs-webapp ---
26-Nov-2015 22:33:52 [INFO] Using 'UTF-8' encoding to copy filtered resources.
26-Nov-2015 22:33:52 [INFO] Copying 1 resource
26-Nov-2015 22:33:52 [INFO]
26-Nov-2015 22:33:52 [INFO] --- maven-compiler-plugin:3.1:testCompile (default-testCompile) @ openmrs-webapp ---
26-Nov-2015 22:33:52 [INFO] No sources to compile
26-Nov-2015 22:33:52 [INFO]
26-Nov-2015 22:33:52 [INFO] --- maven-surefire-plugin:2.5:test (default-test) @ openmrs-webapp ---
26-Nov-2015 22:33:52 [INFO] Surefire report directory: /home/bamboo-agent-2/bamboo-agent/xml-data/build-dir/TRUNK-ONEPRIOR-JOB1/webapp/target/surefire-reports
26-Nov-2015 22:33:53
26-Nov-2015 22:33:53 -------------------------------------------------------
26-Nov-2015 22:33:53 T E S T S
26-Nov-2015 22:33:53 -------------------------------------------------------
26-Nov-2015 22:33:53 There are no tests to run.
26-Nov-2015 22:33:53
26-Nov-2015 22:33:53 Results :
26-Nov-2015 22:33:53
26-Nov-2015 22:33:53 Tests run: 0, Failures: 0, Errors: 0, Skipped: 0
26-Nov-2015 22:33:53
26-Nov-2015 22:33:53 [INFO]
26-Nov-2015 22:33:53 [INFO] --- maven-war-plugin:2.4:war (default-war) @ openmrs-webapp ---
26-Nov-2015 22:33:53 [INFO] Packaging webapp
26-Nov-2015 22:33:53 [INFO] Assembling webapp [openmrs-webapp] in [/home/bamboo-agent-2/bamboo-agent/xml-data/build-dir/TRUNK-ONEPRIOR-JOB1/webapp/target/openmrs]
26-Nov-2015 22:33:53 [INFO] Processing war project
26-Nov-2015 22:33:53 [INFO] Copying webapp webResources [/home/bamboo-agent-2/bamboo-agent/xml-data/build-dir/TRUNK-ONEPRIOR-JOB1/webapp/src/main/webapp] to [/home/bamboo-agent-2/bamboo-agent/xml-data/build-dir/TRUNK-ONEPRIOR-JOB1/webapp/target/openmrs]
26-Nov-2015 22:33:53 [INFO] Copying webapp resources [/home/bamboo-agent-2/bamboo-agent/xml-data/build-dir/TRUNK-ONEPRIOR-JOB1/webapp/src/main/webapp]
26-Nov-2015 22:33:55 [INFO] Webapp assembled in [1380 msecs]
26-Nov-2015 22:33:55 [INFO] Building war: /home/bamboo-agent-2/bamboo-agent/xml-data/build-dir/TRUNK-ONEPRIOR-JOB1/webapp/target/openmrs.war
26-Nov-2015 22:33:58 [INFO]
26-Nov-2015 22:33:58 [INFO] --- maven-install-plugin:2.4:install (default-install) @ openmrs-webapp ---
26-Nov-2015 22:33:58 [INFO] Installing /home/bamboo-agent-2/bamboo-agent/xml-data/build-dir/TRUNK-ONEPRIOR-JOB1/webapp/target/openmrs.war to /home/bamboo-agent-2/.m2/repository/org/openmrs/web/openmrs-webapp/1.8.5-SNAPSHOT/openmrs-webapp-1.8.5-SNAPSHOT.war
26-Nov-2015 22:33:58 [INFO] Installing /home/bamboo-agent-2/bamboo-agent/xml-data/build-dir/TRUNK-ONEPRIOR-JOB1/webapp/pom.xml to /home/bamboo-agent-2/.m2/repository/org/openmrs/web/openmrs-webapp/1.8.5-SNAPSHOT/openmrs-webapp-1.8.5-SNAPSHOT.pom
26-Nov-2015 22:33:58 [INFO]
26-Nov-2015 22:33:58 [INFO] --- maven-deploy-plugin:2.7:deploy (default-deploy) @ openmrs-webapp ---
26-Nov-2015 22:33:58 [INFO] Downloading: http://mavenrepo.openmrs.org/nexus/content/repositories/snapshots/org/openmrs/web/openmrs-webapp/1.8.5-SNAPSHOT/maven-metadata.xml
26-Nov-2015 22:33:58 [INFO] Downloaded: http://mavenrepo.openmrs.org/nexus/content/repositories/snapshots/org/openmrs/web/openmrs-webapp/1.8.5-SNAPSHOT/maven-metadata.xml (782 B at 29.4 KB/sec)
26-Nov-2015 22:33:58 [INFO] Uploading: http://mavenrepo.openmrs.org/nexus/content/repositories/snapshots/org/openmrs/web/openmrs-webapp/1.8.5-SNAPSHOT/openmrs-webapp-1.8.5-20151126.223358-95.war
26-Nov-2015 22:34:00 [INFO] Uploaded: http://mavenrepo.openmrs.org/nexus/content/repositories/snapshots/org/openmrs/web/openmrs-webapp/1.8.5-SNAPSHOT/openmrs-webapp-1.8.5-20151126.223358-95.war (36756 KB at 21357.0 KB/sec)
26-Nov-2015 22:34:00 [INFO] Uploading: http://mavenrepo.openmrs.org/nexus/content/repositories/snapshots/org/openmrs/web/openmrs-webapp/1.8.5-SNAPSHOT/openmrs-webapp-1.8.5-20151126.223358-95.pom
26-Nov-2015 22:34:00 [INFO] Uploaded: http://mavenrepo.openmrs.org/nexus/content/repositories/snapshots/org/openmrs/web/openmrs-webapp/1.8.5-SNAPSHOT/openmrs-webapp-1.8.5-20151126.223358-95.pom (8 KB at 138.6 KB/sec)
26-Nov-2015 22:34:00 [INFO] Downloading: http://mavenrepo.openmrs.org/nexus/content/repositories/snapshots/org/openmrs/web/openmrs-webapp/maven-metadata.xml
26-Nov-2015 22:34:00 [INFO] Downloaded: http://mavenrepo.openmrs.org/nexus/content/repositories/snapshots/org/openmrs/web/openmrs-webapp/maven-metadata.xml (654 B at 20.6 KB/sec)
26-Nov-2015 22:34:00 [INFO] Uploading: http://mavenrepo.openmrs.org/nexus/content/repositories/snapshots/org/openmrs/web/openmrs-webapp/1.8.5-SNAPSHOT/maven-metadata.xml
26-Nov-2015 22:34:00 [INFO] Uploaded: http://mavenrepo.openmrs.org/nexus/content/repositories/snapshots/org/openmrs/web/openmrs-webapp/1.8.5-SNAPSHOT/maven-metadata.xml (782 B at 15.3 KB/sec)
26-Nov-2015 22:34:00 [INFO] Uploading: http://mavenrepo.openmrs.org/nexus/content/repositories/snapshots/org/openmrs/web/openmrs-webapp/maven-metadata.xml
26-Nov-2015 22:34:00 [INFO] Uploaded: http://mavenrepo.openmrs.org/nexus/content/repositories/snapshots/org/openmrs/web/openmrs-webapp/maven-metadata.xml (654 B at 8.9 KB/sec)
26-Nov-2015 22:34:00 [INFO] ------------------------------------------------------------------------
26-Nov-2015 22:34:00 [INFO] Reactor Summary:
26-Nov-2015 22:34:00 [INFO]
26-Nov-2015 22:34:00 [INFO] OpenMRS ............................................ SUCCESS [  7.408 s]
26-Nov-2015 22:34:00 [INFO] openmrs-tools ...................................... SUCCESS [  2.278 s]
26-Nov-2015 22:34:00 [INFO] openmrs-test ....................................... SUCCESS [  0.509 s]
26-Nov-2015 22:34:00 [INFO] openmrs-api ........................................ SUCCESS [03:26 min]
26-Nov-2015 22:34:00 [INFO] openmrs-web ........................................ SUCCESS [ 51.916 s]
26-Nov-2015 22:34:00 [INFO] openmrs-webapp ..................................... SUCCESS [  9.291 s]
26-Nov-2015 22:34:00 [INFO] ------------------------------------------------------------------------
26-Nov-2015 22:34:00 [INFO] BUILD SUCCESS
26-Nov-2015 22:34:00 [INFO] ------------------------------------------------------------------------
26-Nov-2015 22:34:00 [INFO] Total time: 04:38 min
26-Nov-2015 22:34:00 [INFO] Finished at: 2015-11-26T22:34:00+00:00
26-Nov-2015 22:34:00 [INFO] Final Memory: 37M/386M
26-Nov-2015 22:34:00 [INFO] ------------------------------------------------------------------------
26-Nov-2015 22:34:01 Parsing test results under /home/bamboo-agent-2/bamboo-agent/xml-data/build-dir/TRUNK-ONEPRIOR-JOB1...
26-Nov-2015 22:34:01 Finished task 'Maven 3.x' with result: Success
26-Nov-2015 22:34:01 Running post build plugin 'Artifact Copier'
26-Nov-2015 22:34:01 Running post build plugin 'npm Cache Cleanup'
26-Nov-2015 22:34:01 Running post build plugin 'NCover Results Collector'
26-Nov-2015 22:34:01 Running post build plugin 'Clover Results Collector'
26-Nov-2015 22:34:01 Finalising the build...
26-Nov-2015 22:34:01 Stopping timer.
26-Nov-2015 22:34:01 Build TRUNK-ONEPRIOR-JOB1-41 completed.
26-Nov-2015 22:34:02 Running on server: post build plugin 'Clover Delta Calculator'
26-Nov-2015 22:34:02 Running on server: post build plugin 'Build Hanging Detection Configuration'
26-Nov-2015 22:34:02 Running on server: post build plugin 'NCover Results Collector'
26-Nov-2015 22:34:02 Running on server: post build plugin 'Sonar Build Log Password Obfuscator'
26-Nov-2015 22:34:02 Running on server: post build plugin 'Maven Dependencies Postprocessor'
26-Nov-2015 22:34:02 All post build plugins have finished
26-Nov-2015 22:34:02 Generating build results summary...
26-Nov-2015 22:34:02 Saving build results to disk...
26-Nov-2015 22:34:03 Indexing build results...
26-Nov-2015 22:34:03 Finished building TRUNK-ONEPRIOR-JOB1-41.