Build: #181 failed

Job: Default Job failed

Stages & jobs

  1. Default Stage

  2. Deploy to production

    Requires a user to start manually

Job result summary

Completed
Duration
2 minutes
Agent
yak.openmrs.org
Revision
aec1f28e4f793aff26e757c3f295e4736dcc78ce aec1f28e4f793aff26e757c3f295e4736dcc78ce
Total tests
30
Fixed in
#182 (Code changes detected)

Tests

  • 30 tests in total
  • 2 tests failed
  • 2 failures are new
  • 3 tests were quarantined / skipped
  • 6 seconds taken in total.
New test failures 2
Status Test Duration
Collapse Failed ModulusTest testHandleModuleJson History
< 1 sec
java.lang.AssertionError: 
Expected: is (hasProperty("version", <1.1>) and hasProperty("releaseDatetime", is <2009-10-13T10:58:12Z>) and hasProperty("downloadUri", is "https://modules.openmrs.org/modulus/api/releases/6/download/addresshierarchy-1.1.omod"))
     but: hasProperty("version", <1.1>)  property 'version' was <1.0>
java.lang.AssertionError: 

Expected: is (hasProperty("version", <1.1>) and hasProperty("releaseDatetime", is <2009-10-13T10:58:12Z>) and hasProperty("downloadUri", is "https://modules.openmrs.org/modulus/api/releases/6/download/addresshierarchy-1.1.omod"))
     but: hasProperty("version", <1.1>)  property 'version' was <1.0>
	at org.openmrs.addonindex.backend.ModulusTest.testHandleModuleJson(ModulusTest.java:64)
Collapse Failed OpenmrsMavenRepoTest testHandlingNexusXml History
< 1 sec
java.lang.AssertionError: 
Expected: is "1.0"
     but: was "1.7"
java.lang.AssertionError: 

Expected: is "1.0"
     but: was "1.7"
	at org.openmrs.addonindex.backend.OpenmrsMavenRepoTest.testHandlingNexusXml(OpenmrsMavenRepoTest.java:38)