Build: #36 failed

Job: Default Job failed

Stages & jobs

  1. Default Stage

  2. Release

    Requires a user to start manually

Job result summary

Completed
Duration
54 seconds
Agent
yokobue.openmrs.org
Revision
6a67c9d57487e2293af6079c3d847485fa02f443 6a67c9d57487e2293af6079c3d847485fa02f443
Total tests
10
Failing since
#35 (Rebuilt by Juliet Wamalwa)
Fixed in
#37 (Code changes detected)
Number of retries
2

Tests

  • 10 tests in total
  • 10 tests failed
  • 33 seconds taken in total.
Existing test failures 10
Status Test Failing since Duration
org.apache.maven.it.VerificationException: Exit code was non-zero: 1; command line and log =  /usr/share/apache-maven-3.3.9/bin/mvn -N -X -e --batch-mode -Dmaven.repo.local=/home/bamboo-agent/.m2/repository org.apache.maven.plugins:maven-clean-plugin:clean compile Apache Maven 3.3.9 (bb52d8502b132ec0a5a3f4c09453c07478323dc5; 2015-11-10T16:41:47+00:00) Maven home: /usr/share/apache-maven-3.3.9 Java version: 1.8.0_292, vendor: Private Build Java home: /usr/lib/jvm/java-8-openjdk-amd64/jre Default locale: en_US, platform encoding: UTF-8 OS name: "linux", version: "4.4.0-210-generic", arch: "amd64", family: "unix" [DEBUG] Created new class realm maven.api [DEBUG] Importing foreign packages into class realm maven.api [DEBUG]   Imported: javax.enterprise.inject.* < plexus.core [DEBUG]   Imported: javax.enterprise.util.* < plexus.core [DEBUG]   Imported: javax.inject.* < plexus.core [DEBUG]   Imported: org.apache.maven.* < plexus.core [DEBUG]   Imported: org.apache.maven.artifact < plexus.core [DEBUG]   Imported: org.apache.maven.classrealm < plexus.core [DEBUG]   Imported: org.apache.maven.cli < plexus.core [DEBUG]   Imported: org.apache.maven.configuration < plexus.core [DEBUG]   Imported: org.apache.maven.exception < plexus.core [DEBUG]   Imported: org.apache.maven.execution < plexus.core [DEBUG]   Imported: org.apache.maven.execution.scope < plexus.core [DEBUG]   Imported: org.apache.maven.lifecycle < plexus.core [DEBUG]   Imported: org.apache.maven.model < plexus.core [DEBUG]   Imported: org.apache.maven.monitor < plexus.core [DEBUG]   Imported: org.apache.maven.plugin < plexus.core [DEBUG]   Imported: org.apache.maven.profiles < plexus.core [DEBUG]   Imported: org.apache.maven.project < plexus.core [DEBUG]   Imported: org.apache.maven.reporting < plexus.core [DEBUG]   Imported: org.apache.maven.repository < plexus.core [DEBUG]   Imported: org.apache.maven.rtinfo < plexus.core [DEBUG]   Imported: org.apache.maven.settings < plexus.core [DEBUG]   Imported: org.apache.maven.toolchain < plexus.core [DEBUG]   Imported: org.apache.maven.usability < plexus.core [DEBUG]   Imported: org.apache.maven.wagon.* < plexus.core [DEBUG]   Imported: org.apache.maven.wagon.authentication < plexus.core [DEBUG]   Imported: org.apache.maven.wagon.authorization < plexus.core [DEBUG]   Imported: org.apache.maven.wagon.events < plexus.core [DEBUG]   Imported: org.apache.maven.wagon.observers < plexus.core [DEBUG]   Imported: org.apache.maven.wagon.proxy < plexus.core [DEBUG]   Imported: org.apache.maven.wagon.repository < plexus.core [DEBUG]   Imported: org.apache.maven.wagon.resource < plexus.core [DEBUG]   Imported: org.codehaus.classworlds < plexus.core [DEBUG]   Imported: org.codehaus.plexus.* < plexus.core [DEBUG]   Imported: org.codehaus.plexus.classworlds < plexus.core [DEBUG]   Imported: org.codehaus.plexus.component < plexus.core [DEBUG]   Imported: org.codehaus.plexus.configuration < plexus.core [DEBUG]   Imported: org.codehaus.plexus.container < plexus.core [DEBUG]   Imported: org.codehaus.plexus.context < plexus.core [DEBUG]   Imported: org.codehaus.plexus.lifecycle < plexus.core [DEBUG]   Imported: org.codehaus.plexus.logging < plexus.core [DEBUG]   Imported: org.codehaus.plexus.personality < plexus.core [DEBUG]   Imported: org.codehaus.plexus.util.xml.Xpp3Dom < plexus.core [DEBUG]   Imported: org.codehaus.plexus.util.xml.pull.XmlPullParser < plexus.core [DEBUG]   Imported: org.codehaus.plexus.util.xml.pull.XmlPullParserException < plexus.core [DEBUG]   Imported: org.codehaus.plexus.util.xml.pull.XmlSerializer < plexus.core [DEBUG]   Imported: org.eclipse.aether.* < plexus.core [DEBUG]   Imported: org.eclipse.aether.artifact < plexus.core [DEBUG]   Imported: org.eclipse.aether.collection < plexus.core [DEBUG]   Imported: org.eclipse.aether.deployment < plexus.core [DEBUG]   Imported: org.eclipse.aether.graph < plexus.core [DEBUG]   Imported: org.eclipse.aether.impl < plexus.core [DEBUG]   Imported: org.eclipse.aether.installation < plexus.core [DEBUG]   Imported: org.eclipse.aether.internal.impl < plexus.core [DEBUG]   Imported: org.eclipse.aether.metadata < plexus.core [DEBUG]   Imported: org.eclipse.aether.repository < plexus.core [DEBUG]   Imported: org.eclipse.aether.resolution < plexus.core [DEBUG]   Imported: org.eclipse.aether.spi < plexus.core [DEBUG]   Imported: org.eclipse.aether.transfer < plexus.core [DEBUG]   Imported: org.eclipse.aether.version < plexus.core [DEBUG]   Imported: org.slf4j.* < plexus.core [DEBUG]   Imported: org.slf4j.helpers.* < plexus.core [DEBUG]   Imported: org.slf4j.spi.* < plexus.core [DEBUG] Populating class realm maven.api [INFO] Error stacktraces are turned on. [DEBUG] Reading global settings from /usr/share/apache-maven-3.3.9/conf/settings.xml [DEBUG] Reading user settings from /home/bamboo-agent/.m2/settings.xml [DEBUG] Reading global toolchains from /usr/share/apache-maven-3.3.9/conf/toolchains.xml [DEBUG] Reading user toolchains from /home/bamboo-agent/.m2/toolchains.xml [DEBUG] Using local repository at /home/bamboo-agent/.m2/repository [DEBUG] Using manager EnhancedLocalRepositoryManager with priority 10.0 for /home/bamboo-agent/.m2/repository [INFO] Scanning for projects... [DEBUG] Extension realms for project org.openmrs.maven.plugins:openmrs-packager-maven-plugin-config-test-parent:pom:1.0.0-SNAPSHOT: (none) [DEBUG] Looking up lifecyle mappings for packaging pom from ClassRealm[plexus.core, parent: null] [DEBUG] === REACTOR BUILD PLAN ================================================ [DEBUG] Project: org.openmrs.maven.plugins:openmrs-packager-maven-plugin-config-test-parent:pom:1.0.0-SNAPSHOT [DEBUG] Tasks:   [org.apache.maven.plugins:maven-clean-plugin:clean, compile] [DEBUG] Style:   Regular [DEBUG] ======================================================================= [INFO]                                                                          [INFO] ------------------------------------------------------------------------ [INFO] Building OpenMRS config parent test 1.0.0-SNAPSHOT [INFO] ------------------------------------------------------------------------ [DEBUG] Lifecycle default -> [validate, initialize, generate-sources, process-sources, generate-resources, process-resources, compile, process-classes, generate-test-sources, process-test-sources, generate-test-resources, process-test-resources, test-compile, process-test-classes, test, prepare-package, package, pre-integration-test, integration-test, post-integration-test, verify, install, deploy] [DEBUG] Lifecycle clean -> [pre-clean, clean, post-clean] [DEBUG] Lifecycle site -> [pre-site, site, post-site, site-deploy] [DEBUG] Could not find metadata org.openmrs.maven.plugins:openmrs-packager-maven-plugin:1.5.0-SNAPSHOT/maven-metadata.xml in local (/home/bamboo-agent/.m2/repository) [DEBUG] Could not find metadata org.openmrs.maven.plugins:openmrs-packager-maven-plugin:1.5.0-SNAPSHOT/maven-metadata.xml in local (/home/bamboo-agent/.m2/repository) [WARNING] The POM for org.openmrs.maven.plugins:openmrs-packager-maven-plugin:jar:1.5.0-SNAPSHOT is missing, no dependency information available [INFO] ------------------------------------------------------------------------ [INFO] BUILD FAILURE [INFO] ------------------------------------------------------------------------ [INFO] Total time: 0.199 s [INFO] Finished at: 2021-07-14T15:53:27+00:00 [INFO] Final Memory: 7M/106M [INFO] ------------------------------------------------------------------------ [ERROR] Plugin org.openmrs.maven.plugins:openmrs-packager-maven-plugin:1.5.0-SNAPSHOT or one of its dependencies could not be resolved: Could not find artifact org.openmrs.maven.plugins:openmrs-packager-maven-plugin:jar:1.5.0-SNAPSHOT -> [Help 1] org.apache.maven.plugin.PluginResolutionException: Plugin org.openmrs.maven.plugins:openmrs-packager-maven-plugin:1.5.0-SNAPSHOT or one of its dependencies could not be resolved: Could not find artifact org.openmrs.maven.plugins:openmrs-packager-maven-plugin:jar:1.5.0-SNAPSHOT  at org.apache.maven.plugin.internal.DefaultPluginDependenciesResolver.resolve(DefaultPluginDependenciesResolver.java:128)  at org.apache.maven.plugin.internal.DefaultMavenPluginManager.getPluginDescriptor(DefaultMavenPluginManager.java:179)  at org.apache.maven.plugin.internal.DefaultMavenPluginManager.getMojoDescriptor(DefaultMavenPluginManager.java:284)  at org.apache.maven.plugin.DefaultBuildPluginManager.getMojoDescriptor(DefaultBuildPluginManager.java:241)  at org.apache.maven.lifecycle.internal.DefaultLifecycleExecutionPlanCalculator.setupMojoExecution(DefaultLifecycleExecutionPlanCalculator.java:169)  at org.apache.maven.lifecycle.internal.DefaultLifecycleExecutionPlanCalculator.setupMojoExecutions(DefaultLifecycleExecutionPlanCalculator.java:155)  at org.apache.maven.lifecycle.internal.DefaultLifecycleExecutionPlanCalculator.calculateExecutionPlan(DefaultLifecycleExecutionPlanCalculator.java:131)  at org.apache.maven.lifecycle.internal.DefaultLifecycleExecutionPlanCalculator.calculateExecutionPlan(DefaultLifecycleExecutionPlanCalculator.java:145)  at org.apache.maven.lifecycle.internal.builder.BuilderCommon.resolveBuildPlan(BuilderCommon.java:96)  at org.apache.maven.lifecycle.internal.LifecycleModuleBuilder.buildProject(LifecycleModuleBuilder.java:109)  at org.apache.maven.lifecycle.internal.LifecycleModuleBuilder.buildProject(LifecycleModuleBuilder.java:80)  at org.apache.maven.lifecycle.internal.builder.singlethreaded.SingleThreadedBuilder.build(SingleThreadedBuilder.java:51)  at org.apache.maven.lifecycle.internal.LifecycleStarter.execute(LifecycleStarter.java:128)  at org.apache.maven.DefaultMaven.doExecute(DefaultMaven.java:307)  at org.apache.maven.DefaultMaven.doExecute(DefaultMaven.java:193)  at org.apache.maven.DefaultMaven.execute(DefaultMaven.java:106)  at org.apache.maven.cli.MavenCli.execute(MavenCli.java:863)  at org.apache.maven.cli.MavenCli.doMain(MavenCli.java:288)  at org.apache.maven.cli.MavenCli.main(MavenCli.java:199)  at sun.reflect.NativeMethodAccessorImpl.invoke0(Native Method)  at sun.reflect.NativeMethodAccessorImpl.invoke(NativeMethodAccessorImpl.java:62)  at sun.reflect.DelegatingMethodAccessorImpl.invoke(DelegatingMethodAccessorImpl.java:43)  at java.lang.reflect.Method.invoke(Method.java:498)  at org.codehaus.plexus.classworlds.launcher.Launcher.launchEnhanced(Launcher.java:289)  at org.codehaus.plexus.classworlds.launcher.Launcher.launch(Launcher.java:229)  at org.codehaus.plexus.classworlds.launcher.Launcher.mainWithExitCode(Launcher.java:415)  at org.codehaus.plexus.classworlds.launcher.Launcher.main(Launcher.java:356) Caused by: org.eclipse.aether.resolution.ArtifactResolutionException: Could not find artifact org.openmrs.maven.plugins:openmrs-packager-maven-plugin:jar:1.5.0-SNAPSHOT  at org.eclipse.aether.internal.impl.DefaultArtifactResolver.resolve(DefaultArtifactResolver.java:444)  at org.eclipse.aether.internal.impl.DefaultArtifactResolver.resolveArtifacts(DefaultArtifactResolver.java:246)  at org.eclipse.aether.internal.impl.DefaultArtifactResolver.resolveArtifact(DefaultArtifactResolver.java:223)  at org.eclipse.aether.internal.impl.DefaultRepositorySystem.resolveArtifact(DefaultRepositorySystem.java:294)  at org.apache.maven.plugin.internal.DefaultPluginDependenciesResolver.resolve(DefaultPluginDependenciesResolver.java:124)  ... 26 more Caused by: org.eclipse.aether.transfer.ArtifactNotFoundException: Could not find artifact org.openmrs.maven.plugins:openmrs-packager-maven-plugin:jar:1.5.0-SNAPSHOT  at org.eclipse.aether.internal.impl.DefaultArtifactResolver.resolve(DefaultArtifactResolver.java:434)  ... 30 more [ERROR]  [ERROR]  [ERROR] For more information about the errors and possible solutions, please read the following articles: [ERROR] [Help 1] http://cwiki.apache.org/confluence/display/MAVEN/PluginResolutionException 
org.apache.maven.it.VerificationException: Exit code was non-zero: 1; command line and log = 
/usr/share/apache-maven-3.3.9/bin/mvn -N -X -e --batch-mode -Dmaven.repo.local=/home/bamboo-agent/.m2/repository org.apache.maven.plugins:maven-clean-plugin:clean compile
Apache Maven 3.3.9 (bb52d8502b132ec0a5a3f4c09453c07478323dc5; 2015-11-10T16:41:47+00:00)
Maven home: /usr/share/apache-maven-3.3.9
Java version: 1.8.0_292, vendor: Private Build
Java home: /usr/lib/jvm/java-8-openjdk-amd64/jre
Default locale: en_US, platform encoding: UTF-8
(179 more lines...)
org.apache.maven.it.VerificationException: Exit code was non-zero: 1; command line and log =  /usr/share/apache-maven-3.3.9/bin/mvn -N -X -e --batch-mode -Dmaven.repo.local=/home/bamboo-agent/.m2/repository org.apache.maven.plugins:maven-clean-plugin:clean install Apache Maven 3.3.9 (bb52d8502b132ec0a5a3f4c09453c07478323dc5; 2015-11-10T16:41:47+00:00) Maven home: /usr/share/apache-maven-3.3.9 Java version: 1.8.0_292, vendor: Private Build Java home: /usr/lib/jvm/java-8-openjdk-amd64/jre Default locale: en_US, platform encoding: UTF-8 OS name: "linux", version: "4.4.0-210-generic", arch: "amd64", family: "unix" [DEBUG] Created new class realm maven.api [DEBUG] Importing foreign packages into class realm maven.api [DEBUG]   Imported: javax.enterprise.inject.* < plexus.core [DEBUG]   Imported: javax.enterprise.util.* < plexus.core [DEBUG]   Imported: javax.inject.* < plexus.core [DEBUG]   Imported: org.apache.maven.* < plexus.core [DEBUG]   Imported: org.apache.maven.artifact < plexus.core [DEBUG]   Imported: org.apache.maven.classrealm < plexus.core [DEBUG]   Imported: org.apache.maven.cli < plexus.core [DEBUG]   Imported: org.apache.maven.configuration < plexus.core [DEBUG]   Imported: org.apache.maven.exception < plexus.core [DEBUG]   Imported: org.apache.maven.execution < plexus.core [DEBUG]   Imported: org.apache.maven.execution.scope < plexus.core [DEBUG]   Imported: org.apache.maven.lifecycle < plexus.core [DEBUG]   Imported: org.apache.maven.model < plexus.core [DEBUG]   Imported: org.apache.maven.monitor < plexus.core [DEBUG]   Imported: org.apache.maven.plugin < plexus.core [DEBUG]   Imported: org.apache.maven.profiles < plexus.core [DEBUG]   Imported: org.apache.maven.project < plexus.core [DEBUG]   Imported: org.apache.maven.reporting < plexus.core [DEBUG]   Imported: org.apache.maven.repository < plexus.core [DEBUG]   Imported: org.apache.maven.rtinfo < plexus.core [DEBUG]   Imported: org.apache.maven.settings < plexus.core [DEBUG]   Imported: org.apache.maven.toolchain < plexus.core [DEBUG]   Imported: org.apache.maven.usability < plexus.core [DEBUG]   Imported: org.apache.maven.wagon.* < plexus.core [DEBUG]   Imported: org.apache.maven.wagon.authentication < plexus.core [DEBUG]   Imported: org.apache.maven.wagon.authorization < plexus.core [DEBUG]   Imported: org.apache.maven.wagon.events < plexus.core [DEBUG]   Imported: org.apache.maven.wagon.observers < plexus.core [DEBUG]   Imported: org.apache.maven.wagon.proxy < plexus.core [DEBUG]   Imported: org.apache.maven.wagon.repository < plexus.core [DEBUG]   Imported: org.apache.maven.wagon.resource < plexus.core [DEBUG]   Imported: org.codehaus.classworlds < plexus.core [DEBUG]   Imported: org.codehaus.plexus.* < plexus.core [DEBUG]   Imported: org.codehaus.plexus.classworlds < plexus.core [DEBUG]   Imported: org.codehaus.plexus.component < plexus.core [DEBUG]   Imported: org.codehaus.plexus.configuration < plexus.core [DEBUG]   Imported: org.codehaus.plexus.container < plexus.core [DEBUG]   Imported: org.codehaus.plexus.context < plexus.core [DEBUG]   Imported: org.codehaus.plexus.lifecycle < plexus.core [DEBUG]   Imported: org.codehaus.plexus.logging < plexus.core [DEBUG]   Imported: org.codehaus.plexus.personality < plexus.core [DEBUG]   Imported: org.codehaus.plexus.util.xml.Xpp3Dom < plexus.core [DEBUG]   Imported: org.codehaus.plexus.util.xml.pull.XmlPullParser < plexus.core [DEBUG]   Imported: org.codehaus.plexus.util.xml.pull.XmlPullParserException < plexus.core [DEBUG]   Imported: org.codehaus.plexus.util.xml.pull.XmlSerializer < plexus.core [DEBUG]   Imported: org.eclipse.aether.* < plexus.core [DEBUG]   Imported: org.eclipse.aether.artifact < plexus.core [DEBUG]   Imported: org.eclipse.aether.collection < plexus.core [DEBUG]   Imported: org.eclipse.aether.deployment < plexus.core [DEBUG]   Imported: org.eclipse.aether.graph < plexus.core [DEBUG]   Imported: org.eclipse.aether.impl < plexus.core [DEBUG]   Imported: org.eclipse.aether.installation < plexus.core [DEBUG]   Imported: org.eclipse.aether.internal.impl < plexus.core [DEBUG]   Imported: org.eclipse.aether.metadata < plexus.core [DEBUG]   Imported: org.eclipse.aether.repository < plexus.core [DEBUG]   Imported: org.eclipse.aether.resolution < plexus.core [DEBUG]   Imported: org.eclipse.aether.spi < plexus.core [DEBUG]   Imported: org.eclipse.aether.transfer < plexus.core [DEBUG]   Imported: org.eclipse.aether.version < plexus.core [DEBUG]   Imported: org.slf4j.* < plexus.core [DEBUG]   Imported: org.slf4j.helpers.* < plexus.core [DEBUG]   Imported: org.slf4j.spi.* < plexus.core [DEBUG] Populating class realm maven.api [INFO] Error stacktraces are turned on. [DEBUG] Reading global settings from /usr/share/apache-maven-3.3.9/conf/settings.xml [DEBUG] Reading user settings from /home/bamboo-agent/.m2/settings.xml [DEBUG] Reading global toolchains from /usr/share/apache-maven-3.3.9/conf/toolchains.xml [DEBUG] Reading user toolchains from /home/bamboo-agent/.m2/toolchains.xml [DEBUG] Using local repository at /home/bamboo-agent/.m2/repository [DEBUG] Using manager EnhancedLocalRepositoryManager with priority 10.0 for /home/bamboo-agent/.m2/repository [INFO] Scanning for projects... [DEBUG] Extension realms for project org.openmrs.maven.plugins:openmrs-packager-maven-plugin-config-test-parent:pom:1.0.0-SNAPSHOT: (none) [DEBUG] Looking up lifecyle mappings for packaging pom from ClassRealm[plexus.core, parent: null] [DEBUG] === REACTOR BUILD PLAN ================================================ [DEBUG] Project: org.openmrs.maven.plugins:openmrs-packager-maven-plugin-config-test-parent:pom:1.0.0-SNAPSHOT [DEBUG] Tasks:   [org.apache.maven.plugins:maven-clean-plugin:clean, install] [DEBUG] Style:   Regular [DEBUG] ======================================================================= [INFO]                                                                          [INFO] ------------------------------------------------------------------------ [INFO] Building OpenMRS config parent test 1.0.0-SNAPSHOT [INFO] ------------------------------------------------------------------------ [DEBUG] Lifecycle default -> [validate, initialize, generate-sources, process-sources, generate-resources, process-resources, compile, process-classes, generate-test-sources, process-test-sources, generate-test-resources, process-test-resources, test-compile, process-test-classes, test, prepare-package, package, pre-integration-test, integration-test, post-integration-test, verify, install, deploy] [DEBUG] Lifecycle clean -> [pre-clean, clean, post-clean] [DEBUG] Lifecycle site -> [pre-site, site, post-site, site-deploy] [DEBUG] Could not find metadata org.openmrs.maven.plugins:openmrs-packager-maven-plugin:1.5.0-SNAPSHOT/maven-metadata.xml in local (/home/bamboo-agent/.m2/repository) [DEBUG] Could not find metadata org.openmrs.maven.plugins:openmrs-packager-maven-plugin:1.5.0-SNAPSHOT/maven-metadata.xml in local (/home/bamboo-agent/.m2/repository) [WARNING] The POM for org.openmrs.maven.plugins:openmrs-packager-maven-plugin:jar:1.5.0-SNAPSHOT is missing, no dependency information available [INFO] ------------------------------------------------------------------------ [INFO] BUILD FAILURE [INFO] ------------------------------------------------------------------------ [INFO] Total time: 0.202 s [INFO] Finished at: 2021-07-14T15:53:41+00:00 [INFO] Final Memory: 7M/106M [INFO] ------------------------------------------------------------------------ [ERROR] Plugin org.openmrs.maven.plugins:openmrs-packager-maven-plugin:1.5.0-SNAPSHOT or one of its dependencies could not be resolved: Could not find artifact org.openmrs.maven.plugins:openmrs-packager-maven-plugin:jar:1.5.0-SNAPSHOT -> [Help 1] org.apache.maven.plugin.PluginResolutionException: Plugin org.openmrs.maven.plugins:openmrs-packager-maven-plugin:1.5.0-SNAPSHOT or one of its dependencies could not be resolved: Could not find artifact org.openmrs.maven.plugins:openmrs-packager-maven-plugin:jar:1.5.0-SNAPSHOT  at org.apache.maven.plugin.internal.DefaultPluginDependenciesResolver.resolve(DefaultPluginDependenciesResolver.java:128)  at org.apache.maven.plugin.internal.DefaultMavenPluginManager.getPluginDescriptor(DefaultMavenPluginManager.java:179)  at org.apache.maven.plugin.internal.DefaultMavenPluginManager.getMojoDescriptor(DefaultMavenPluginManager.java:284)  at org.apache.maven.plugin.DefaultBuildPluginManager.getMojoDescriptor(DefaultBuildPluginManager.java:241)  at org.apache.maven.lifecycle.internal.DefaultLifecycleExecutionPlanCalculator.setupMojoExecution(DefaultLifecycleExecutionPlanCalculator.java:169)  at org.apache.maven.lifecycle.internal.DefaultLifecycleExecutionPlanCalculator.setupMojoExecutions(DefaultLifecycleExecutionPlanCalculator.java:155)  at org.apache.maven.lifecycle.internal.DefaultLifecycleExecutionPlanCalculator.calculateExecutionPlan(DefaultLifecycleExecutionPlanCalculator.java:131)  at org.apache.maven.lifecycle.internal.DefaultLifecycleExecutionPlanCalculator.calculateExecutionPlan(DefaultLifecycleExecutionPlanCalculator.java:145)  at org.apache.maven.lifecycle.internal.builder.BuilderCommon.resolveBuildPlan(BuilderCommon.java:96)  at org.apache.maven.lifecycle.internal.LifecycleModuleBuilder.buildProject(LifecycleModuleBuilder.java:109)  at org.apache.maven.lifecycle.internal.LifecycleModuleBuilder.buildProject(LifecycleModuleBuilder.java:80)  at org.apache.maven.lifecycle.internal.builder.singlethreaded.SingleThreadedBuilder.build(SingleThreadedBuilder.java:51)  at org.apache.maven.lifecycle.internal.LifecycleStarter.execute(LifecycleStarter.java:128)  at org.apache.maven.DefaultMaven.doExecute(DefaultMaven.java:307)  at org.apache.maven.DefaultMaven.doExecute(DefaultMaven.java:193)  at org.apache.maven.DefaultMaven.execute(DefaultMaven.java:106)  at org.apache.maven.cli.MavenCli.execute(MavenCli.java:863)  at org.apache.maven.cli.MavenCli.doMain(MavenCli.java:288)  at org.apache.maven.cli.MavenCli.main(MavenCli.java:199)  at sun.reflect.NativeMethodAccessorImpl.invoke0(Native Method)  at sun.reflect.NativeMethodAccessorImpl.invoke(NativeMethodAccessorImpl.java:62)  at sun.reflect.DelegatingMethodAccessorImpl.invoke(DelegatingMethodAccessorImpl.java:43)  at java.lang.reflect.Method.invoke(Method.java:498)  at org.codehaus.plexus.classworlds.launcher.Launcher.launchEnhanced(Launcher.java:289)  at org.codehaus.plexus.classworlds.launcher.Launcher.launch(Launcher.java:229)  at org.codehaus.plexus.classworlds.launcher.Launcher.mainWithExitCode(Launcher.java:415)  at org.codehaus.plexus.classworlds.launcher.Launcher.main(Launcher.java:356) Caused by: org.eclipse.aether.resolution.ArtifactResolutionException: Could not find artifact org.openmrs.maven.plugins:openmrs-packager-maven-plugin:jar:1.5.0-SNAPSHOT  at org.eclipse.aether.internal.impl.DefaultArtifactResolver.resolve(DefaultArtifactResolver.java:444)  at org.eclipse.aether.internal.impl.DefaultArtifactResolver.resolveArtifacts(DefaultArtifactResolver.java:246)  at org.eclipse.aether.internal.impl.DefaultArtifactResolver.resolveArtifact(DefaultArtifactResolver.java:223)  at org.eclipse.aether.internal.impl.DefaultRepositorySystem.resolveArtifact(DefaultRepositorySystem.java:294)  at org.apache.maven.plugin.internal.DefaultPluginDependenciesResolver.resolve(DefaultPluginDependenciesResolver.java:124)  ... 26 more Caused by: org.eclipse.aether.transfer.ArtifactNotFoundException: Could not find artifact org.openmrs.maven.plugins:openmrs-packager-maven-plugin:jar:1.5.0-SNAPSHOT  at org.eclipse.aether.internal.impl.DefaultArtifactResolver.resolve(DefaultArtifactResolver.java:434)  ... 30 more [ERROR]  [ERROR]  [ERROR] For more information about the errors and possible solutions, please read the following articles: [ERROR] [Help 1] http://cwiki.apache.org/confluence/display/MAVEN/PluginResolutionException 
org.apache.maven.it.VerificationException: Exit code was non-zero: 1; command line and log = 
/usr/share/apache-maven-3.3.9/bin/mvn -N -X -e --batch-mode -Dmaven.repo.local=/home/bamboo-agent/.m2/repository org.apache.maven.plugins:maven-clean-plugin:clean install
Apache Maven 3.3.9 (bb52d8502b132ec0a5a3f4c09453c07478323dc5; 2015-11-10T16:41:47+00:00)
Maven home: /usr/share/apache-maven-3.3.9
Java version: 1.8.0_292, vendor: Private Build
Java home: /usr/lib/jvm/java-8-openjdk-amd64/jre
Default locale: en_US, platform encoding: UTF-8
(180 more lines...)
org.apache.maven.it.VerificationException: Exit code was non-zero: 1; command line and log =  /usr/share/apache-maven-3.3.9/bin/mvn -N -X -e --batch-mode -Dmaven.repo.local=/home/bamboo-agent/.m2/repository org.apache.maven.plugins:maven-clean-plugin:clean install Apache Maven 3.3.9 (bb52d8502b132ec0a5a3f4c09453c07478323dc5; 2015-11-10T16:41:47+00:00) Maven home: /usr/share/apache-maven-3.3.9 Java version: 1.8.0_292, vendor: Private Build Java home: /usr/lib/jvm/java-8-openjdk-amd64/jre Default locale: en_US, platform encoding: UTF-8 OS name: "linux", version: "4.4.0-210-generic", arch: "amd64", family: "unix" [DEBUG] Created new class realm maven.api [DEBUG] Importing foreign packages into class realm maven.api [DEBUG]   Imported: javax.enterprise.inject.* < plexus.core [DEBUG]   Imported: javax.enterprise.util.* < plexus.core [DEBUG]   Imported: javax.inject.* < plexus.core [DEBUG]   Imported: org.apache.maven.* < plexus.core [DEBUG]   Imported: org.apache.maven.artifact < plexus.core [DEBUG]   Imported: org.apache.maven.classrealm < plexus.core [DEBUG]   Imported: org.apache.maven.cli < plexus.core [DEBUG]   Imported: org.apache.maven.configuration < plexus.core [DEBUG]   Imported: org.apache.maven.exception < plexus.core [DEBUG]   Imported: org.apache.maven.execution < plexus.core [DEBUG]   Imported: org.apache.maven.execution.scope < plexus.core [DEBUG]   Imported: org.apache.maven.lifecycle < plexus.core [DEBUG]   Imported: org.apache.maven.model < plexus.core [DEBUG]   Imported: org.apache.maven.monitor < plexus.core [DEBUG]   Imported: org.apache.maven.plugin < plexus.core [DEBUG]   Imported: org.apache.maven.profiles < plexus.core [DEBUG]   Imported: org.apache.maven.project < plexus.core [DEBUG]   Imported: org.apache.maven.reporting < plexus.core [DEBUG]   Imported: org.apache.maven.repository < plexus.core [DEBUG]   Imported: org.apache.maven.rtinfo < plexus.core [DEBUG]   Imported: org.apache.maven.settings < plexus.core [DEBUG]   Imported: org.apache.maven.toolchain < plexus.core [DEBUG]   Imported: org.apache.maven.usability < plexus.core [DEBUG]   Imported: org.apache.maven.wagon.* < plexus.core [DEBUG]   Imported: org.apache.maven.wagon.authentication < plexus.core [DEBUG]   Imported: org.apache.maven.wagon.authorization < plexus.core [DEBUG]   Imported: org.apache.maven.wagon.events < plexus.core [DEBUG]   Imported: org.apache.maven.wagon.observers < plexus.core [DEBUG]   Imported: org.apache.maven.wagon.proxy < plexus.core [DEBUG]   Imported: org.apache.maven.wagon.repository < plexus.core [DEBUG]   Imported: org.apache.maven.wagon.resource < plexus.core [DEBUG]   Imported: org.codehaus.classworlds < plexus.core [DEBUG]   Imported: org.codehaus.plexus.* < plexus.core [DEBUG]   Imported: org.codehaus.plexus.classworlds < plexus.core [DEBUG]   Imported: org.codehaus.plexus.component < plexus.core [DEBUG]   Imported: org.codehaus.plexus.configuration < plexus.core [DEBUG]   Imported: org.codehaus.plexus.container < plexus.core [DEBUG]   Imported: org.codehaus.plexus.context < plexus.core [DEBUG]   Imported: org.codehaus.plexus.lifecycle < plexus.core [DEBUG]   Imported: org.codehaus.plexus.logging < plexus.core [DEBUG]   Imported: org.codehaus.plexus.personality < plexus.core [DEBUG]   Imported: org.codehaus.plexus.util.xml.Xpp3Dom < plexus.core [DEBUG]   Imported: org.codehaus.plexus.util.xml.pull.XmlPullParser < plexus.core [DEBUG]   Imported: org.codehaus.plexus.util.xml.pull.XmlPullParserException < plexus.core [DEBUG]   Imported: org.codehaus.plexus.util.xml.pull.XmlSerializer < plexus.core [DEBUG]   Imported: org.eclipse.aether.* < plexus.core [DEBUG]   Imported: org.eclipse.aether.artifact < plexus.core [DEBUG]   Imported: org.eclipse.aether.collection < plexus.core [DEBUG]   Imported: org.eclipse.aether.deployment < plexus.core [DEBUG]   Imported: org.eclipse.aether.graph < plexus.core [DEBUG]   Imported: org.eclipse.aether.impl < plexus.core [DEBUG]   Imported: org.eclipse.aether.installation < plexus.core [DEBUG]   Imported: org.eclipse.aether.internal.impl < plexus.core [DEBUG]   Imported: org.eclipse.aether.metadata < plexus.core [DEBUG]   Imported: org.eclipse.aether.repository < plexus.core [DEBUG]   Imported: org.eclipse.aether.resolution < plexus.core [DEBUG]   Imported: org.eclipse.aether.spi < plexus.core [DEBUG]   Imported: org.eclipse.aether.transfer < plexus.core [DEBUG]   Imported: org.eclipse.aether.version < plexus.core [DEBUG]   Imported: org.slf4j.* < plexus.core [DEBUG]   Imported: org.slf4j.helpers.* < plexus.core [DEBUG]   Imported: org.slf4j.spi.* < plexus.core [DEBUG] Populating class realm maven.api [INFO] Error stacktraces are turned on. [DEBUG] Reading global settings from /usr/share/apache-maven-3.3.9/conf/settings.xml [DEBUG] Reading user settings from /home/bamboo-agent/.m2/settings.xml [DEBUG] Reading global toolchains from /usr/share/apache-maven-3.3.9/conf/toolchains.xml [DEBUG] Reading user toolchains from /home/bamboo-agent/.m2/toolchains.xml [DEBUG] Using local repository at /home/bamboo-agent/.m2/repository [DEBUG] Using manager EnhancedLocalRepositoryManager with priority 10.0 for /home/bamboo-agent/.m2/repository [INFO] Scanning for projects... [DEBUG] Extension realms for project org.openmrs.maven.plugins:openmrs-packager-maven-plugin-config-test-parent:pom:1.0.0-SNAPSHOT: (none) [DEBUG] Looking up lifecyle mappings for packaging pom from ClassRealm[plexus.core, parent: null] [DEBUG] === REACTOR BUILD PLAN ================================================ [DEBUG] Project: org.openmrs.maven.plugins:openmrs-packager-maven-plugin-config-test-parent:pom:1.0.0-SNAPSHOT [DEBUG] Tasks:   [org.apache.maven.plugins:maven-clean-plugin:clean, install] [DEBUG] Style:   Regular [DEBUG] ======================================================================= [INFO]                                                                          [INFO] ------------------------------------------------------------------------ [INFO] Building OpenMRS config parent test 1.0.0-SNAPSHOT [INFO] ------------------------------------------------------------------------ [DEBUG] Lifecycle default -> [validate, initialize, generate-sources, process-sources, generate-resources, process-resources, compile, process-classes, generate-test-sources, process-test-sources, generate-test-resources, process-test-resources, test-compile, process-test-classes, test, prepare-package, package, pre-integration-test, integration-test, post-integration-test, verify, install, deploy] [DEBUG] Lifecycle clean -> [pre-clean, clean, post-clean] [DEBUG] Lifecycle site -> [pre-site, site, post-site, site-deploy] [DEBUG] Could not find metadata org.openmrs.maven.plugins:openmrs-packager-maven-plugin:1.5.0-SNAPSHOT/maven-metadata.xml in local (/home/bamboo-agent/.m2/repository) [DEBUG] Could not find metadata org.openmrs.maven.plugins:openmrs-packager-maven-plugin:1.5.0-SNAPSHOT/maven-metadata.xml in local (/home/bamboo-agent/.m2/repository) [WARNING] The POM for org.openmrs.maven.plugins:openmrs-packager-maven-plugin:jar:1.5.0-SNAPSHOT is missing, no dependency information available [INFO] ------------------------------------------------------------------------ [INFO] BUILD FAILURE [INFO] ------------------------------------------------------------------------ [INFO] Total time: 0.285 s [INFO] Finished at: 2021-07-14T15:53:51+00:00 [INFO] Final Memory: 7M/106M [INFO] ------------------------------------------------------------------------ [ERROR] Plugin org.openmrs.maven.plugins:openmrs-packager-maven-plugin:1.5.0-SNAPSHOT or one of its dependencies could not be resolved: Could not find artifact org.openmrs.maven.plugins:openmrs-packager-maven-plugin:jar:1.5.0-SNAPSHOT -> [Help 1] org.apache.maven.plugin.PluginResolutionException: Plugin org.openmrs.maven.plugins:openmrs-packager-maven-plugin:1.5.0-SNAPSHOT or one of its dependencies could not be resolved: Could not find artifact org.openmrs.maven.plugins:openmrs-packager-maven-plugin:jar:1.5.0-SNAPSHOT  at org.apache.maven.plugin.internal.DefaultPluginDependenciesResolver.resolve(DefaultPluginDependenciesResolver.java:128)  at org.apache.maven.plugin.internal.DefaultMavenPluginManager.getPluginDescriptor(DefaultMavenPluginManager.java:179)  at org.apache.maven.plugin.internal.DefaultMavenPluginManager.getMojoDescriptor(DefaultMavenPluginManager.java:284)  at org.apache.maven.plugin.DefaultBuildPluginManager.getMojoDescriptor(DefaultBuildPluginManager.java:241)  at org.apache.maven.lifecycle.internal.DefaultLifecycleExecutionPlanCalculator.setupMojoExecution(DefaultLifecycleExecutionPlanCalculator.java:169)  at org.apache.maven.lifecycle.internal.DefaultLifecycleExecutionPlanCalculator.setupMojoExecutions(DefaultLifecycleExecutionPlanCalculator.java:155)  at org.apache.maven.lifecycle.internal.DefaultLifecycleExecutionPlanCalculator.calculateExecutionPlan(DefaultLifecycleExecutionPlanCalculator.java:131)  at org.apache.maven.lifecycle.internal.DefaultLifecycleExecutionPlanCalculator.calculateExecutionPlan(DefaultLifecycleExecutionPlanCalculator.java:145)  at org.apache.maven.lifecycle.internal.builder.BuilderCommon.resolveBuildPlan(BuilderCommon.java:96)  at org.apache.maven.lifecycle.internal.LifecycleModuleBuilder.buildProject(LifecycleModuleBuilder.java:109)  at org.apache.maven.lifecycle.internal.LifecycleModuleBuilder.buildProject(LifecycleModuleBuilder.java:80)  at org.apache.maven.lifecycle.internal.builder.singlethreaded.SingleThreadedBuilder.build(SingleThreadedBuilder.java:51)  at org.apache.maven.lifecycle.internal.LifecycleStarter.execute(LifecycleStarter.java:128)  at org.apache.maven.DefaultMaven.doExecute(DefaultMaven.java:307)  at org.apache.maven.DefaultMaven.doExecute(DefaultMaven.java:193)  at org.apache.maven.DefaultMaven.execute(DefaultMaven.java:106)  at org.apache.maven.cli.MavenCli.execute(MavenCli.java:863)  at org.apache.maven.cli.MavenCli.doMain(MavenCli.java:288)  at org.apache.maven.cli.MavenCli.main(MavenCli.java:199)  at sun.reflect.NativeMethodAccessorImpl.invoke0(Native Method)  at sun.reflect.NativeMethodAccessorImpl.invoke(NativeMethodAccessorImpl.java:62)  at sun.reflect.DelegatingMethodAccessorImpl.invoke(DelegatingMethodAccessorImpl.java:43)  at java.lang.reflect.Method.invoke(Method.java:498)  at org.codehaus.plexus.classworlds.launcher.Launcher.launchEnhanced(Launcher.java:289)  at org.codehaus.plexus.classworlds.launcher.Launcher.launch(Launcher.java:229)  at org.codehaus.plexus.classworlds.launcher.Launcher.mainWithExitCode(Launcher.java:415)  at org.codehaus.plexus.classworlds.launcher.Launcher.main(Launcher.java:356) Caused by: org.eclipse.aether.resolution.ArtifactResolutionException: Could not find artifact org.openmrs.maven.plugins:openmrs-packager-maven-plugin:jar:1.5.0-SNAPSHOT  at org.eclipse.aether.internal.impl.DefaultArtifactResolver.resolve(DefaultArtifactResolver.java:444)  at org.eclipse.aether.internal.impl.DefaultArtifactResolver.resolveArtifacts(DefaultArtifactResolver.java:246)  at org.eclipse.aether.internal.impl.DefaultArtifactResolver.resolveArtifact(DefaultArtifactResolver.java:223)  at org.eclipse.aether.internal.impl.DefaultRepositorySystem.resolveArtifact(DefaultRepositorySystem.java:294)  at org.apache.maven.plugin.internal.DefaultPluginDependenciesResolver.resolve(DefaultPluginDependenciesResolver.java:124)  ... 26 more Caused by: org.eclipse.aether.transfer.ArtifactNotFoundException: Could not find artifact org.openmrs.maven.plugins:openmrs-packager-maven-plugin:jar:1.5.0-SNAPSHOT  at org.eclipse.aether.internal.impl.DefaultArtifactResolver.resolve(DefaultArtifactResolver.java:434)  ... 30 more [ERROR]  [ERROR]  [ERROR] For more information about the errors and possible solutions, please read the following articles: [ERROR] [Help 1] http://cwiki.apache.org/confluence/display/MAVEN/PluginResolutionException 
org.apache.maven.it.VerificationException: Exit code was non-zero: 1; command line and log = 
/usr/share/apache-maven-3.3.9/bin/mvn -N -X -e --batch-mode -Dmaven.repo.local=/home/bamboo-agent/.m2/repository org.apache.maven.plugins:maven-clean-plugin:clean install
Apache Maven 3.3.9 (bb52d8502b132ec0a5a3f4c09453c07478323dc5; 2015-11-10T16:41:47+00:00)
Maven home: /usr/share/apache-maven-3.3.9
Java version: 1.8.0_292, vendor: Private Build
Java home: /usr/lib/jvm/java-8-openjdk-amd64/jre
Default locale: en_US, platform encoding: UTF-8
(180 more lines...)
org.apache.maven.it.VerificationException: Exit code was non-zero: 1; command line and log =  /usr/share/apache-maven-3.3.9/bin/mvn -N -X -e --batch-mode -Dmaven.repo.local=/home/bamboo-agent/.m2/repository org.apache.maven.plugins:maven-clean-plugin:clean install Apache Maven 3.3.9 (bb52d8502b132ec0a5a3f4c09453c07478323dc5; 2015-11-10T16:41:47+00:00) Maven home: /usr/share/apache-maven-3.3.9 Java version: 1.8.0_292, vendor: Private Build Java home: /usr/lib/jvm/java-8-openjdk-amd64/jre Default locale: en_US, platform encoding: UTF-8 OS name: "linux", version: "4.4.0-210-generic", arch: "amd64", family: "unix" [DEBUG] Created new class realm maven.api [DEBUG] Importing foreign packages into class realm maven.api [DEBUG]   Imported: javax.enterprise.inject.* < plexus.core [DEBUG]   Imported: javax.enterprise.util.* < plexus.core [DEBUG]   Imported: javax.inject.* < plexus.core [DEBUG]   Imported: org.apache.maven.* < plexus.core [DEBUG]   Imported: org.apache.maven.artifact < plexus.core [DEBUG]   Imported: org.apache.maven.classrealm < plexus.core [DEBUG]   Imported: org.apache.maven.cli < plexus.core [DEBUG]   Imported: org.apache.maven.configuration < plexus.core [DEBUG]   Imported: org.apache.maven.exception < plexus.core [DEBUG]   Imported: org.apache.maven.execution < plexus.core [DEBUG]   Imported: org.apache.maven.execution.scope < plexus.core [DEBUG]   Imported: org.apache.maven.lifecycle < plexus.core [DEBUG]   Imported: org.apache.maven.model < plexus.core [DEBUG]   Imported: org.apache.maven.monitor < plexus.core [DEBUG]   Imported: org.apache.maven.plugin < plexus.core [DEBUG]   Imported: org.apache.maven.profiles < plexus.core [DEBUG]   Imported: org.apache.maven.project < plexus.core [DEBUG]   Imported: org.apache.maven.reporting < plexus.core [DEBUG]   Imported: org.apache.maven.repository < plexus.core [DEBUG]   Imported: org.apache.maven.rtinfo < plexus.core [DEBUG]   Imported: org.apache.maven.settings < plexus.core [DEBUG]   Imported: org.apache.maven.toolchain < plexus.core [DEBUG]   Imported: org.apache.maven.usability < plexus.core [DEBUG]   Imported: org.apache.maven.wagon.* < plexus.core [DEBUG]   Imported: org.apache.maven.wagon.authentication < plexus.core [DEBUG]   Imported: org.apache.maven.wagon.authorization < plexus.core [DEBUG]   Imported: org.apache.maven.wagon.events < plexus.core [DEBUG]   Imported: org.apache.maven.wagon.observers < plexus.core [DEBUG]   Imported: org.apache.maven.wagon.proxy < plexus.core [DEBUG]   Imported: org.apache.maven.wagon.repository < plexus.core [DEBUG]   Imported: org.apache.maven.wagon.resource < plexus.core [DEBUG]   Imported: org.codehaus.classworlds < plexus.core [DEBUG]   Imported: org.codehaus.plexus.* < plexus.core [DEBUG]   Imported: org.codehaus.plexus.classworlds < plexus.core [DEBUG]   Imported: org.codehaus.plexus.component < plexus.core [DEBUG]   Imported: org.codehaus.plexus.configuration < plexus.core [DEBUG]   Imported: org.codehaus.plexus.container < plexus.core [DEBUG]   Imported: org.codehaus.plexus.context < plexus.core [DEBUG]   Imported: org.codehaus.plexus.lifecycle < plexus.core [DEBUG]   Imported: org.codehaus.plexus.logging < plexus.core [DEBUG]   Imported: org.codehaus.plexus.personality < plexus.core [DEBUG]   Imported: org.codehaus.plexus.util.xml.Xpp3Dom < plexus.core [DEBUG]   Imported: org.codehaus.plexus.util.xml.pull.XmlPullParser < plexus.core [DEBUG]   Imported: org.codehaus.plexus.util.xml.pull.XmlPullParserException < plexus.core [DEBUG]   Imported: org.codehaus.plexus.util.xml.pull.XmlSerializer < plexus.core [DEBUG]   Imported: org.eclipse.aether.* < plexus.core [DEBUG]   Imported: org.eclipse.aether.artifact < plexus.core [DEBUG]   Imported: org.eclipse.aether.collection < plexus.core [DEBUG]   Imported: org.eclipse.aether.deployment < plexus.core [DEBUG]   Imported: org.eclipse.aether.graph < plexus.core [DEBUG]   Imported: org.eclipse.aether.impl < plexus.core [DEBUG]   Imported: org.eclipse.aether.installation < plexus.core [DEBUG]   Imported: org.eclipse.aether.internal.impl < plexus.core [DEBUG]   Imported: org.eclipse.aether.metadata < plexus.core [DEBUG]   Imported: org.eclipse.aether.repository < plexus.core [DEBUG]   Imported: org.eclipse.aether.resolution < plexus.core [DEBUG]   Imported: org.eclipse.aether.spi < plexus.core [DEBUG]   Imported: org.eclipse.aether.transfer < plexus.core [DEBUG]   Imported: org.eclipse.aether.version < plexus.core [DEBUG]   Imported: org.slf4j.* < plexus.core [DEBUG]   Imported: org.slf4j.helpers.* < plexus.core [DEBUG]   Imported: org.slf4j.spi.* < plexus.core [DEBUG] Populating class realm maven.api [INFO] Error stacktraces are turned on. [DEBUG] Reading global settings from /usr/share/apache-maven-3.3.9/conf/settings.xml [DEBUG] Reading user settings from /home/bamboo-agent/.m2/settings.xml [DEBUG] Reading global toolchains from /usr/share/apache-maven-3.3.9/conf/toolchains.xml [DEBUG] Reading user toolchains from /home/bamboo-agent/.m2/toolchains.xml [DEBUG] Using local repository at /home/bamboo-agent/.m2/repository [DEBUG] Using manager EnhancedLocalRepositoryManager with priority 10.0 for /home/bamboo-agent/.m2/repository [INFO] Scanning for projects... [DEBUG] Extension realms for project org.openmrs.maven.plugins:openmrs-packager-maven-plugin-config-test-parent:pom:1.0.0-SNAPSHOT: (none) [DEBUG] Looking up lifecyle mappings for packaging pom from ClassRealm[plexus.core, parent: null] [DEBUG] === REACTOR BUILD PLAN ================================================ [DEBUG] Project: org.openmrs.maven.plugins:openmrs-packager-maven-plugin-config-test-parent:pom:1.0.0-SNAPSHOT [DEBUG] Tasks:   [org.apache.maven.plugins:maven-clean-plugin:clean, install] [DEBUG] Style:   Regular [DEBUG] ======================================================================= [INFO]                                                                          [INFO] ------------------------------------------------------------------------ [INFO] Building OpenMRS config parent test 1.0.0-SNAPSHOT [INFO] ------------------------------------------------------------------------ [DEBUG] Lifecycle default -> [validate, initialize, generate-sources, process-sources, generate-resources, process-resources, compile, process-classes, generate-test-sources, process-test-sources, generate-test-resources, process-test-resources, test-compile, process-test-classes, test, prepare-package, package, pre-integration-test, integration-test, post-integration-test, verify, install, deploy] [DEBUG] Lifecycle clean -> [pre-clean, clean, post-clean] [DEBUG] Lifecycle site -> [pre-site, site, post-site, site-deploy] [DEBUG] Could not find metadata org.openmrs.maven.plugins:openmrs-packager-maven-plugin:1.5.0-SNAPSHOT/maven-metadata.xml in local (/home/bamboo-agent/.m2/repository) [DEBUG] Could not find metadata org.openmrs.maven.plugins:openmrs-packager-maven-plugin:1.5.0-SNAPSHOT/maven-metadata.xml in local (/home/bamboo-agent/.m2/repository) [WARNING] The POM for org.openmrs.maven.plugins:openmrs-packager-maven-plugin:jar:1.5.0-SNAPSHOT is missing, no dependency information available [INFO] ------------------------------------------------------------------------ [INFO] BUILD FAILURE [INFO] ------------------------------------------------------------------------ [INFO] Total time: 0.137 s [INFO] Finished at: 2021-07-14T15:53:54+00:00 [INFO] Final Memory: 7M/106M [INFO] ------------------------------------------------------------------------ [ERROR] Plugin org.openmrs.maven.plugins:openmrs-packager-maven-plugin:1.5.0-SNAPSHOT or one of its dependencies could not be resolved: Could not find artifact org.openmrs.maven.plugins:openmrs-packager-maven-plugin:jar:1.5.0-SNAPSHOT -> [Help 1] org.apache.maven.plugin.PluginResolutionException: Plugin org.openmrs.maven.plugins:openmrs-packager-maven-plugin:1.5.0-SNAPSHOT or one of its dependencies could not be resolved: Could not find artifact org.openmrs.maven.plugins:openmrs-packager-maven-plugin:jar:1.5.0-SNAPSHOT  at org.apache.maven.plugin.internal.DefaultPluginDependenciesResolver.resolve(DefaultPluginDependenciesResolver.java:128)  at org.apache.maven.plugin.internal.DefaultMavenPluginManager.getPluginDescriptor(DefaultMavenPluginManager.java:179)  at org.apache.maven.plugin.internal.DefaultMavenPluginManager.getMojoDescriptor(DefaultMavenPluginManager.java:284)  at org.apache.maven.plugin.DefaultBuildPluginManager.getMojoDescriptor(DefaultBuildPluginManager.java:241)  at org.apache.maven.lifecycle.internal.DefaultLifecycleExecutionPlanCalculator.setupMojoExecution(DefaultLifecycleExecutionPlanCalculator.java:169)  at org.apache.maven.lifecycle.internal.DefaultLifecycleExecutionPlanCalculator.setupMojoExecutions(DefaultLifecycleExecutionPlanCalculator.java:155)  at org.apache.maven.lifecycle.internal.DefaultLifecycleExecutionPlanCalculator.calculateExecutionPlan(DefaultLifecycleExecutionPlanCalculator.java:131)  at org.apache.maven.lifecycle.internal.DefaultLifecycleExecutionPlanCalculator.calculateExecutionPlan(DefaultLifecycleExecutionPlanCalculator.java:145)  at org.apache.maven.lifecycle.internal.builder.BuilderCommon.resolveBuildPlan(BuilderCommon.java:96)  at org.apache.maven.lifecycle.internal.LifecycleModuleBuilder.buildProject(LifecycleModuleBuilder.java:109)  at org.apache.maven.lifecycle.internal.LifecycleModuleBuilder.buildProject(LifecycleModuleBuilder.java:80)  at org.apache.maven.lifecycle.internal.builder.singlethreaded.SingleThreadedBuilder.build(SingleThreadedBuilder.java:51)  at org.apache.maven.lifecycle.internal.LifecycleStarter.execute(LifecycleStarter.java:128)  at org.apache.maven.DefaultMaven.doExecute(DefaultMaven.java:307)  at org.apache.maven.DefaultMaven.doExecute(DefaultMaven.java:193)  at org.apache.maven.DefaultMaven.execute(DefaultMaven.java:106)  at org.apache.maven.cli.MavenCli.execute(MavenCli.java:863)  at org.apache.maven.cli.MavenCli.doMain(MavenCli.java:288)  at org.apache.maven.cli.MavenCli.main(MavenCli.java:199)  at sun.reflect.NativeMethodAccessorImpl.invoke0(Native Method)  at sun.reflect.NativeMethodAccessorImpl.invoke(NativeMethodAccessorImpl.java:62)  at sun.reflect.DelegatingMethodAccessorImpl.invoke(DelegatingMethodAccessorImpl.java:43)  at java.lang.reflect.Method.invoke(Method.java:498)  at org.codehaus.plexus.classworlds.launcher.Launcher.launchEnhanced(Launcher.java:289)  at org.codehaus.plexus.classworlds.launcher.Launcher.launch(Launcher.java:229)  at org.codehaus.plexus.classworlds.launcher.Launcher.mainWithExitCode(Launcher.java:415)  at org.codehaus.plexus.classworlds.launcher.Launcher.main(Launcher.java:356) Caused by: org.eclipse.aether.resolution.ArtifactResolutionException: Could not find artifact org.openmrs.maven.plugins:openmrs-packager-maven-plugin:jar:1.5.0-SNAPSHOT  at org.eclipse.aether.internal.impl.DefaultArtifactResolver.resolve(DefaultArtifactResolver.java:444)  at org.eclipse.aether.internal.impl.DefaultArtifactResolver.resolveArtifacts(DefaultArtifactResolver.java:246)  at org.eclipse.aether.internal.impl.DefaultArtifactResolver.resolveArtifact(DefaultArtifactResolver.java:223)  at org.eclipse.aether.internal.impl.DefaultRepositorySystem.resolveArtifact(DefaultRepositorySystem.java:294)  at org.apache.maven.plugin.internal.DefaultPluginDependenciesResolver.resolve(DefaultPluginDependenciesResolver.java:124)  ... 26 more Caused by: org.eclipse.aether.transfer.ArtifactNotFoundException: Could not find artifact org.openmrs.maven.plugins:openmrs-packager-maven-plugin:jar:1.5.0-SNAPSHOT  at org.eclipse.aether.internal.impl.DefaultArtifactResolver.resolve(DefaultArtifactResolver.java:434)  ... 30 more [ERROR]  [ERROR]  [ERROR] For more information about the errors and possible solutions, please read the following articles: [ERROR] [Help 1] http://cwiki.apache.org/confluence/display/MAVEN/PluginResolutionException 
org.apache.maven.it.VerificationException: Exit code was non-zero: 1; command line and log = 
/usr/share/apache-maven-3.3.9/bin/mvn -N -X -e --batch-mode -Dmaven.repo.local=/home/bamboo-agent/.m2/repository org.apache.maven.plugins:maven-clean-plugin:clean install
Apache Maven 3.3.9 (bb52d8502b132ec0a5a3f4c09453c07478323dc5; 2015-11-10T16:41:47+00:00)
Maven home: /usr/share/apache-maven-3.3.9
Java version: 1.8.0_292, vendor: Private Build
Java home: /usr/lib/jvm/java-8-openjdk-amd64/jre
Default locale: en_US, platform encoding: UTF-8
(180 more lines...)
org.apache.maven.it.VerificationException: Exit code was non-zero: 1; command line and log =  /usr/share/apache-maven-3.3.9/bin/mvn -N -X -e --batch-mode -Dmaven.repo.local=/home/bamboo-agent/.m2/repository org.apache.maven.plugins:maven-clean-plugin:clean install Apache Maven 3.3.9 (bb52d8502b132ec0a5a3f4c09453c07478323dc5; 2015-11-10T16:41:47+00:00) Maven home: /usr/share/apache-maven-3.3.9 Java version: 1.8.0_292, vendor: Private Build Java home: /usr/lib/jvm/java-8-openjdk-amd64/jre Default locale: en_US, platform encoding: UTF-8 OS name: "linux", version: "4.4.0-210-generic", arch: "amd64", family: "unix" [DEBUG] Created new class realm maven.api [DEBUG] Importing foreign packages into class realm maven.api [DEBUG]   Imported: javax.enterprise.inject.* < plexus.core [DEBUG]   Imported: javax.enterprise.util.* < plexus.core [DEBUG]   Imported: javax.inject.* < plexus.core [DEBUG]   Imported: org.apache.maven.* < plexus.core [DEBUG]   Imported: org.apache.maven.artifact < plexus.core [DEBUG]   Imported: org.apache.maven.classrealm < plexus.core [DEBUG]   Imported: org.apache.maven.cli < plexus.core [DEBUG]   Imported: org.apache.maven.configuration < plexus.core [DEBUG]   Imported: org.apache.maven.exception < plexus.core [DEBUG]   Imported: org.apache.maven.execution < plexus.core [DEBUG]   Imported: org.apache.maven.execution.scope < plexus.core [DEBUG]   Imported: org.apache.maven.lifecycle < plexus.core [DEBUG]   Imported: org.apache.maven.model < plexus.core [DEBUG]   Imported: org.apache.maven.monitor < plexus.core [DEBUG]   Imported: org.apache.maven.plugin < plexus.core [DEBUG]   Imported: org.apache.maven.profiles < plexus.core [DEBUG]   Imported: org.apache.maven.project < plexus.core [DEBUG]   Imported: org.apache.maven.reporting < plexus.core [DEBUG]   Imported: org.apache.maven.repository < plexus.core [DEBUG]   Imported: org.apache.maven.rtinfo < plexus.core [DEBUG]   Imported: org.apache.maven.settings < plexus.core [DEBUG]   Imported: org.apache.maven.toolchain < plexus.core [DEBUG]   Imported: org.apache.maven.usability < plexus.core [DEBUG]   Imported: org.apache.maven.wagon.* < plexus.core [DEBUG]   Imported: org.apache.maven.wagon.authentication < plexus.core [DEBUG]   Imported: org.apache.maven.wagon.authorization < plexus.core [DEBUG]   Imported: org.apache.maven.wagon.events < plexus.core [DEBUG]   Imported: org.apache.maven.wagon.observers < plexus.core [DEBUG]   Imported: org.apache.maven.wagon.proxy < plexus.core [DEBUG]   Imported: org.apache.maven.wagon.repository < plexus.core [DEBUG]   Imported: org.apache.maven.wagon.resource < plexus.core [DEBUG]   Imported: org.codehaus.classworlds < plexus.core [DEBUG]   Imported: org.codehaus.plexus.* < plexus.core [DEBUG]   Imported: org.codehaus.plexus.classworlds < plexus.core [DEBUG]   Imported: org.codehaus.plexus.component < plexus.core [DEBUG]   Imported: org.codehaus.plexus.configuration < plexus.core [DEBUG]   Imported: org.codehaus.plexus.container < plexus.core [DEBUG]   Imported: org.codehaus.plexus.context < plexus.core [DEBUG]   Imported: org.codehaus.plexus.lifecycle < plexus.core [DEBUG]   Imported: org.codehaus.plexus.logging < plexus.core [DEBUG]   Imported: org.codehaus.plexus.personality < plexus.core [DEBUG]   Imported: org.codehaus.plexus.util.xml.Xpp3Dom < plexus.core [DEBUG]   Imported: org.codehaus.plexus.util.xml.pull.XmlPullParser < plexus.core [DEBUG]   Imported: org.codehaus.plexus.util.xml.pull.XmlPullParserException < plexus.core [DEBUG]   Imported: org.codehaus.plexus.util.xml.pull.XmlSerializer < plexus.core [DEBUG]   Imported: org.eclipse.aether.* < plexus.core [DEBUG]   Imported: org.eclipse.aether.artifact < plexus.core [DEBUG]   Imported: org.eclipse.aether.collection < plexus.core [DEBUG]   Imported: org.eclipse.aether.deployment < plexus.core [DEBUG]   Imported: org.eclipse.aether.graph < plexus.core [DEBUG]   Imported: org.eclipse.aether.impl < plexus.core [DEBUG]   Imported: org.eclipse.aether.installation < plexus.core [DEBUG]   Imported: org.eclipse.aether.internal.impl < plexus.core [DEBUG]   Imported: org.eclipse.aether.metadata < plexus.core [DEBUG]   Imported: org.eclipse.aether.repository < plexus.core [DEBUG]   Imported: org.eclipse.aether.resolution < plexus.core [DEBUG]   Imported: org.eclipse.aether.spi < plexus.core [DEBUG]   Imported: org.eclipse.aether.transfer < plexus.core [DEBUG]   Imported: org.eclipse.aether.version < plexus.core [DEBUG]   Imported: org.slf4j.* < plexus.core [DEBUG]   Imported: org.slf4j.helpers.* < plexus.core [DEBUG]   Imported: org.slf4j.spi.* < plexus.core [DEBUG] Populating class realm maven.api [INFO] Error stacktraces are turned on. [DEBUG] Reading global settings from /usr/share/apache-maven-3.3.9/conf/settings.xml [DEBUG] Reading user settings from /home/bamboo-agent/.m2/settings.xml [DEBUG] Reading global toolchains from /usr/share/apache-maven-3.3.9/conf/toolchains.xml [DEBUG] Reading user toolchains from /home/bamboo-agent/.m2/toolchains.xml [DEBUG] Using local repository at /home/bamboo-agent/.m2/repository [DEBUG] Using manager EnhancedLocalRepositoryManager with priority 10.0 for /home/bamboo-agent/.m2/repository [INFO] Scanning for projects... [DEBUG] Extension realms for project org.openmrs.maven.plugins:openmrs-packager-maven-plugin-config-test-parent:pom:1.0.0-SNAPSHOT: (none) [DEBUG] Looking up lifecyle mappings for packaging pom from ClassRealm[plexus.core, parent: null] [DEBUG] === REACTOR BUILD PLAN ================================================ [DEBUG] Project: org.openmrs.maven.plugins:openmrs-packager-maven-plugin-config-test-parent:pom:1.0.0-SNAPSHOT [DEBUG] Tasks:   [org.apache.maven.plugins:maven-clean-plugin:clean, install] [DEBUG] Style:   Regular [DEBUG] ======================================================================= [INFO]                                                                          [INFO] ------------------------------------------------------------------------ [INFO] Building OpenMRS config parent test 1.0.0-SNAPSHOT [INFO] ------------------------------------------------------------------------ [DEBUG] Lifecycle default -> [validate, initialize, generate-sources, process-sources, generate-resources, process-resources, compile, process-classes, generate-test-sources, process-test-sources, generate-test-resources, process-test-resources, test-compile, process-test-classes, test, prepare-package, package, pre-integration-test, integration-test, post-integration-test, verify, install, deploy] [DEBUG] Lifecycle clean -> [pre-clean, clean, post-clean] [DEBUG] Lifecycle site -> [pre-site, site, post-site, site-deploy] [DEBUG] Could not find metadata org.openmrs.maven.plugins:openmrs-packager-maven-plugin:1.5.0-SNAPSHOT/maven-metadata.xml in local (/home/bamboo-agent/.m2/repository) [DEBUG] Could not find metadata org.openmrs.maven.plugins:openmrs-packager-maven-plugin:1.5.0-SNAPSHOT/maven-metadata.xml in local (/home/bamboo-agent/.m2/repository) [WARNING] The POM for org.openmrs.maven.plugins:openmrs-packager-maven-plugin:jar:1.5.0-SNAPSHOT is missing, no dependency information available [INFO] ------------------------------------------------------------------------ [INFO] BUILD FAILURE [INFO] ------------------------------------------------------------------------ [INFO] Total time: 0.180 s [INFO] Finished at: 2021-07-14T15:53:47+00:00 [INFO] Final Memory: 7M/106M [INFO] ------------------------------------------------------------------------ [ERROR] Plugin org.openmrs.maven.plugins:openmrs-packager-maven-plugin:1.5.0-SNAPSHOT or one of its dependencies could not be resolved: Could not find artifact org.openmrs.maven.plugins:openmrs-packager-maven-plugin:jar:1.5.0-SNAPSHOT -> [Help 1] org.apache.maven.plugin.PluginResolutionException: Plugin org.openmrs.maven.plugins:openmrs-packager-maven-plugin:1.5.0-SNAPSHOT or one of its dependencies could not be resolved: Could not find artifact org.openmrs.maven.plugins:openmrs-packager-maven-plugin:jar:1.5.0-SNAPSHOT  at org.apache.maven.plugin.internal.DefaultPluginDependenciesResolver.resolve(DefaultPluginDependenciesResolver.java:128)  at org.apache.maven.plugin.internal.DefaultMavenPluginManager.getPluginDescriptor(DefaultMavenPluginManager.java:179)  at org.apache.maven.plugin.internal.DefaultMavenPluginManager.getMojoDescriptor(DefaultMavenPluginManager.java:284)  at org.apache.maven.plugin.DefaultBuildPluginManager.getMojoDescriptor(DefaultBuildPluginManager.java:241)  at org.apache.maven.lifecycle.internal.DefaultLifecycleExecutionPlanCalculator.setupMojoExecution(DefaultLifecycleExecutionPlanCalculator.java:169)  at org.apache.maven.lifecycle.internal.DefaultLifecycleExecutionPlanCalculator.setupMojoExecutions(DefaultLifecycleExecutionPlanCalculator.java:155)  at org.apache.maven.lifecycle.internal.DefaultLifecycleExecutionPlanCalculator.calculateExecutionPlan(DefaultLifecycleExecutionPlanCalculator.java:131)  at org.apache.maven.lifecycle.internal.DefaultLifecycleExecutionPlanCalculator.calculateExecutionPlan(DefaultLifecycleExecutionPlanCalculator.java:145)  at org.apache.maven.lifecycle.internal.builder.BuilderCommon.resolveBuildPlan(BuilderCommon.java:96)  at org.apache.maven.lifecycle.internal.LifecycleModuleBuilder.buildProject(LifecycleModuleBuilder.java:109)  at org.apache.maven.lifecycle.internal.LifecycleModuleBuilder.buildProject(LifecycleModuleBuilder.java:80)  at org.apache.maven.lifecycle.internal.builder.singlethreaded.SingleThreadedBuilder.build(SingleThreadedBuilder.java:51)  at org.apache.maven.lifecycle.internal.LifecycleStarter.execute(LifecycleStarter.java:128)  at org.apache.maven.DefaultMaven.doExecute(DefaultMaven.java:307)  at org.apache.maven.DefaultMaven.doExecute(DefaultMaven.java:193)  at org.apache.maven.DefaultMaven.execute(DefaultMaven.java:106)  at org.apache.maven.cli.MavenCli.execute(MavenCli.java:863)  at org.apache.maven.cli.MavenCli.doMain(MavenCli.java:288)  at org.apache.maven.cli.MavenCli.main(MavenCli.java:199)  at sun.reflect.NativeMethodAccessorImpl.invoke0(Native Method)  at sun.reflect.NativeMethodAccessorImpl.invoke(NativeMethodAccessorImpl.java:62)  at sun.reflect.DelegatingMethodAccessorImpl.invoke(DelegatingMethodAccessorImpl.java:43)  at java.lang.reflect.Method.invoke(Method.java:498)  at org.codehaus.plexus.classworlds.launcher.Launcher.launchEnhanced(Launcher.java:289)  at org.codehaus.plexus.classworlds.launcher.Launcher.launch(Launcher.java:229)  at org.codehaus.plexus.classworlds.launcher.Launcher.mainWithExitCode(Launcher.java:415)  at org.codehaus.plexus.classworlds.launcher.Launcher.main(Launcher.java:356) Caused by: org.eclipse.aether.resolution.ArtifactResolutionException: Could not find artifact org.openmrs.maven.plugins:openmrs-packager-maven-plugin:jar:1.5.0-SNAPSHOT  at org.eclipse.aether.internal.impl.DefaultArtifactResolver.resolve(DefaultArtifactResolver.java:444)  at org.eclipse.aether.internal.impl.DefaultArtifactResolver.resolveArtifacts(DefaultArtifactResolver.java:246)  at org.eclipse.aether.internal.impl.DefaultArtifactResolver.resolveArtifact(DefaultArtifactResolver.java:223)  at org.eclipse.aether.internal.impl.DefaultRepositorySystem.resolveArtifact(DefaultRepositorySystem.java:294)  at org.apache.maven.plugin.internal.DefaultPluginDependenciesResolver.resolve(DefaultPluginDependenciesResolver.java:124)  ... 26 more Caused by: org.eclipse.aether.transfer.ArtifactNotFoundException: Could not find artifact org.openmrs.maven.plugins:openmrs-packager-maven-plugin:jar:1.5.0-SNAPSHOT  at org.eclipse.aether.internal.impl.DefaultArtifactResolver.resolve(DefaultArtifactResolver.java:434)  ... 30 more [ERROR]  [ERROR]  [ERROR] For more information about the errors and possible solutions, please read the following articles: [ERROR] [Help 1] http://cwiki.apache.org/confluence/display/MAVEN/PluginResolutionException 
org.apache.maven.it.VerificationException: Exit code was non-zero: 1; command line and log = 
/usr/share/apache-maven-3.3.9/bin/mvn -N -X -e --batch-mode -Dmaven.repo.local=/home/bamboo-agent/.m2/repository org.apache.maven.plugins:maven-clean-plugin:clean install
Apache Maven 3.3.9 (bb52d8502b132ec0a5a3f4c09453c07478323dc5; 2015-11-10T16:41:47+00:00)
Maven home: /usr/share/apache-maven-3.3.9
Java version: 1.8.0_292, vendor: Private Build
Java home: /usr/lib/jvm/java-8-openjdk-amd64/jre
Default locale: en_US, platform encoding: UTF-8
(180 more lines...)
org.apache.maven.it.VerificationException: Exit code was non-zero: 1; command line and log =  /usr/share/apache-maven-3.3.9/bin/mvn -N -X -e --batch-mode -Dmaven.repo.local=/home/bamboo-agent/.m2/repository org.apache.maven.plugins:maven-clean-plugin:clean install Apache Maven 3.3.9 (bb52d8502b132ec0a5a3f4c09453c07478323dc5; 2015-11-10T16:41:47+00:00) Maven home: /usr/share/apache-maven-3.3.9 Java version: 1.8.0_292, vendor: Private Build Java home: /usr/lib/jvm/java-8-openjdk-amd64/jre Default locale: en_US, platform encoding: UTF-8 OS name: "linux", version: "4.4.0-210-generic", arch: "amd64", family: "unix" [DEBUG] Created new class realm maven.api [DEBUG] Importing foreign packages into class realm maven.api [DEBUG]   Imported: javax.enterprise.inject.* < plexus.core [DEBUG]   Imported: javax.enterprise.util.* < plexus.core [DEBUG]   Imported: javax.inject.* < plexus.core [DEBUG]   Imported: org.apache.maven.* < plexus.core [DEBUG]   Imported: org.apache.maven.artifact < plexus.core [DEBUG]   Imported: org.apache.maven.classrealm < plexus.core [DEBUG]   Imported: org.apache.maven.cli < plexus.core [DEBUG]   Imported: org.apache.maven.configuration < plexus.core [DEBUG]   Imported: org.apache.maven.exception < plexus.core [DEBUG]   Imported: org.apache.maven.execution < plexus.core [DEBUG]   Imported: org.apache.maven.execution.scope < plexus.core [DEBUG]   Imported: org.apache.maven.lifecycle < plexus.core [DEBUG]   Imported: org.apache.maven.model < plexus.core [DEBUG]   Imported: org.apache.maven.monitor < plexus.core [DEBUG]   Imported: org.apache.maven.plugin < plexus.core [DEBUG]   Imported: org.apache.maven.profiles < plexus.core [DEBUG]   Imported: org.apache.maven.project < plexus.core [DEBUG]   Imported: org.apache.maven.reporting < plexus.core [DEBUG]   Imported: org.apache.maven.repository < plexus.core [DEBUG]   Imported: org.apache.maven.rtinfo < plexus.core [DEBUG]   Imported: org.apache.maven.settings < plexus.core [DEBUG]   Imported: org.apache.maven.toolchain < plexus.core [DEBUG]   Imported: org.apache.maven.usability < plexus.core [DEBUG]   Imported: org.apache.maven.wagon.* < plexus.core [DEBUG]   Imported: org.apache.maven.wagon.authentication < plexus.core [DEBUG]   Imported: org.apache.maven.wagon.authorization < plexus.core [DEBUG]   Imported: org.apache.maven.wagon.events < plexus.core [DEBUG]   Imported: org.apache.maven.wagon.observers < plexus.core [DEBUG]   Imported: org.apache.maven.wagon.proxy < plexus.core [DEBUG]   Imported: org.apache.maven.wagon.repository < plexus.core [DEBUG]   Imported: org.apache.maven.wagon.resource < plexus.core [DEBUG]   Imported: org.codehaus.classworlds < plexus.core [DEBUG]   Imported: org.codehaus.plexus.* < plexus.core [DEBUG]   Imported: org.codehaus.plexus.classworlds < plexus.core [DEBUG]   Imported: org.codehaus.plexus.component < plexus.core [DEBUG]   Imported: org.codehaus.plexus.configuration < plexus.core [DEBUG]   Imported: org.codehaus.plexus.container < plexus.core [DEBUG]   Imported: org.codehaus.plexus.context < plexus.core [DEBUG]   Imported: org.codehaus.plexus.lifecycle < plexus.core [DEBUG]   Imported: org.codehaus.plexus.logging < plexus.core [DEBUG]   Imported: org.codehaus.plexus.personality < plexus.core [DEBUG]   Imported: org.codehaus.plexus.util.xml.Xpp3Dom < plexus.core [DEBUG]   Imported: org.codehaus.plexus.util.xml.pull.XmlPullParser < plexus.core [DEBUG]   Imported: org.codehaus.plexus.util.xml.pull.XmlPullParserException < plexus.core [DEBUG]   Imported: org.codehaus.plexus.util.xml.pull.XmlSerializer < plexus.core [DEBUG]   Imported: org.eclipse.aether.* < plexus.core [DEBUG]   Imported: org.eclipse.aether.artifact < plexus.core [DEBUG]   Imported: org.eclipse.aether.collection < plexus.core [DEBUG]   Imported: org.eclipse.aether.deployment < plexus.core [DEBUG]   Imported: org.eclipse.aether.graph < plexus.core [DEBUG]   Imported: org.eclipse.aether.impl < plexus.core [DEBUG]   Imported: org.eclipse.aether.installation < plexus.core [DEBUG]   Imported: org.eclipse.aether.internal.impl < plexus.core [DEBUG]   Imported: org.eclipse.aether.metadata < plexus.core [DEBUG]   Imported: org.eclipse.aether.repository < plexus.core [DEBUG]   Imported: org.eclipse.aether.resolution < plexus.core [DEBUG]   Imported: org.eclipse.aether.spi < plexus.core [DEBUG]   Imported: org.eclipse.aether.transfer < plexus.core [DEBUG]   Imported: org.eclipse.aether.version < plexus.core [DEBUG]   Imported: org.slf4j.* < plexus.core [DEBUG]   Imported: org.slf4j.helpers.* < plexus.core [DEBUG]   Imported: org.slf4j.spi.* < plexus.core [DEBUG] Populating class realm maven.api [INFO] Error stacktraces are turned on. [DEBUG] Reading global settings from /usr/share/apache-maven-3.3.9/conf/settings.xml [DEBUG] Reading user settings from /home/bamboo-agent/.m2/settings.xml [DEBUG] Reading global toolchains from /usr/share/apache-maven-3.3.9/conf/toolchains.xml [DEBUG] Reading user toolchains from /home/bamboo-agent/.m2/toolchains.xml [DEBUG] Using local repository at /home/bamboo-agent/.m2/repository [DEBUG] Using manager EnhancedLocalRepositoryManager with priority 10.0 for /home/bamboo-agent/.m2/repository [INFO] Scanning for projects... [DEBUG] Extension realms for project org.openmrs.maven.plugins:openmrs-packager-maven-plugin-config-test-parent:pom:1.0.0-SNAPSHOT: (none) [DEBUG] Looking up lifecyle mappings for packaging pom from ClassRealm[plexus.core, parent: null] [DEBUG] === REACTOR BUILD PLAN ================================================ [DEBUG] Project: org.openmrs.maven.plugins:openmrs-packager-maven-plugin-config-test-parent:pom:1.0.0-SNAPSHOT [DEBUG] Tasks:   [org.apache.maven.plugins:maven-clean-plugin:clean, install] [DEBUG] Style:   Regular [DEBUG] ======================================================================= [INFO]                                                                          [INFO] ------------------------------------------------------------------------ [INFO] Building OpenMRS config parent test 1.0.0-SNAPSHOT [INFO] ------------------------------------------------------------------------ [DEBUG] Lifecycle default -> [validate, initialize, generate-sources, process-sources, generate-resources, process-resources, compile, process-classes, generate-test-sources, process-test-sources, generate-test-resources, process-test-resources, test-compile, process-test-classes, test, prepare-package, package, pre-integration-test, integration-test, post-integration-test, verify, install, deploy] [DEBUG] Lifecycle clean -> [pre-clean, clean, post-clean] [DEBUG] Lifecycle site -> [pre-site, site, post-site, site-deploy] [DEBUG] Could not find metadata org.openmrs.maven.plugins:openmrs-packager-maven-plugin:1.5.0-SNAPSHOT/maven-metadata.xml in local (/home/bamboo-agent/.m2/repository) [DEBUG] Could not find metadata org.openmrs.maven.plugins:openmrs-packager-maven-plugin:1.5.0-SNAPSHOT/maven-metadata.xml in local (/home/bamboo-agent/.m2/repository) [WARNING] The POM for org.openmrs.maven.plugins:openmrs-packager-maven-plugin:jar:1.5.0-SNAPSHOT is missing, no dependency information available [INFO] ------------------------------------------------------------------------ [INFO] BUILD FAILURE [INFO] ------------------------------------------------------------------------ [INFO] Total time: 0.147 s [INFO] Finished at: 2021-07-14T15:53:44+00:00 [INFO] Final Memory: 7M/106M [INFO] ------------------------------------------------------------------------ [ERROR] Plugin org.openmrs.maven.plugins:openmrs-packager-maven-plugin:1.5.0-SNAPSHOT or one of its dependencies could not be resolved: Could not find artifact org.openmrs.maven.plugins:openmrs-packager-maven-plugin:jar:1.5.0-SNAPSHOT -> [Help 1] org.apache.maven.plugin.PluginResolutionException: Plugin org.openmrs.maven.plugins:openmrs-packager-maven-plugin:1.5.0-SNAPSHOT or one of its dependencies could not be resolved: Could not find artifact org.openmrs.maven.plugins:openmrs-packager-maven-plugin:jar:1.5.0-SNAPSHOT  at org.apache.maven.plugin.internal.DefaultPluginDependenciesResolver.resolve(DefaultPluginDependenciesResolver.java:128)  at org.apache.maven.plugin.internal.DefaultMavenPluginManager.getPluginDescriptor(DefaultMavenPluginManager.java:179)  at org.apache.maven.plugin.internal.DefaultMavenPluginManager.getMojoDescriptor(DefaultMavenPluginManager.java:284)  at org.apache.maven.plugin.DefaultBuildPluginManager.getMojoDescriptor(DefaultBuildPluginManager.java:241)  at org.apache.maven.lifecycle.internal.DefaultLifecycleExecutionPlanCalculator.setupMojoExecution(DefaultLifecycleExecutionPlanCalculator.java:169)  at org.apache.maven.lifecycle.internal.DefaultLifecycleExecutionPlanCalculator.setupMojoExecutions(DefaultLifecycleExecutionPlanCalculator.java:155)  at org.apache.maven.lifecycle.internal.DefaultLifecycleExecutionPlanCalculator.calculateExecutionPlan(DefaultLifecycleExecutionPlanCalculator.java:131)  at org.apache.maven.lifecycle.internal.DefaultLifecycleExecutionPlanCalculator.calculateExecutionPlan(DefaultLifecycleExecutionPlanCalculator.java:145)  at org.apache.maven.lifecycle.internal.builder.BuilderCommon.resolveBuildPlan(BuilderCommon.java:96)  at org.apache.maven.lifecycle.internal.LifecycleModuleBuilder.buildProject(LifecycleModuleBuilder.java:109)  at org.apache.maven.lifecycle.internal.LifecycleModuleBuilder.buildProject(LifecycleModuleBuilder.java:80)  at org.apache.maven.lifecycle.internal.builder.singlethreaded.SingleThreadedBuilder.build(SingleThreadedBuilder.java:51)  at org.apache.maven.lifecycle.internal.LifecycleStarter.execute(LifecycleStarter.java:128)  at org.apache.maven.DefaultMaven.doExecute(DefaultMaven.java:307)  at org.apache.maven.DefaultMaven.doExecute(DefaultMaven.java:193)  at org.apache.maven.DefaultMaven.execute(DefaultMaven.java:106)  at org.apache.maven.cli.MavenCli.execute(MavenCli.java:863)  at org.apache.maven.cli.MavenCli.doMain(MavenCli.java:288)  at org.apache.maven.cli.MavenCli.main(MavenCli.java:199)  at sun.reflect.NativeMethodAccessorImpl.invoke0(Native Method)  at sun.reflect.NativeMethodAccessorImpl.invoke(NativeMethodAccessorImpl.java:62)  at sun.reflect.DelegatingMethodAccessorImpl.invoke(DelegatingMethodAccessorImpl.java:43)  at java.lang.reflect.Method.invoke(Method.java:498)  at org.codehaus.plexus.classworlds.launcher.Launcher.launchEnhanced(Launcher.java:289)  at org.codehaus.plexus.classworlds.launcher.Launcher.launch(Launcher.java:229)  at org.codehaus.plexus.classworlds.launcher.Launcher.mainWithExitCode(Launcher.java:415)  at org.codehaus.plexus.classworlds.launcher.Launcher.main(Launcher.java:356) Caused by: org.eclipse.aether.resolution.ArtifactResolutionException: Could not find artifact org.openmrs.maven.plugins:openmrs-packager-maven-plugin:jar:1.5.0-SNAPSHOT  at org.eclipse.aether.internal.impl.DefaultArtifactResolver.resolve(DefaultArtifactResolver.java:444)  at org.eclipse.aether.internal.impl.DefaultArtifactResolver.resolveArtifacts(DefaultArtifactResolver.java:246)  at org.eclipse.aether.internal.impl.DefaultArtifactResolver.resolveArtifact(DefaultArtifactResolver.java:223)  at org.eclipse.aether.internal.impl.DefaultRepositorySystem.resolveArtifact(DefaultRepositorySystem.java:294)  at org.apache.maven.plugin.internal.DefaultPluginDependenciesResolver.resolve(DefaultPluginDependenciesResolver.java:124)  ... 26 more Caused by: org.eclipse.aether.transfer.ArtifactNotFoundException: Could not find artifact org.openmrs.maven.plugins:openmrs-packager-maven-plugin:jar:1.5.0-SNAPSHOT  at org.eclipse.aether.internal.impl.DefaultArtifactResolver.resolve(DefaultArtifactResolver.java:434)  ... 30 more [ERROR]  [ERROR]  [ERROR] For more information about the errors and possible solutions, please read the following articles: [ERROR] [Help 1] http://cwiki.apache.org/confluence/display/MAVEN/PluginResolutionException 
org.apache.maven.it.VerificationException: Exit code was non-zero: 1; command line and log = 
/usr/share/apache-maven-3.3.9/bin/mvn -N -X -e --batch-mode -Dmaven.repo.local=/home/bamboo-agent/.m2/repository org.apache.maven.plugins:maven-clean-plugin:clean install
Apache Maven 3.3.9 (bb52d8502b132ec0a5a3f4c09453c07478323dc5; 2015-11-10T16:41:47+00:00)
Maven home: /usr/share/apache-maven-3.3.9
Java version: 1.8.0_292, vendor: Private Build
Java home: /usr/lib/jvm/java-8-openjdk-amd64/jre
Default locale: en_US, platform encoding: UTF-8
(180 more lines...)
org.apache.maven.it.VerificationException: Exit code was non-zero: 1; command line and log =  /usr/share/apache-maven-3.3.9/bin/mvn -N -X -e --batch-mode -Dmaven.repo.local=/home/bamboo-agent/.m2/repository org.apache.maven.plugins:maven-clean-plugin:clean install Apache Maven 3.3.9 (bb52d8502b132ec0a5a3f4c09453c07478323dc5; 2015-11-10T16:41:47+00:00) Maven home: /usr/share/apache-maven-3.3.9 Java version: 1.8.0_292, vendor: Private Build Java home: /usr/lib/jvm/java-8-openjdk-amd64/jre Default locale: en_US, platform encoding: UTF-8 OS name: "linux", version: "4.4.0-210-generic", arch: "amd64", family: "unix" [DEBUG] Created new class realm maven.api [DEBUG] Importing foreign packages into class realm maven.api [DEBUG]   Imported: javax.enterprise.inject.* < plexus.core [DEBUG]   Imported: javax.enterprise.util.* < plexus.core [DEBUG]   Imported: javax.inject.* < plexus.core [DEBUG]   Imported: org.apache.maven.* < plexus.core [DEBUG]   Imported: org.apache.maven.artifact < plexus.core [DEBUG]   Imported: org.apache.maven.classrealm < plexus.core [DEBUG]   Imported: org.apache.maven.cli < plexus.core [DEBUG]   Imported: org.apache.maven.configuration < plexus.core [DEBUG]   Imported: org.apache.maven.exception < plexus.core [DEBUG]   Imported: org.apache.maven.execution < plexus.core [DEBUG]   Imported: org.apache.maven.execution.scope < plexus.core [DEBUG]   Imported: org.apache.maven.lifecycle < plexus.core [DEBUG]   Imported: org.apache.maven.model < plexus.core [DEBUG]   Imported: org.apache.maven.monitor < plexus.core [DEBUG]   Imported: org.apache.maven.plugin < plexus.core [DEBUG]   Imported: org.apache.maven.profiles < plexus.core [DEBUG]   Imported: org.apache.maven.project < plexus.core [DEBUG]   Imported: org.apache.maven.reporting < plexus.core [DEBUG]   Imported: org.apache.maven.repository < plexus.core [DEBUG]   Imported: org.apache.maven.rtinfo < plexus.core [DEBUG]   Imported: org.apache.maven.settings < plexus.core [DEBUG]   Imported: org.apache.maven.toolchain < plexus.core [DEBUG]   Imported: org.apache.maven.usability < plexus.core [DEBUG]   Imported: org.apache.maven.wagon.* < plexus.core [DEBUG]   Imported: org.apache.maven.wagon.authentication < plexus.core [DEBUG]   Imported: org.apache.maven.wagon.authorization < plexus.core [DEBUG]   Imported: org.apache.maven.wagon.events < plexus.core [DEBUG]   Imported: org.apache.maven.wagon.observers < plexus.core [DEBUG]   Imported: org.apache.maven.wagon.proxy < plexus.core [DEBUG]   Imported: org.apache.maven.wagon.repository < plexus.core [DEBUG]   Imported: org.apache.maven.wagon.resource < plexus.core [DEBUG]   Imported: org.codehaus.classworlds < plexus.core [DEBUG]   Imported: org.codehaus.plexus.* < plexus.core [DEBUG]   Imported: org.codehaus.plexus.classworlds < plexus.core [DEBUG]   Imported: org.codehaus.plexus.component < plexus.core [DEBUG]   Imported: org.codehaus.plexus.configuration < plexus.core [DEBUG]   Imported: org.codehaus.plexus.container < plexus.core [DEBUG]   Imported: org.codehaus.plexus.context < plexus.core [DEBUG]   Imported: org.codehaus.plexus.lifecycle < plexus.core [DEBUG]   Imported: org.codehaus.plexus.logging < plexus.core [DEBUG]   Imported: org.codehaus.plexus.personality < plexus.core [DEBUG]   Imported: org.codehaus.plexus.util.xml.Xpp3Dom < plexus.core [DEBUG]   Imported: org.codehaus.plexus.util.xml.pull.XmlPullParser < plexus.core [DEBUG]   Imported: org.codehaus.plexus.util.xml.pull.XmlPullParserException < plexus.core [DEBUG]   Imported: org.codehaus.plexus.util.xml.pull.XmlSerializer < plexus.core [DEBUG]   Imported: org.eclipse.aether.* < plexus.core [DEBUG]   Imported: org.eclipse.aether.artifact < plexus.core [DEBUG]   Imported: org.eclipse.aether.collection < plexus.core [DEBUG]   Imported: org.eclipse.aether.deployment < plexus.core [DEBUG]   Imported: org.eclipse.aether.graph < plexus.core [DEBUG]   Imported: org.eclipse.aether.impl < plexus.core [DEBUG]   Imported: org.eclipse.aether.installation < plexus.core [DEBUG]   Imported: org.eclipse.aether.internal.impl < plexus.core [DEBUG]   Imported: org.eclipse.aether.metadata < plexus.core [DEBUG]   Imported: org.eclipse.aether.repository < plexus.core [DEBUG]   Imported: org.eclipse.aether.resolution < plexus.core [DEBUG]   Imported: org.eclipse.aether.spi < plexus.core [DEBUG]   Imported: org.eclipse.aether.transfer < plexus.core [DEBUG]   Imported: org.eclipse.aether.version < plexus.core [DEBUG]   Imported: org.slf4j.* < plexus.core [DEBUG]   Imported: org.slf4j.helpers.* < plexus.core [DEBUG]   Imported: org.slf4j.spi.* < plexus.core [DEBUG] Populating class realm maven.api [INFO] Error stacktraces are turned on. [DEBUG] Reading global settings from /usr/share/apache-maven-3.3.9/conf/settings.xml [DEBUG] Reading user settings from /home/bamboo-agent/.m2/settings.xml [DEBUG] Reading global toolchains from /usr/share/apache-maven-3.3.9/conf/toolchains.xml [DEBUG] Reading user toolchains from /home/bamboo-agent/.m2/toolchains.xml [DEBUG] Using local repository at /home/bamboo-agent/.m2/repository [DEBUG] Using manager EnhancedLocalRepositoryManager with priority 10.0 for /home/bamboo-agent/.m2/repository [INFO] Scanning for projects... [DEBUG] Extension realms for project org.openmrs.maven.plugins:openmrs-packager-maven-plugin-config-test-parent:pom:1.0.0-SNAPSHOT: (none) [DEBUG] Looking up lifecyle mappings for packaging pom from ClassRealm[plexus.core, parent: null] [DEBUG] === REACTOR BUILD PLAN ================================================ [DEBUG] Project: org.openmrs.maven.plugins:openmrs-packager-maven-plugin-config-test-parent:pom:1.0.0-SNAPSHOT [DEBUG] Tasks:   [org.apache.maven.plugins:maven-clean-plugin:clean, install] [DEBUG] Style:   Regular [DEBUG] ======================================================================= [INFO]                                                                          [INFO] ------------------------------------------------------------------------ [INFO] Building OpenMRS config parent test 1.0.0-SNAPSHOT [INFO] ------------------------------------------------------------------------ [DEBUG] Lifecycle default -> [validate, initialize, generate-sources, process-sources, generate-resources, process-resources, compile, process-classes, generate-test-sources, process-test-sources, generate-test-resources, process-test-resources, test-compile, process-test-classes, test, prepare-package, package, pre-integration-test, integration-test, post-integration-test, verify, install, deploy] [DEBUG] Lifecycle clean -> [pre-clean, clean, post-clean] [DEBUG] Lifecycle site -> [pre-site, site, post-site, site-deploy] [DEBUG] Could not find metadata org.openmrs.maven.plugins:openmrs-packager-maven-plugin:1.5.0-SNAPSHOT/maven-metadata.xml in local (/home/bamboo-agent/.m2/repository) [DEBUG] Could not find metadata org.openmrs.maven.plugins:openmrs-packager-maven-plugin:1.5.0-SNAPSHOT/maven-metadata.xml in local (/home/bamboo-agent/.m2/repository) [WARNING] The POM for org.openmrs.maven.plugins:openmrs-packager-maven-plugin:jar:1.5.0-SNAPSHOT is missing, no dependency information available [INFO] ------------------------------------------------------------------------ [INFO] BUILD FAILURE [INFO] ------------------------------------------------------------------------ [INFO] Total time: 0.148 s [INFO] Finished at: 2021-07-14T15:53:38+00:00 [INFO] Final Memory: 7M/106M [INFO] ------------------------------------------------------------------------ [ERROR] Plugin org.openmrs.maven.plugins:openmrs-packager-maven-plugin:1.5.0-SNAPSHOT or one of its dependencies could not be resolved: Could not find artifact org.openmrs.maven.plugins:openmrs-packager-maven-plugin:jar:1.5.0-SNAPSHOT -> [Help 1] org.apache.maven.plugin.PluginResolutionException: Plugin org.openmrs.maven.plugins:openmrs-packager-maven-plugin:1.5.0-SNAPSHOT or one of its dependencies could not be resolved: Could not find artifact org.openmrs.maven.plugins:openmrs-packager-maven-plugin:jar:1.5.0-SNAPSHOT  at org.apache.maven.plugin.internal.DefaultPluginDependenciesResolver.resolve(DefaultPluginDependenciesResolver.java:128)  at org.apache.maven.plugin.internal.DefaultMavenPluginManager.getPluginDescriptor(DefaultMavenPluginManager.java:179)  at org.apache.maven.plugin.internal.DefaultMavenPluginManager.getMojoDescriptor(DefaultMavenPluginManager.java:284)  at org.apache.maven.plugin.DefaultBuildPluginManager.getMojoDescriptor(DefaultBuildPluginManager.java:241)  at org.apache.maven.lifecycle.internal.DefaultLifecycleExecutionPlanCalculator.setupMojoExecution(DefaultLifecycleExecutionPlanCalculator.java:169)  at org.apache.maven.lifecycle.internal.DefaultLifecycleExecutionPlanCalculator.setupMojoExecutions(DefaultLifecycleExecutionPlanCalculator.java:155)  at org.apache.maven.lifecycle.internal.DefaultLifecycleExecutionPlanCalculator.calculateExecutionPlan(DefaultLifecycleExecutionPlanCalculator.java:131)  at org.apache.maven.lifecycle.internal.DefaultLifecycleExecutionPlanCalculator.calculateExecutionPlan(DefaultLifecycleExecutionPlanCalculator.java:145)  at org.apache.maven.lifecycle.internal.builder.BuilderCommon.resolveBuildPlan(BuilderCommon.java:96)  at org.apache.maven.lifecycle.internal.LifecycleModuleBuilder.buildProject(LifecycleModuleBuilder.java:109)  at org.apache.maven.lifecycle.internal.LifecycleModuleBuilder.buildProject(LifecycleModuleBuilder.java:80)  at org.apache.maven.lifecycle.internal.builder.singlethreaded.SingleThreadedBuilder.build(SingleThreadedBuilder.java:51)  at org.apache.maven.lifecycle.internal.LifecycleStarter.execute(LifecycleStarter.java:128)  at org.apache.maven.DefaultMaven.doExecute(DefaultMaven.java:307)  at org.apache.maven.DefaultMaven.doExecute(DefaultMaven.java:193)  at org.apache.maven.DefaultMaven.execute(DefaultMaven.java:106)  at org.apache.maven.cli.MavenCli.execute(MavenCli.java:863)  at org.apache.maven.cli.MavenCli.doMain(MavenCli.java:288)  at org.apache.maven.cli.MavenCli.main(MavenCli.java:199)  at sun.reflect.NativeMethodAccessorImpl.invoke0(Native Method)  at sun.reflect.NativeMethodAccessorImpl.invoke(NativeMethodAccessorImpl.java:62)  at sun.reflect.DelegatingMethodAccessorImpl.invoke(DelegatingMethodAccessorImpl.java:43)  at java.lang.reflect.Method.invoke(Method.java:498)  at org.codehaus.plexus.classworlds.launcher.Launcher.launchEnhanced(Launcher.java:289)  at org.codehaus.plexus.classworlds.launcher.Launcher.launch(Launcher.java:229)  at org.codehaus.plexus.classworlds.launcher.Launcher.mainWithExitCode(Launcher.java:415)  at org.codehaus.plexus.classworlds.launcher.Launcher.main(Launcher.java:356) Caused by: org.eclipse.aether.resolution.ArtifactResolutionException: Could not find artifact org.openmrs.maven.plugins:openmrs-packager-maven-plugin:jar:1.5.0-SNAPSHOT  at org.eclipse.aether.internal.impl.DefaultArtifactResolver.resolve(DefaultArtifactResolver.java:444)  at org.eclipse.aether.internal.impl.DefaultArtifactResolver.resolveArtifacts(DefaultArtifactResolver.java:246)  at org.eclipse.aether.internal.impl.DefaultArtifactResolver.resolveArtifact(DefaultArtifactResolver.java:223)  at org.eclipse.aether.internal.impl.DefaultRepositorySystem.resolveArtifact(DefaultRepositorySystem.java:294)  at org.apache.maven.plugin.internal.DefaultPluginDependenciesResolver.resolve(DefaultPluginDependenciesResolver.java:124)  ... 26 more Caused by: org.eclipse.aether.transfer.ArtifactNotFoundException: Could not find artifact org.openmrs.maven.plugins:openmrs-packager-maven-plugin:jar:1.5.0-SNAPSHOT  at org.eclipse.aether.internal.impl.DefaultArtifactResolver.resolve(DefaultArtifactResolver.java:434)  ... 30 more [ERROR]  [ERROR]  [ERROR] For more information about the errors and possible solutions, please read the following articles: [ERROR] [Help 1] http://cwiki.apache.org/confluence/display/MAVEN/PluginResolutionException 
org.apache.maven.it.VerificationException: Exit code was non-zero: 1; command line and log = 
/usr/share/apache-maven-3.3.9/bin/mvn -N -X -e --batch-mode -Dmaven.repo.local=/home/bamboo-agent/.m2/repository org.apache.maven.plugins:maven-clean-plugin:clean install
Apache Maven 3.3.9 (bb52d8502b132ec0a5a3f4c09453c07478323dc5; 2015-11-10T16:41:47+00:00)
Maven home: /usr/share/apache-maven-3.3.9
Java version: 1.8.0_292, vendor: Private Build
Java home: /usr/lib/jvm/java-8-openjdk-amd64/jre
Default locale: en_US, platform encoding: UTF-8
(180 more lines...)
org.apache.maven.it.VerificationException: Exit code was non-zero: 1; command line and log =  /usr/share/apache-maven-3.3.9/bin/mvn -N -X -e --batch-mode -Dmaven.repo.local=/home/bamboo-agent/.m2/repository org.apache.maven.plugins:maven-clean-plugin:clean install Apache Maven 3.3.9 (bb52d8502b132ec0a5a3f4c09453c07478323dc5; 2015-11-10T16:41:47+00:00) Maven home: /usr/share/apache-maven-3.3.9 Java version: 1.8.0_292, vendor: Private Build Java home: /usr/lib/jvm/java-8-openjdk-amd64/jre Default locale: en_US, platform encoding: UTF-8 OS name: "linux", version: "4.4.0-210-generic", arch: "amd64", family: "unix" [DEBUG] Created new class realm maven.api [DEBUG] Importing foreign packages into class realm maven.api [DEBUG]   Imported: javax.enterprise.inject.* < plexus.core [DEBUG]   Imported: javax.enterprise.util.* < plexus.core [DEBUG]   Imported: javax.inject.* < plexus.core [DEBUG]   Imported: org.apache.maven.* < plexus.core [DEBUG]   Imported: org.apache.maven.artifact < plexus.core [DEBUG]   Imported: org.apache.maven.classrealm < plexus.core [DEBUG]   Imported: org.apache.maven.cli < plexus.core [DEBUG]   Imported: org.apache.maven.configuration < plexus.core [DEBUG]   Imported: org.apache.maven.exception < plexus.core [DEBUG]   Imported: org.apache.maven.execution < plexus.core [DEBUG]   Imported: org.apache.maven.execution.scope < plexus.core [DEBUG]   Imported: org.apache.maven.lifecycle < plexus.core [DEBUG]   Imported: org.apache.maven.model < plexus.core [DEBUG]   Imported: org.apache.maven.monitor < plexus.core [DEBUG]   Imported: org.apache.maven.plugin < plexus.core [DEBUG]   Imported: org.apache.maven.profiles < plexus.core [DEBUG]   Imported: org.apache.maven.project < plexus.core [DEBUG]   Imported: org.apache.maven.reporting < plexus.core [DEBUG]   Imported: org.apache.maven.repository < plexus.core [DEBUG]   Imported: org.apache.maven.rtinfo < plexus.core [DEBUG]   Imported: org.apache.maven.settings < plexus.core [DEBUG]   Imported: org.apache.maven.toolchain < plexus.core [DEBUG]   Imported: org.apache.maven.usability < plexus.core [DEBUG]   Imported: org.apache.maven.wagon.* < plexus.core [DEBUG]   Imported: org.apache.maven.wagon.authentication < plexus.core [DEBUG]   Imported: org.apache.maven.wagon.authorization < plexus.core [DEBUG]   Imported: org.apache.maven.wagon.events < plexus.core [DEBUG]   Imported: org.apache.maven.wagon.observers < plexus.core [DEBUG]   Imported: org.apache.maven.wagon.proxy < plexus.core [DEBUG]   Imported: org.apache.maven.wagon.repository < plexus.core [DEBUG]   Imported: org.apache.maven.wagon.resource < plexus.core [DEBUG]   Imported: org.codehaus.classworlds < plexus.core [DEBUG]   Imported: org.codehaus.plexus.* < plexus.core [DEBUG]   Imported: org.codehaus.plexus.classworlds < plexus.core [DEBUG]   Imported: org.codehaus.plexus.component < plexus.core [DEBUG]   Imported: org.codehaus.plexus.configuration < plexus.core [DEBUG]   Imported: org.codehaus.plexus.container < plexus.core [DEBUG]   Imported: org.codehaus.plexus.context < plexus.core [DEBUG]   Imported: org.codehaus.plexus.lifecycle < plexus.core [DEBUG]   Imported: org.codehaus.plexus.logging < plexus.core [DEBUG]   Imported: org.codehaus.plexus.personality < plexus.core [DEBUG]   Imported: org.codehaus.plexus.util.xml.Xpp3Dom < plexus.core [DEBUG]   Imported: org.codehaus.plexus.util.xml.pull.XmlPullParser < plexus.core [DEBUG]   Imported: org.codehaus.plexus.util.xml.pull.XmlPullParserException < plexus.core [DEBUG]   Imported: org.codehaus.plexus.util.xml.pull.XmlSerializer < plexus.core [DEBUG]   Imported: org.eclipse.aether.* < plexus.core [DEBUG]   Imported: org.eclipse.aether.artifact < plexus.core [DEBUG]   Imported: org.eclipse.aether.collection < plexus.core [DEBUG]   Imported: org.eclipse.aether.deployment < plexus.core [DEBUG]   Imported: org.eclipse.aether.graph < plexus.core [DEBUG]   Imported: org.eclipse.aether.impl < plexus.core [DEBUG]   Imported: org.eclipse.aether.installation < plexus.core [DEBUG]   Imported: org.eclipse.aether.internal.impl < plexus.core [DEBUG]   Imported: org.eclipse.aether.metadata < plexus.core [DEBUG]   Imported: org.eclipse.aether.repository < plexus.core [DEBUG]   Imported: org.eclipse.aether.resolution < plexus.core [DEBUG]   Imported: org.eclipse.aether.spi < plexus.core [DEBUG]   Imported: org.eclipse.aether.transfer < plexus.core [DEBUG]   Imported: org.eclipse.aether.version < plexus.core [DEBUG]   Imported: org.slf4j.* < plexus.core [DEBUG]   Imported: org.slf4j.helpers.* < plexus.core [DEBUG]   Imported: org.slf4j.spi.* < plexus.core [DEBUG] Populating class realm maven.api [INFO] Error stacktraces are turned on. [DEBUG] Reading global settings from /usr/share/apache-maven-3.3.9/conf/settings.xml [DEBUG] Reading user settings from /home/bamboo-agent/.m2/settings.xml [DEBUG] Reading global toolchains from /usr/share/apache-maven-3.3.9/conf/toolchains.xml [DEBUG] Reading user toolchains from /home/bamboo-agent/.m2/toolchains.xml [DEBUG] Using local repository at /home/bamboo-agent/.m2/repository [DEBUG] Using manager EnhancedLocalRepositoryManager with priority 10.0 for /home/bamboo-agent/.m2/repository [INFO] Scanning for projects... [DEBUG] Extension realms for project org.openmrs.maven.plugins:openmrs-packager-maven-plugin-config-test-parent:pom:1.0.0-SNAPSHOT: (none) [DEBUG] Looking up lifecyle mappings for packaging pom from ClassRealm[plexus.core, parent: null] [DEBUG] === REACTOR BUILD PLAN ================================================ [DEBUG] Project: org.openmrs.maven.plugins:openmrs-packager-maven-plugin-config-test-parent:pom:1.0.0-SNAPSHOT [DEBUG] Tasks:   [org.apache.maven.plugins:maven-clean-plugin:clean, install] [DEBUG] Style:   Regular [DEBUG] ======================================================================= [INFO]                                                                          [INFO] ------------------------------------------------------------------------ [INFO] Building OpenMRS config parent test 1.0.0-SNAPSHOT [INFO] ------------------------------------------------------------------------ [DEBUG] Lifecycle default -> [validate, initialize, generate-sources, process-sources, generate-resources, process-resources, compile, process-classes, generate-test-sources, process-test-sources, generate-test-resources, process-test-resources, test-compile, process-test-classes, test, prepare-package, package, pre-integration-test, integration-test, post-integration-test, verify, install, deploy] [DEBUG] Lifecycle clean -> [pre-clean, clean, post-clean] [DEBUG] Lifecycle site -> [pre-site, site, post-site, site-deploy] [DEBUG] Could not find metadata org.openmrs.maven.plugins:openmrs-packager-maven-plugin:1.5.0-SNAPSHOT/maven-metadata.xml in local (/home/bamboo-agent/.m2/repository) [DEBUG] Could not find metadata org.openmrs.maven.plugins:openmrs-packager-maven-plugin:1.5.0-SNAPSHOT/maven-metadata.xml in local (/home/bamboo-agent/.m2/repository) [WARNING] The POM for org.openmrs.maven.plugins:openmrs-packager-maven-plugin:jar:1.5.0-SNAPSHOT is missing, no dependency information available [INFO] ------------------------------------------------------------------------ [INFO] BUILD FAILURE [INFO] ------------------------------------------------------------------------ [INFO] Total time: 0.172 s [INFO] Finished at: 2021-07-14T15:53:31+00:00 [INFO] Final Memory: 7M/106M [INFO] ------------------------------------------------------------------------ [ERROR] Plugin org.openmrs.maven.plugins:openmrs-packager-maven-plugin:1.5.0-SNAPSHOT or one of its dependencies could not be resolved: Could not find artifact org.openmrs.maven.plugins:openmrs-packager-maven-plugin:jar:1.5.0-SNAPSHOT -> [Help 1] org.apache.maven.plugin.PluginResolutionException: Plugin org.openmrs.maven.plugins:openmrs-packager-maven-plugin:1.5.0-SNAPSHOT or one of its dependencies could not be resolved: Could not find artifact org.openmrs.maven.plugins:openmrs-packager-maven-plugin:jar:1.5.0-SNAPSHOT  at org.apache.maven.plugin.internal.DefaultPluginDependenciesResolver.resolve(DefaultPluginDependenciesResolver.java:128)  at org.apache.maven.plugin.internal.DefaultMavenPluginManager.getPluginDescriptor(DefaultMavenPluginManager.java:179)  at org.apache.maven.plugin.internal.DefaultMavenPluginManager.getMojoDescriptor(DefaultMavenPluginManager.java:284)  at org.apache.maven.plugin.DefaultBuildPluginManager.getMojoDescriptor(DefaultBuildPluginManager.java:241)  at org.apache.maven.lifecycle.internal.DefaultLifecycleExecutionPlanCalculator.setupMojoExecution(DefaultLifecycleExecutionPlanCalculator.java:169)  at org.apache.maven.lifecycle.internal.DefaultLifecycleExecutionPlanCalculator.setupMojoExecutions(DefaultLifecycleExecutionPlanCalculator.java:155)  at org.apache.maven.lifecycle.internal.DefaultLifecycleExecutionPlanCalculator.calculateExecutionPlan(DefaultLifecycleExecutionPlanCalculator.java:131)  at org.apache.maven.lifecycle.internal.DefaultLifecycleExecutionPlanCalculator.calculateExecutionPlan(DefaultLifecycleExecutionPlanCalculator.java:145)  at org.apache.maven.lifecycle.internal.builder.BuilderCommon.resolveBuildPlan(BuilderCommon.java:96)  at org.apache.maven.lifecycle.internal.LifecycleModuleBuilder.buildProject(LifecycleModuleBuilder.java:109)  at org.apache.maven.lifecycle.internal.LifecycleModuleBuilder.buildProject(LifecycleModuleBuilder.java:80)  at org.apache.maven.lifecycle.internal.builder.singlethreaded.SingleThreadedBuilder.build(SingleThreadedBuilder.java:51)  at org.apache.maven.lifecycle.internal.LifecycleStarter.execute(LifecycleStarter.java:128)  at org.apache.maven.DefaultMaven.doExecute(DefaultMaven.java:307)  at org.apache.maven.DefaultMaven.doExecute(DefaultMaven.java:193)  at org.apache.maven.DefaultMaven.execute(DefaultMaven.java:106)  at org.apache.maven.cli.MavenCli.execute(MavenCli.java:863)  at org.apache.maven.cli.MavenCli.doMain(MavenCli.java:288)  at org.apache.maven.cli.MavenCli.main(MavenCli.java:199)  at sun.reflect.NativeMethodAccessorImpl.invoke0(Native Method)  at sun.reflect.NativeMethodAccessorImpl.invoke(NativeMethodAccessorImpl.java:62)  at sun.reflect.DelegatingMethodAccessorImpl.invoke(DelegatingMethodAccessorImpl.java:43)  at java.lang.reflect.Method.invoke(Method.java:498)  at org.codehaus.plexus.classworlds.launcher.Launcher.launchEnhanced(Launcher.java:289)  at org.codehaus.plexus.classworlds.launcher.Launcher.launch(Launcher.java:229)  at org.codehaus.plexus.classworlds.launcher.Launcher.mainWithExitCode(Launcher.java:415)  at org.codehaus.plexus.classworlds.launcher.Launcher.main(Launcher.java:356) Caused by: org.eclipse.aether.resolution.ArtifactResolutionException: Could not find artifact org.openmrs.maven.plugins:openmrs-packager-maven-plugin:jar:1.5.0-SNAPSHOT  at org.eclipse.aether.internal.impl.DefaultArtifactResolver.resolve(DefaultArtifactResolver.java:444)  at org.eclipse.aether.internal.impl.DefaultArtifactResolver.resolveArtifacts(DefaultArtifactResolver.java:246)  at org.eclipse.aether.internal.impl.DefaultArtifactResolver.resolveArtifact(DefaultArtifactResolver.java:223)  at org.eclipse.aether.internal.impl.DefaultRepositorySystem.resolveArtifact(DefaultRepositorySystem.java:294)  at org.apache.maven.plugin.internal.DefaultPluginDependenciesResolver.resolve(DefaultPluginDependenciesResolver.java:124)  ... 26 more Caused by: org.eclipse.aether.transfer.ArtifactNotFoundException: Could not find artifact org.openmrs.maven.plugins:openmrs-packager-maven-plugin:jar:1.5.0-SNAPSHOT  at org.eclipse.aether.internal.impl.DefaultArtifactResolver.resolve(DefaultArtifactResolver.java:434)  ... 30 more [ERROR]  [ERROR]  [ERROR] For more information about the errors and possible solutions, please read the following articles: [ERROR] [Help 1] http://cwiki.apache.org/confluence/display/MAVEN/PluginResolutionException 
org.apache.maven.it.VerificationException: Exit code was non-zero: 1; command line and log = 
/usr/share/apache-maven-3.3.9/bin/mvn -N -X -e --batch-mode -Dmaven.repo.local=/home/bamboo-agent/.m2/repository org.apache.maven.plugins:maven-clean-plugin:clean install
Apache Maven 3.3.9 (bb52d8502b132ec0a5a3f4c09453c07478323dc5; 2015-11-10T16:41:47+00:00)
Maven home: /usr/share/apache-maven-3.3.9
Java version: 1.8.0_292, vendor: Private Build
Java home: /usr/lib/jvm/java-8-openjdk-amd64/jre
Default locale: en_US, platform encoding: UTF-8
(179 more lines...)
org.apache.maven.it.VerificationException: Exit code was non-zero: 1; command line and log =  /usr/share/apache-maven-3.3.9/bin/mvn -N -X -e --batch-mode -Dmaven.repo.local=/home/bamboo-agent/.m2/repository org.apache.maven.plugins:maven-clean-plugin:clean compile Apache Maven 3.3.9 (bb52d8502b132ec0a5a3f4c09453c07478323dc5; 2015-11-10T16:41:47+00:00) Maven home: /usr/share/apache-maven-3.3.9 Java version: 1.8.0_292, vendor: Private Build Java home: /usr/lib/jvm/java-8-openjdk-amd64/jre Default locale: en_US, platform encoding: UTF-8 OS name: "linux", version: "4.4.0-210-generic", arch: "amd64", family: "unix" [DEBUG] Created new class realm maven.api [DEBUG] Importing foreign packages into class realm maven.api [DEBUG]   Imported: javax.enterprise.inject.* < plexus.core [DEBUG]   Imported: javax.enterprise.util.* < plexus.core [DEBUG]   Imported: javax.inject.* < plexus.core [DEBUG]   Imported: org.apache.maven.* < plexus.core [DEBUG]   Imported: org.apache.maven.artifact < plexus.core [DEBUG]   Imported: org.apache.maven.classrealm < plexus.core [DEBUG]   Imported: org.apache.maven.cli < plexus.core [DEBUG]   Imported: org.apache.maven.configuration < plexus.core [DEBUG]   Imported: org.apache.maven.exception < plexus.core [DEBUG]   Imported: org.apache.maven.execution < plexus.core [DEBUG]   Imported: org.apache.maven.execution.scope < plexus.core [DEBUG]   Imported: org.apache.maven.lifecycle < plexus.core [DEBUG]   Imported: org.apache.maven.model < plexus.core [DEBUG]   Imported: org.apache.maven.monitor < plexus.core [DEBUG]   Imported: org.apache.maven.plugin < plexus.core [DEBUG]   Imported: org.apache.maven.profiles < plexus.core [DEBUG]   Imported: org.apache.maven.project < plexus.core [DEBUG]   Imported: org.apache.maven.reporting < plexus.core [DEBUG]   Imported: org.apache.maven.repository < plexus.core [DEBUG]   Imported: org.apache.maven.rtinfo < plexus.core [DEBUG]   Imported: org.apache.maven.settings < plexus.core [DEBUG]   Imported: org.apache.maven.toolchain < plexus.core [DEBUG]   Imported: org.apache.maven.usability < plexus.core [DEBUG]   Imported: org.apache.maven.wagon.* < plexus.core [DEBUG]   Imported: org.apache.maven.wagon.authentication < plexus.core [DEBUG]   Imported: org.apache.maven.wagon.authorization < plexus.core [DEBUG]   Imported: org.apache.maven.wagon.events < plexus.core [DEBUG]   Imported: org.apache.maven.wagon.observers < plexus.core [DEBUG]   Imported: org.apache.maven.wagon.proxy < plexus.core [DEBUG]   Imported: org.apache.maven.wagon.repository < plexus.core [DEBUG]   Imported: org.apache.maven.wagon.resource < plexus.core [DEBUG]   Imported: org.codehaus.classworlds < plexus.core [DEBUG]   Imported: org.codehaus.plexus.* < plexus.core [DEBUG]   Imported: org.codehaus.plexus.classworlds < plexus.core [DEBUG]   Imported: org.codehaus.plexus.component < plexus.core [DEBUG]   Imported: org.codehaus.plexus.configuration < plexus.core [DEBUG]   Imported: org.codehaus.plexus.container < plexus.core [DEBUG]   Imported: org.codehaus.plexus.context < plexus.core [DEBUG]   Imported: org.codehaus.plexus.lifecycle < plexus.core [DEBUG]   Imported: org.codehaus.plexus.logging < plexus.core [DEBUG]   Imported: org.codehaus.plexus.personality < plexus.core [DEBUG]   Imported: org.codehaus.plexus.util.xml.Xpp3Dom < plexus.core [DEBUG]   Imported: org.codehaus.plexus.util.xml.pull.XmlPullParser < plexus.core [DEBUG]   Imported: org.codehaus.plexus.util.xml.pull.XmlPullParserException < plexus.core [DEBUG]   Imported: org.codehaus.plexus.util.xml.pull.XmlSerializer < plexus.core [DEBUG]   Imported: org.eclipse.aether.* < plexus.core [DEBUG]   Imported: org.eclipse.aether.artifact < plexus.core [DEBUG]   Imported: org.eclipse.aether.collection < plexus.core [DEBUG]   Imported: org.eclipse.aether.deployment < plexus.core [DEBUG]   Imported: org.eclipse.aether.graph < plexus.core [DEBUG]   Imported: org.eclipse.aether.impl < plexus.core [DEBUG]   Imported: org.eclipse.aether.installation < plexus.core [DEBUG]   Imported: org.eclipse.aether.internal.impl < plexus.core [DEBUG]   Imported: org.eclipse.aether.metadata < plexus.core [DEBUG]   Imported: org.eclipse.aether.repository < plexus.core [DEBUG]   Imported: org.eclipse.aether.resolution < plexus.core [DEBUG]   Imported: org.eclipse.aether.spi < plexus.core [DEBUG]   Imported: org.eclipse.aether.transfer < plexus.core [DEBUG]   Imported: org.eclipse.aether.version < plexus.core [DEBUG]   Imported: org.slf4j.* < plexus.core [DEBUG]   Imported: org.slf4j.helpers.* < plexus.core [DEBUG]   Imported: org.slf4j.spi.* < plexus.core [DEBUG] Populating class realm maven.api [INFO] Error stacktraces are turned on. [DEBUG] Reading global settings from /usr/share/apache-maven-3.3.9/conf/settings.xml [DEBUG] Reading user settings from /home/bamboo-agent/.m2/settings.xml [DEBUG] Reading global toolchains from /usr/share/apache-maven-3.3.9/conf/toolchains.xml [DEBUG] Reading user toolchains from /home/bamboo-agent/.m2/toolchains.xml [DEBUG] Using local repository at /home/bamboo-agent/.m2/repository [DEBUG] Using manager EnhancedLocalRepositoryManager with priority 10.0 for /home/bamboo-agent/.m2/repository [INFO] Scanning for projects... [DEBUG] Extension realms for project org.openmrs.maven.plugins:openmrs-packager-maven-plugin-config-test-parent:pom:1.0.0-SNAPSHOT: (none) [DEBUG] Looking up lifecyle mappings for packaging pom from ClassRealm[plexus.core, parent: null] [DEBUG] === REACTOR BUILD PLAN ================================================ [DEBUG] Project: org.openmrs.maven.plugins:openmrs-packager-maven-plugin-config-test-parent:pom:1.0.0-SNAPSHOT [DEBUG] Tasks:   [org.apache.maven.plugins:maven-clean-plugin:clean, compile] [DEBUG] Style:   Regular [DEBUG] ======================================================================= [INFO]                                                                          [INFO] ------------------------------------------------------------------------ [INFO] Building OpenMRS config parent test 1.0.0-SNAPSHOT [INFO] ------------------------------------------------------------------------ [DEBUG] Lifecycle default -> [validate, initialize, generate-sources, process-sources, generate-resources, process-resources, compile, process-classes, generate-test-sources, process-test-sources, generate-test-resources, process-test-resources, test-compile, process-test-classes, test, prepare-package, package, pre-integration-test, integration-test, post-integration-test, verify, install, deploy] [DEBUG] Lifecycle clean -> [pre-clean, clean, post-clean] [DEBUG] Lifecycle site -> [pre-site, site, post-site, site-deploy] [DEBUG] Could not find metadata org.openmrs.maven.plugins:openmrs-packager-maven-plugin:1.5.0-SNAPSHOT/maven-metadata.xml in local (/home/bamboo-agent/.m2/repository) [DEBUG] Could not find metadata org.openmrs.maven.plugins:openmrs-packager-maven-plugin:1.5.0-SNAPSHOT/maven-metadata.xml in local (/home/bamboo-agent/.m2/repository) [WARNING] The POM for org.openmrs.maven.plugins:openmrs-packager-maven-plugin:jar:1.5.0-SNAPSHOT is missing, no dependency information available [INFO] ------------------------------------------------------------------------ [INFO] BUILD FAILURE [INFO] ------------------------------------------------------------------------ [INFO] Total time: 0.147 s [INFO] Finished at: 2021-07-14T15:53:34+00:00 [INFO] Final Memory: 7M/106M [INFO] ------------------------------------------------------------------------ [ERROR] Plugin org.openmrs.maven.plugins:openmrs-packager-maven-plugin:1.5.0-SNAPSHOT or one of its dependencies could not be resolved: Could not find artifact org.openmrs.maven.plugins:openmrs-packager-maven-plugin:jar:1.5.0-SNAPSHOT -> [Help 1] org.apache.maven.plugin.PluginResolutionException: Plugin org.openmrs.maven.plugins:openmrs-packager-maven-plugin:1.5.0-SNAPSHOT or one of its dependencies could not be resolved: Could not find artifact org.openmrs.maven.plugins:openmrs-packager-maven-plugin:jar:1.5.0-SNAPSHOT  at org.apache.maven.plugin.internal.DefaultPluginDependenciesResolver.resolve(DefaultPluginDependenciesResolver.java:128)  at org.apache.maven.plugin.internal.DefaultMavenPluginManager.getPluginDescriptor(DefaultMavenPluginManager.java:179)  at org.apache.maven.plugin.internal.DefaultMavenPluginManager.getMojoDescriptor(DefaultMavenPluginManager.java:284)  at org.apache.maven.plugin.DefaultBuildPluginManager.getMojoDescriptor(DefaultBuildPluginManager.java:241)  at org.apache.maven.lifecycle.internal.DefaultLifecycleExecutionPlanCalculator.setupMojoExecution(DefaultLifecycleExecutionPlanCalculator.java:169)  at org.apache.maven.lifecycle.internal.DefaultLifecycleExecutionPlanCalculator.setupMojoExecutions(DefaultLifecycleExecutionPlanCalculator.java:155)  at org.apache.maven.lifecycle.internal.DefaultLifecycleExecutionPlanCalculator.calculateExecutionPlan(DefaultLifecycleExecutionPlanCalculator.java:131)  at org.apache.maven.lifecycle.internal.DefaultLifecycleExecutionPlanCalculator.calculateExecutionPlan(DefaultLifecycleExecutionPlanCalculator.java:145)  at org.apache.maven.lifecycle.internal.builder.BuilderCommon.resolveBuildPlan(BuilderCommon.java:96)  at org.apache.maven.lifecycle.internal.LifecycleModuleBuilder.buildProject(LifecycleModuleBuilder.java:109)  at org.apache.maven.lifecycle.internal.LifecycleModuleBuilder.buildProject(LifecycleModuleBuilder.java:80)  at org.apache.maven.lifecycle.internal.builder.singlethreaded.SingleThreadedBuilder.build(SingleThreadedBuilder.java:51)  at org.apache.maven.lifecycle.internal.LifecycleStarter.execute(LifecycleStarter.java:128)  at org.apache.maven.DefaultMaven.doExecute(DefaultMaven.java:307)  at org.apache.maven.DefaultMaven.doExecute(DefaultMaven.java:193)  at org.apache.maven.DefaultMaven.execute(DefaultMaven.java:106)  at org.apache.maven.cli.MavenCli.execute(MavenCli.java:863)  at org.apache.maven.cli.MavenCli.doMain(MavenCli.java:288)  at org.apache.maven.cli.MavenCli.main(MavenCli.java:199)  at sun.reflect.NativeMethodAccessorImpl.invoke0(Native Method)  at sun.reflect.NativeMethodAccessorImpl.invoke(NativeMethodAccessorImpl.java:62)  at sun.reflect.DelegatingMethodAccessorImpl.invoke(DelegatingMethodAccessorImpl.java:43)  at java.lang.reflect.Method.invoke(Method.java:498)  at org.codehaus.plexus.classworlds.launcher.Launcher.launchEnhanced(Launcher.java:289)  at org.codehaus.plexus.classworlds.launcher.Launcher.launch(Launcher.java:229)  at org.codehaus.plexus.classworlds.launcher.Launcher.mainWithExitCode(Launcher.java:415)  at org.codehaus.plexus.classworlds.launcher.Launcher.main(Launcher.java:356) Caused by: org.eclipse.aether.resolution.ArtifactResolutionException: Could not find artifact org.openmrs.maven.plugins:openmrs-packager-maven-plugin:jar:1.5.0-SNAPSHOT  at org.eclipse.aether.internal.impl.DefaultArtifactResolver.resolve(DefaultArtifactResolver.java:444)  at org.eclipse.aether.internal.impl.DefaultArtifactResolver.resolveArtifacts(DefaultArtifactResolver.java:246)  at org.eclipse.aether.internal.impl.DefaultArtifactResolver.resolveArtifact(DefaultArtifactResolver.java:223)  at org.eclipse.aether.internal.impl.DefaultRepositorySystem.resolveArtifact(DefaultRepositorySystem.java:294)  at org.apache.maven.plugin.internal.DefaultPluginDependenciesResolver.resolve(DefaultPluginDependenciesResolver.java:124)  ... 26 more Caused by: org.eclipse.aether.transfer.ArtifactNotFoundException: Could not find artifact org.openmrs.maven.plugins:openmrs-packager-maven-plugin:jar:1.5.0-SNAPSHOT  at org.eclipse.aether.internal.impl.DefaultArtifactResolver.resolve(DefaultArtifactResolver.java:434)  ... 30 more [ERROR]  [ERROR]  [ERROR] For more information about the errors and possible solutions, please read the following articles: [ERROR] [Help 1] http://cwiki.apache.org/confluence/display/MAVEN/PluginResolutionException 
org.apache.maven.it.VerificationException: Exit code was non-zero: 1; command line and log = 
/usr/share/apache-maven-3.3.9/bin/mvn -N -X -e --batch-mode -Dmaven.repo.local=/home/bamboo-agent/.m2/repository org.apache.maven.plugins:maven-clean-plugin:clean compile
Apache Maven 3.3.9 (bb52d8502b132ec0a5a3f4c09453c07478323dc5; 2015-11-10T16:41:47+00:00)
Maven home: /usr/share/apache-maven-3.3.9
Java version: 1.8.0_292, vendor: Private Build
Java home: /usr/lib/jvm/java-8-openjdk-amd64/jre
Default locale: en_US, platform encoding: UTF-8
(179 more lines...)
org.apache.maven.it.VerificationException: Exit code was non-zero: 1; command line and log =  /usr/share/apache-maven-3.3.9/bin/mvn -N -X -e --batch-mode -Dmaven.repo.local=/home/bamboo-agent/.m2/repository org.apache.maven.plugins:maven-clean-plugin:clean package Apache Maven 3.3.9 (bb52d8502b132ec0a5a3f4c09453c07478323dc5; 2015-11-10T16:41:47+00:00) Maven home: /usr/share/apache-maven-3.3.9 Java version: 1.8.0_292, vendor: Private Build Java home: /usr/lib/jvm/java-8-openjdk-amd64/jre Default locale: en_US, platform encoding: UTF-8 OS name: "linux", version: "4.4.0-210-generic", arch: "amd64", family: "unix" [DEBUG] Created new class realm maven.api [DEBUG] Importing foreign packages into class realm maven.api [DEBUG]   Imported: javax.enterprise.inject.* < plexus.core [DEBUG]   Imported: javax.enterprise.util.* < plexus.core [DEBUG]   Imported: javax.inject.* < plexus.core [DEBUG]   Imported: org.apache.maven.* < plexus.core [DEBUG]   Imported: org.apache.maven.artifact < plexus.core [DEBUG]   Imported: org.apache.maven.classrealm < plexus.core [DEBUG]   Imported: org.apache.maven.cli < plexus.core [DEBUG]   Imported: org.apache.maven.configuration < plexus.core [DEBUG]   Imported: org.apache.maven.exception < plexus.core [DEBUG]   Imported: org.apache.maven.execution < plexus.core [DEBUG]   Imported: org.apache.maven.execution.scope < plexus.core [DEBUG]   Imported: org.apache.maven.lifecycle < plexus.core [DEBUG]   Imported: org.apache.maven.model < plexus.core [DEBUG]   Imported: org.apache.maven.monitor < plexus.core [DEBUG]   Imported: org.apache.maven.plugin < plexus.core [DEBUG]   Imported: org.apache.maven.profiles < plexus.core [DEBUG]   Imported: org.apache.maven.project < plexus.core [DEBUG]   Imported: org.apache.maven.reporting < plexus.core [DEBUG]   Imported: org.apache.maven.repository < plexus.core [DEBUG]   Imported: org.apache.maven.rtinfo < plexus.core [DEBUG]   Imported: org.apache.maven.settings < plexus.core [DEBUG]   Imported: org.apache.maven.toolchain < plexus.core [DEBUG]   Imported: org.apache.maven.usability < plexus.core [DEBUG]   Imported: org.apache.maven.wagon.* < plexus.core [DEBUG]   Imported: org.apache.maven.wagon.authentication < plexus.core [DEBUG]   Imported: org.apache.maven.wagon.authorization < plexus.core [DEBUG]   Imported: org.apache.maven.wagon.events < plexus.core [DEBUG]   Imported: org.apache.maven.wagon.observers < plexus.core [DEBUG]   Imported: org.apache.maven.wagon.proxy < plexus.core [DEBUG]   Imported: org.apache.maven.wagon.repository < plexus.core [DEBUG]   Imported: org.apache.maven.wagon.resource < plexus.core [DEBUG]   Imported: org.codehaus.classworlds < plexus.core [DEBUG]   Imported: org.codehaus.plexus.* < plexus.core [DEBUG]   Imported: org.codehaus.plexus.classworlds < plexus.core [DEBUG]   Imported: org.codehaus.plexus.component < plexus.core [DEBUG]   Imported: org.codehaus.plexus.configuration < plexus.core [DEBUG]   Imported: org.codehaus.plexus.container < plexus.core [DEBUG]   Imported: org.codehaus.plexus.context < plexus.core [DEBUG]   Imported: org.codehaus.plexus.lifecycle < plexus.core [DEBUG]   Imported: org.codehaus.plexus.logging < plexus.core [DEBUG]   Imported: org.codehaus.plexus.personality < plexus.core [DEBUG]   Imported: org.codehaus.plexus.util.xml.Xpp3Dom < plexus.core [DEBUG]   Imported: org.codehaus.plexus.util.xml.pull.XmlPullParser < plexus.core [DEBUG]   Imported: org.codehaus.plexus.util.xml.pull.XmlPullParserException < plexus.core [DEBUG]   Imported: org.codehaus.plexus.util.xml.pull.XmlSerializer < plexus.core [DEBUG]   Imported: org.eclipse.aether.* < plexus.core [DEBUG]   Imported: org.eclipse.aether.artifact < plexus.core [DEBUG]   Imported: org.eclipse.aether.collection < plexus.core [DEBUG]   Imported: org.eclipse.aether.deployment < plexus.core [DEBUG]   Imported: org.eclipse.aether.graph < plexus.core [DEBUG]   Imported: org.eclipse.aether.impl < plexus.core [DEBUG]   Imported: org.eclipse.aether.installation < plexus.core [DEBUG]   Imported: org.eclipse.aether.internal.impl < plexus.core [DEBUG]   Imported: org.eclipse.aether.metadata < plexus.core [DEBUG]   Imported: org.eclipse.aether.repository < plexus.core [DEBUG]   Imported: org.eclipse.aether.resolution < plexus.core [DEBUG]   Imported: org.eclipse.aether.spi < plexus.core [DEBUG]   Imported: org.eclipse.aether.transfer < plexus.core [DEBUG]   Imported: org.eclipse.aether.version < plexus.core [DEBUG]   Imported: org.slf4j.* < plexus.core [DEBUG]   Imported: org.slf4j.helpers.* < plexus.core [DEBUG]   Imported: org.slf4j.spi.* < plexus.core [DEBUG] Populating class realm maven.api [INFO] Error stacktraces are turned on. [DEBUG] Reading global settings from /usr/share/apache-maven-3.3.9/conf/settings.xml [DEBUG] Reading user settings from /home/bamboo-agent/.m2/settings.xml [DEBUG] Reading global toolchains from /usr/share/apache-maven-3.3.9/conf/toolchains.xml [DEBUG] Reading user toolchains from /home/bamboo-agent/.m2/toolchains.xml [DEBUG] Using local repository at /home/bamboo-agent/.m2/repository [DEBUG] Using manager EnhancedLocalRepositoryManager with priority 10.0 for /home/bamboo-agent/.m2/repository [INFO] Scanning for projects... [DEBUG] Extension realms for project org.openmrs.maven.plugins:openmrs-packager-maven-plugin-config-test-parent:pom:1.0.0-SNAPSHOT: (none) [DEBUG] Looking up lifecyle mappings for packaging pom from ClassRealm[plexus.core, parent: null] [DEBUG] === REACTOR BUILD PLAN ================================================ [DEBUG] Project: org.openmrs.maven.plugins:openmrs-packager-maven-plugin-config-test-parent:pom:1.0.0-SNAPSHOT [DEBUG] Tasks:   [org.apache.maven.plugins:maven-clean-plugin:clean, package] [DEBUG] Style:   Regular [DEBUG] ======================================================================= [INFO]                                                                          [INFO] ------------------------------------------------------------------------ [INFO] Building OpenMRS config parent test 1.0.0-SNAPSHOT [INFO] ------------------------------------------------------------------------ [DEBUG] Lifecycle default -> [validate, initialize, generate-sources, process-sources, generate-resources, process-resources, compile, process-classes, generate-test-sources, process-test-sources, generate-test-resources, process-test-resources, test-compile, process-test-classes, test, prepare-package, package, pre-integration-test, integration-test, post-integration-test, verify, install, deploy] [DEBUG] Lifecycle clean -> [pre-clean, clean, post-clean] [DEBUG] Lifecycle site -> [pre-site, site, post-site, site-deploy] [DEBUG] Could not find metadata org.openmrs.maven.plugins:openmrs-packager-maven-plugin:1.5.0-SNAPSHOT/maven-metadata.xml in local (/home/bamboo-agent/.m2/repository) [DEBUG] Could not find metadata org.openmrs.maven.plugins:openmrs-packager-maven-plugin:1.5.0-SNAPSHOT/maven-metadata.xml in local (/home/bamboo-agent/.m2/repository) [WARNING] The POM for org.openmrs.maven.plugins:openmrs-packager-maven-plugin:jar:1.5.0-SNAPSHOT is missing, no dependency information available [INFO] ------------------------------------------------------------------------ [INFO] BUILD FAILURE [INFO] ------------------------------------------------------------------------ [INFO] Total time: 0.172 s [INFO] Finished at: 2021-07-14T15:53:57+00:00 [INFO] Final Memory: 7M/106M [INFO] ------------------------------------------------------------------------ [ERROR] Plugin org.openmrs.maven.plugins:openmrs-packager-maven-plugin:1.5.0-SNAPSHOT or one of its dependencies could not be resolved: Could not find artifact org.openmrs.maven.plugins:openmrs-packager-maven-plugin:jar:1.5.0-SNAPSHOT -> [Help 1] org.apache.maven.plugin.PluginResolutionException: Plugin org.openmrs.maven.plugins:openmrs-packager-maven-plugin:1.5.0-SNAPSHOT or one of its dependencies could not be resolved: Could not find artifact org.openmrs.maven.plugins:openmrs-packager-maven-plugin:jar:1.5.0-SNAPSHOT  at org.apache.maven.plugin.internal.DefaultPluginDependenciesResolver.resolve(DefaultPluginDependenciesResolver.java:128)  at org.apache.maven.plugin.internal.DefaultMavenPluginManager.getPluginDescriptor(DefaultMavenPluginManager.java:179)  at org.apache.maven.plugin.internal.DefaultMavenPluginManager.getMojoDescriptor(DefaultMavenPluginManager.java:284)  at org.apache.maven.plugin.DefaultBuildPluginManager.getMojoDescriptor(DefaultBuildPluginManager.java:241)  at org.apache.maven.lifecycle.internal.DefaultLifecycleExecutionPlanCalculator.setupMojoExecution(DefaultLifecycleExecutionPlanCalculator.java:169)  at org.apache.maven.lifecycle.internal.DefaultLifecycleExecutionPlanCalculator.setupMojoExecutions(DefaultLifecycleExecutionPlanCalculator.java:155)  at org.apache.maven.lifecycle.internal.DefaultLifecycleExecutionPlanCalculator.calculateExecutionPlan(DefaultLifecycleExecutionPlanCalculator.java:131)  at org.apache.maven.lifecycle.internal.DefaultLifecycleExecutionPlanCalculator.calculateExecutionPlan(DefaultLifecycleExecutionPlanCalculator.java:145)  at org.apache.maven.lifecycle.internal.builder.BuilderCommon.resolveBuildPlan(BuilderCommon.java:96)  at org.apache.maven.lifecycle.internal.LifecycleModuleBuilder.buildProject(LifecycleModuleBuilder.java:109)  at org.apache.maven.lifecycle.internal.LifecycleModuleBuilder.buildProject(LifecycleModuleBuilder.java:80)  at org.apache.maven.lifecycle.internal.builder.singlethreaded.SingleThreadedBuilder.build(SingleThreadedBuilder.java:51)  at org.apache.maven.lifecycle.internal.LifecycleStarter.execute(LifecycleStarter.java:128)  at org.apache.maven.DefaultMaven.doExecute(DefaultMaven.java:307)  at org.apache.maven.DefaultMaven.doExecute(DefaultMaven.java:193)  at org.apache.maven.DefaultMaven.execute(DefaultMaven.java:106)  at org.apache.maven.cli.MavenCli.execute(MavenCli.java:863)  at org.apache.maven.cli.MavenCli.doMain(MavenCli.java:288)  at org.apache.maven.cli.MavenCli.main(MavenCli.java:199)  at sun.reflect.NativeMethodAccessorImpl.invoke0(Native Method)  at sun.reflect.NativeMethodAccessorImpl.invoke(NativeMethodAccessorImpl.java:62)  at sun.reflect.DelegatingMethodAccessorImpl.invoke(DelegatingMethodAccessorImpl.java:43)  at java.lang.reflect.Method.invoke(Method.java:498)  at org.codehaus.plexus.classworlds.launcher.Launcher.launchEnhanced(Launcher.java:289)  at org.codehaus.plexus.classworlds.launcher.Launcher.launch(Launcher.java:229)  at org.codehaus.plexus.classworlds.launcher.Launcher.mainWithExitCode(Launcher.java:415)  at org.codehaus.plexus.classworlds.launcher.Launcher.main(Launcher.java:356) Caused by: org.eclipse.aether.resolution.ArtifactResolutionException: Could not find artifact org.openmrs.maven.plugins:openmrs-packager-maven-plugin:jar:1.5.0-SNAPSHOT  at org.eclipse.aether.internal.impl.DefaultArtifactResolver.resolve(DefaultArtifactResolver.java:444)  at org.eclipse.aether.internal.impl.DefaultArtifactResolver.resolveArtifacts(DefaultArtifactResolver.java:246)  at org.eclipse.aether.internal.impl.DefaultArtifactResolver.resolveArtifact(DefaultArtifactResolver.java:223)  at org.eclipse.aether.internal.impl.DefaultRepositorySystem.resolveArtifact(DefaultRepositorySystem.java:294)  at org.apache.maven.plugin.internal.DefaultPluginDependenciesResolver.resolve(DefaultPluginDependenciesResolver.java:124)  ... 26 more Caused by: org.eclipse.aether.transfer.ArtifactNotFoundException: Could not find artifact org.openmrs.maven.plugins:openmrs-packager-maven-plugin:jar:1.5.0-SNAPSHOT  at org.eclipse.aether.internal.impl.DefaultArtifactResolver.resolve(DefaultArtifactResolver.java:434)  ... 30 more [ERROR]  [ERROR]  [ERROR] For more information about the errors and possible solutions, please read the following articles: [ERROR] [Help 1] http://cwiki.apache.org/confluence/display/MAVEN/PluginResolutionException 
org.apache.maven.it.VerificationException: Exit code was non-zero: 1; command line and log = 
/usr/share/apache-maven-3.3.9/bin/mvn -N -X -e --batch-mode -Dmaven.repo.local=/home/bamboo-agent/.m2/repository org.apache.maven.plugins:maven-clean-plugin:clean package
Apache Maven 3.3.9 (bb52d8502b132ec0a5a3f4c09453c07478323dc5; 2015-11-10T16:41:47+00:00)
Maven home: /usr/share/apache-maven-3.3.9
Java version: 1.8.0_292, vendor: Private Build
Java home: /usr/lib/jvm/java-8-openjdk-amd64/jre
Default locale: en_US, platform encoding: UTF-8
(179 more lines...)