Logs

The following logs have been generated by the jobs in this plan.
  • Expand all
  • Collapse all
Job Logs
Collapse Run QA Framework BDD UI Test Framework Download or View
15-Sep-2021 20:32:41
15-Sep-2021 20:32:41 Tests in error:
15-Sep-2021 20:32:41   Creating user account for Nurse #1(User Account Management): Expected condition failed: waiting for org.openmrs.uitestframework.page.Page$1@243f7677 (tried for 120 second(s) with 500 milliseconds interval)(..)
15-Sep-2021 20:32:41   Creating user account for Nurse #2(User Account Management): Expected condition failed: waiting for org.openmrs.uitestframework.page.Page$1@3b4c2020 (tried for 120 second(s) with 500 milliseconds interval)(..)
15-Sep-2021 20:32:41   Creating user account for Doctor(User Account Management): Expected condition failed: waiting for org.openmrs.uitestframework.page.Page$1@3f888abb (tried for 120 second(s) with 500 milliseconds interval)(..)
15-Sep-2021 20:32:41
15-Sep-2021 20:32:41 Tests run: 23, Failures: 1, Errors: 3, Skipped: 0
15-Sep-2021 20:32:41
15-Sep-2021 20:32:41 [INFO] ------------------------------------------------------------------------
15-Sep-2021 20:32:41 [INFO] BUILD FAILURE
15-Sep-2021 20:32:41 [INFO] ------------------------------------------------------------------------
15-Sep-2021 20:32:41 [INFO] Total time: 10:10 min
15-Sep-2021 20:32:41 [INFO] Finished at: 2021-09-15T20:32:41+00:00
15-Sep-2021 20:32:41 [INFO] Final Memory: 39M/285M
15-Sep-2021 20:32:41 [INFO] ------------------------------------------------------------------------
15-Sep-2021 20:32:41 [ERROR] Failed to execute goal org.apache.maven.plugins:maven-surefire-plugin:2.12.4:test (default-test) on project qaframework: There are test failures.
15-Sep-2021 20:32:41 [ERROR]
15-Sep-2021 20:32:41 [ERROR] Please refer to /home/bamboo-agent/bamboo-agent/xml-data/build-dir/CONTRIB-QA-FRAMEWORK/target/surefire-reports for the individual test results.
15-Sep-2021 20:32:41 [ERROR] -> [Help 1]
15-Sep-2021 20:32:41 [ERROR]
15-Sep-2021 20:32:41 [ERROR] To see the full stack trace of the errors, re-run Maven with the -e switch.
15-Sep-2021 20:32:41 [ERROR] Re-run Maven using the -X switch to enable full debug logging.
15-Sep-2021 20:32:41 [ERROR]
15-Sep-2021 20:32:41 [ERROR] For more information about the errors and possible solutions, please read the following articles:
15-Sep-2021 20:32:41 [ERROR] [Help 1] http://cwiki.apache.org/confluence/display/MAVEN/MojoFailureException