Build #1,041

More details of the release in https://wiki.openmrs.org/x/i4DTAw

Build: #1041 failed

Job: Default Job failed

Stages & jobs

  1. Default Stage

  2. Release

    Requires a user to start manually

Job result summary

Completed
Duration
6 minutes
Revision
6cc90f8728382ab76f670f1bfc1aaf530a7f0eef 6cc90f8728382ab76f670f1bfc1aaf530a7f0eef
Total tests
344
Fixed in
#1043 (Code changes detected)

Tests

  • 344 tests in total
  • 4 tests failed
  • 4 failures are new
  • 2 tests were quarantined / skipped
  • 3 minutes taken in total.
New test failures 4
Status Test Duration
Collapse Failed EmrEncounterController_1_10_Test shouldAddDrugOrder History
< 1 sec
org.dbunit.dataset.NoSuchTableException: concept_word
	at org.dbunit.database.DatabaseDataSet.getTableMetaData(DatabaseDataSet.java:282)
	at org.dbunit.operation.AbstractOperation.getOperationMetaData(AbstractOperation.java:80)
	at org.dbunit.operation.RefreshOperation.execute(RefreshOperation.java:98)
	at org.openmrs.test.BaseContextSensitiveTest.executeDataSet(BaseContextSensitiveTest.java:613)
	at org.openmrs.test.BaseContextSensitiveTest.executeDataSet(BaseContextSensitiveTest.java:525)
	at org.openmrs.module.emrapi.web.controller.EmrEncounterController_1_10_Test.shouldAddDrugOrder(EmrEncounterController_1_10_Test.java:35)
	at sun.reflect.NativeMethodAccessorImpl.invoke0(Native Method)
(34 more lines...)
Collapse Failed EmrEncounterController_1_10_Test shouldDiscontinueDrugOrder History
55 secs
org.dbunit.dataset.NoSuchTableException: concept_word
	at org.dbunit.database.DatabaseDataSet.getTableMetaData(DatabaseDataSet.java:282)
	at org.dbunit.operation.AbstractOperation.getOperationMetaData(AbstractOperation.java:80)
	at org.dbunit.operation.RefreshOperation.execute(RefreshOperation.java:98)
	at org.openmrs.test.BaseContextSensitiveTest.executeDataSet(BaseContextSensitiveTest.java:613)
	at org.openmrs.test.BaseContextSensitiveTest.executeDataSet(BaseContextSensitiveTest.java:525)
	at org.openmrs.module.emrapi.web.controller.EmrEncounterController_1_10_Test.shouldDiscontinueDrugOrder(EmrEncounterController_1_10_Test.java:165)
	at sun.reflect.NativeMethodAccessorImpl.invoke0(Native Method)
(34 more lines...)
Collapse Failed EmrEncounterController_1_10_Test shouldRespectDrugUuidIfProvidedWhileAddingDrugs History
1 sec
org.dbunit.dataset.NoSuchTableException: concept_word
	at org.dbunit.database.DatabaseDataSet.getTableMetaData(DatabaseDataSet.java:282)
	at org.dbunit.operation.AbstractOperation.getOperationMetaData(AbstractOperation.java:80)
	at org.dbunit.operation.RefreshOperation.execute(RefreshOperation.java:98)
	at org.openmrs.test.BaseContextSensitiveTest.executeDataSet(BaseContextSensitiveTest.java:613)
	at org.openmrs.test.BaseContextSensitiveTest.executeDataSet(BaseContextSensitiveTest.java:525)
	at org.openmrs.module.emrapi.web.controller.EmrEncounterController_1_10_Test.shouldRespectDrugUuidIfProvidedWhileAddingDrugs(EmrEncounterController_1_10_Test.java:79)
	at sun.reflect.NativeMethodAccessorImpl.invoke0(Native Method)
(34 more lines...)
Collapse Failed EmrEncounterController_1_10_Test shouldReviseDrugOrder History
1 sec
org.dbunit.dataset.NoSuchTableException: concept_word
	at org.dbunit.database.DatabaseDataSet.getTableMetaData(DatabaseDataSet.java:282)
	at org.dbunit.operation.AbstractOperation.getOperationMetaData(AbstractOperation.java:80)
	at org.dbunit.operation.RefreshOperation.execute(RefreshOperation.java:98)
	at org.openmrs.test.BaseContextSensitiveTest.executeDataSet(BaseContextSensitiveTest.java:613)
	at org.openmrs.test.BaseContextSensitiveTest.executeDataSet(BaseContextSensitiveTest.java:525)
	at org.openmrs.module.emrapi.web.controller.EmrEncounterController_1_10_Test.shouldReviseDrugOrder(EmrEncounterController_1_10_Test.java:124)
	at sun.reflect.NativeMethodAccessorImpl.invoke0(Native Method)
(34 more lines...)