More details of the release in https://wiki.openmrs.org/x/i4DTAw

Build: #2603 failed Child of EMRAPI-EMRAPI-2253

Stages & jobs

  1. Default Stage

  2. Release

    Requires a user to start manually

Build result summary

Details

Completed
Duration
18 minutes
Labels
None
Revisions
Git
8803076c65be9aa741c947ecb85aa5016491775c 8803076c65be9aa741c947ecb85aa5016491775c
Release scripts
63acfae3024f50d743ed89da44c014b3f2c7cff6 63acfae3024f50d743ed89da44c014b3f2c7cff6
Total tests
20
Fixed in
#2604 (Manual run by Daniel Kayiwa)

Tests

Responsible

No one has taken responsibility for this failure

Tests

New test failures 9
Status Test View job Duration
Collapse Failed EnterHtmlFormFragmentControllerComponentTest testEditingHtmlFormDefinedInUiResourceShouldChangeTimeOfEncounterDateIfNewDateDifferentFromOldDate History
Default Job < 1 sec
org.dbunit.dataset.NoSuchTableException: person
Collapse Failed EnterHtmlFormFragmentControllerComponentTest testDefiningAnHtmlFormInUiResource History
Default Job 10 mins
org.dbunit.dataset.NoSuchTableException: person
Collapse Failed EnterHtmlFormFragmentControllerComponentTest testFeatureTogglingViaVelocityShouldShowFeatureIfToggledOn History
Default Job < 1 sec
org.dbunit.dataset.NoSuchTableException: person
Collapse Failed EnterHtmlFormFragmentControllerComponentTest testSubmittingHtmlFormDefinedInUiResourceShouldCreateOpenVisit History
Default Job < 1 sec
org.dbunit.dataset.NoSuchTableException: person
Collapse Failed EnterHtmlFormFragmentControllerComponentTest testEditingHtmlFormDefinedInUiResourceShouldNotChangeTimeOfEncounterDateIfNewDateHasNoTimeComponentAndIsNotDifferentFromCurrentDate History
Default Job < 1 sec
org.dbunit.dataset.NoSuchTableException: person
Collapse Failed EnterHtmlFormFragmentControllerComponentTest testSubmittingHtmlFormDefinedInUiResource History
Default Job < 1 sec
org.dbunit.dataset.NoSuchTableException: person
Collapse Failed EnterHtmlFormFragmentControllerComponentTest testFeatureTogglingViaVelocityShouldNotShowFeatureIfToggledOff History
Default Job < 1 sec
org.dbunit.dataset.NoSuchTableException: person
Collapse Failed EnterHtmlFormFragmentControllerComponentTest testSubmittingHtmlFormDefinedInUiResourceShouldAssociateWithExistingVisit History
Default Job < 1 sec
org.dbunit.dataset.NoSuchTableException: person
Collapse Failed EnterHtmlFormFragmentControllerComponentTest testEditingHtmlFormDefinedInUiResourceShouldChangeTimeOfEncounterDateIfNewDateHasTimeComponentEvenIfNotDifferentFromCurrentDate History
Default Job < 1 sec
org.dbunit.dataset.NoSuchTableException: person