Build: #77 failed Manual run by Daniel Kayiwa

Stages & jobs

  1. Update versions

  2. Build

  3. Push docker image

  4. Validate

  5. Release

    Requires a user to start manually
  6. Release 2nd stage

  7. Release 3rd stage

Build result summary

Details

Completed
Duration
13 minutes
Labels
None
Revisions
OpenMRS Platform
b2c07f18cba4c79cb49f6f364a4e06de30733ac8 b2c07f18cba4c79cb49f6f364a4e06de30733ac8
Release scripts
681f3bff12454842e7e4fae01a15ce2827d75dc7 681f3bff12454842e7e4fae01a15ce2827d75dc7
Standalone
6c3d2f28accdfe2baaf7033106310d431d499a27 6c3d2f28accdfe2baaf7033106310d431d499a27
openmrs-module-webservices.rest
2e2a7670cfe36ea06b4edb3d6407fc3ebc47007c 2e2a7670cfe36ea06b4edb3d6407fc3ebc47007c
Failing since
#75 (Changes by Bartłomiej Rasztabiga <contact@rasztabiga.me>)
Fixed in
#79 (Manual run by Grace Potma)
No failed test found. A possible compilation error occurred.

Responsible

This build has been failing since #75
No one has taken responsibility

Error summary for Build standalone

The job generated some errors, drill down into the full build log for more details.

        at liquibase.changelog.visitor.UpdateVisitor.visit(UpdateVisitor.java:27)
        at liquibase.changelog.ChangeLogIterator.run(ChangeLogIterator.java:58)
        at liquibase.Liquibase.update(Liquibase.java:113)
        at org.liquibase.maven.plugins.LiquibaseUpdate.doUpdate(LiquibaseUpdate.java:31)
        at org.liquibase.maven.plugins.AbstractLiquibaseUpdateMojo.performLiquibaseTask(AbstractLiquibaseUpdateMojo.java:24)
        at org.liquibase.maven.plugins.AbstractLiquibaseMojo.execute(AbstractLiquibaseMojo.java:302)
        at org.apache.maven.plugin.DefaultBuildPluginManager.executeMojo(DefaultBuildPluginManager.java:134)
        at org.apache.maven.lifecycle.internal.MojoExecutor.execute(MojoExecutor.java:207)
        at org.apache.maven.lifecycle.internal.MojoExecutor.execute(MojoExecutor.java:153)
        at org.apache.maven.lifecycle.internal.MojoExecutor.execute(MojoExecutor.java:145)
        at org.apache.maven.lifecycle.internal.LifecycleModuleBuilder.buildProject(LifecycleModuleBuilder.java:116)
        at org.apache.maven.lifecycle.internal.LifecycleModuleBuilder.buildProject(LifecycleModuleBuilder.java:80)
        at org.apache.maven.lifecycle.internal.builder.singlethreaded.SingleThreadedBuilder.build(SingleThreadedBuilder.java:51)
        at org.apache.maven.lifecycle.internal.LifecycleStarter.execute(LifecycleStarter.java:128)
        at org.apache.maven.DefaultMaven.doExecute(DefaultMaven.java:307)
        at org.apache.maven.DefaultMaven.doExecute(DefaultMaven.java:193)
        at org.apache.maven.DefaultMaven.execute(DefaultMaven.java:106)
        at org.apache.maven.cli.MavenCli.execute(MavenCli.java:863)
        at org.apache.maven.cli.MavenCli.doMain(MavenCli.java:288)
        at org.apache.maven.cli.MavenCli.main(MavenCli.java:199)
        at sun.reflect.NativeMethodAccessorImpl.invoke0(Native Method)
        at sun.reflect.NativeMethodAccessorImpl.invoke(NativeMethodAccessorImpl.java:62)
        at sun.reflect.DelegatingMethodAccessorImpl.invoke(DelegatingMethodAccessorImpl.java:43)
        at java.lang.reflect.Method.invoke(Method.java:498)
        at org.codehaus.plexus.classworlds.launcher.Launcher.launchEnhanced(Launcher.java:289)
        at org.codehaus.plexus.classworlds.launcher.Launcher.launch(Launcher.java:229)
        at org.codehaus.plexus.classworlds.launcher.Launcher.mainWithExitCode(Launcher.java:415)
        at org.codehaus.plexus.classworlds.launcher.Launcher.main(Launcher.java:356)
Caused by: java.io.EOFException: Can not read response from server. Expected to read 4 bytes, read 0 bytes before connection was unexpectedly lost.
        at com.mysql.jdbc.MysqlIO.readFully(MysqlIO.java:3166)
        at com.mysql.jdbc.MysqlIO.reuseAndReadPacket(MysqlIO.java:3620)
        ... 42 more
SEVERE 7/9/21 3:39 PM:liquibase: Could not release lock
liquibase.exception.LockException: liquibase.exception.UnexpectedLiquibaseException: com.mysql.jdbc.exceptions.jdbc4.CommunicationsException: Communications link failure

The last packet successfully received from the server was 33,018 milliseconds ago.  The last packet sent successfully to the server was 45 milliseconds ago.
        at liquibase.lockservice.LockService.releaseLock(LockService.java:152)
        at liquibase.Liquibase.update(Liquibase.java:116)
        at org.liquibase.maven.plugins.LiquibaseUpdate.doUpdate(LiquibaseUpdate.java:31)
        at org.liquibase.maven.plugins.AbstractLiquibaseUpdateMojo.performLiquibaseTask(AbstractLiquibaseUpdateMojo.java:24)
        at org.liquibase.maven.plugins.AbstractLiquibaseMojo.execute(AbstractLiquibaseMojo.java:302)
        at org.apache.maven.plugin.DefaultBuildPluginManager.executeMojo(DefaultBuildPluginManager.java:134)
        at org.apache.maven.lifecycle.internal.MojoExecutor.execute(MojoExecutor.java:207)
        at org.apache.maven.lifecycle.internal.MojoExecutor.execute(MojoExecutor.java:153)
        at org.apache.maven.lifecycle.internal.MojoExecutor.execute(MojoExecutor.java:145)
        at org.apache.maven.lifecycle.internal.LifecycleModuleBuilder.buildProject(LifecycleModuleBuilder.java:116)
        at org.apache.maven.lifecycle.internal.LifecycleModuleBuilder.buildProject(LifecycleModuleBuilder.java:80)
        at org.apache.maven.lifecycle.internal.builder.singlethreaded.SingleThreadedBuilder.build(SingleThreadedBuilder.java:51)
        at org.apache.maven.lifecycle.internal.LifecycleStarter.execute(LifecycleStarter.java:128)
        at org.apache.maven.DefaultMaven.doExecute(DefaultMaven.java:307)
        at org.apache.maven.DefaultMaven.doExecute(DefaultMaven.java:193)
        at org.apache.maven.DefaultMaven.execute(DefaultMaven.java:106)
        at org.apache.maven.cli.MavenCli.execute(MavenCli.java:863)
        at org.apache.maven.cli.MavenCli.doMain(MavenCli.java:288)
        at org.apache.maven.cli.MavenCli.main(MavenCli.java:199)
        at sun.reflect.NativeMethodAccessorImpl.invoke0(Native Method)
        at sun.reflect.NativeMethodAccessorImpl.invoke(NativeMethodAccessorImpl.java:62)
        at sun.reflect.DelegatingMethodAccessorImpl.invoke(DelegatingMethodAccessorImpl.java:43)
        at java.lang.reflect.Method.invoke(Method.java:498)
        at org.codehaus.plexus.classworlds.launcher.Launcher.launchEnhanced(Launcher.java:289)
        at org.codehaus.plexus.classworlds.launcher.Launcher.launch(Launcher.java:229)
        at org.codehaus.plexus.classworlds.launcher.Launcher.mainWithExitCode(Launcher.java:415)
        at org.codehaus.plexus.classworlds.launcher.Launcher.main(Launcher.java:356)
Caused by: liquibase.exception.UnexpectedLiquibaseException: com.mysql.jdbc.exceptions.jdbc4.CommunicationsException: Communications link failure

The last packet successfully received from the server was 33,018 milliseconds ago.  The last packet sent successfully to the server was 45 milliseconds ago.
        at liquibase.snapshot.jvm.JdbcDatabaseSnapshotGenerator.hasTable(JdbcDatabaseSnapshotGenerator.java:63)
        at liquibase.snapshot.jvm.JdbcDatabaseSnapshotGenerator.hasDatabaseChangeLogLockTable(JdbcDatabaseSnapshotGenerator.java:49)
        at liquibase.database.AbstractDatabase.hasDatabaseChangeLogLockTable(AbstractDatabase.java:481)
        at liquibase.lockservice.LockService.releaseLock(LockService.java:135)
        ... 26 more
Caused by: com.mysql.jdbc.exceptions.jdbc4.CommunicationsException: Communications link failure

The last packet successfully received from the server was 33,018 milliseconds ago.  The last packet sent successfully to the server was 45 milliseconds ago.
        at sun.reflect.NativeConstructorAccessorImpl.newInstance0(Native Method)
        at sun.reflect.NativeConstructorAccessorImpl.newInstance(NativeConstructorAccessorImpl.java:62)
        at sun.reflect.DelegatingConstructorAccessorImpl.newInstance(DelegatingConstructorAccessorImpl.java:45)
        at java.lang.reflect.Constructor.newInstance(Constructor.java:423)
        at com.mysql.jdbc.Util.handleNewInstance(Util.java:411)
        at com.mysql.jdbc.SQLError.createCommunicationsException(SQLError.java:1129)
        at com.mysql.jdbc.MysqlIO.send(MysqlIO.java:3988)
        at com.mysql.jdbc.MysqlIO.sendCommand(MysqlIO.java:2598)
        at com.mysql.jdbc.MysqlIO.sqlQueryDirect(MysqlIO.java:2778)
        at com.mysql.jdbc.ConnectionImpl.execSQL(ConnectionImpl.java:2819)
        at com.mysql.jdbc.ConnectionImpl.execSQL(ConnectionImpl.java:2768)
        at com.mysql.jdbc.StatementImpl.executeQuery(StatementImpl.java:1651)
        at com.mysql.jdbc.DatabaseMetaData$9.forEach(DatabaseMetaData.java:5271)
        at com.mysql.jdbc.DatabaseMetaData$9.forEach(DatabaseMetaData.java:5261)
        at com.mysql.jdbc.IterateBlock.doForAll(IterateBlock.java:51)
        at com.mysql.jdbc.DatabaseMetaData.getTables(DatabaseMetaData.java:5260)
        at liquibase.snapshot.jvm.JdbcDatabaseSnapshotGenerator.hasTable(JdbcDatabaseSnapshotGenerator.java:54)
        ... 29 more
Caused by: java.net.SocketException: Broken pipe (Write failed)
        at java.net.SocketOutputStream.socketWrite0(Native Method)
        at java.net.SocketOutputStream.socketWrite(SocketOutputStream.java:111)
        at java.net.SocketOutputStream.write(SocketOutputStream.java:155)
        at java.io.BufferedOutputStream.flushBuffer(BufferedOutputStream.java:82)
        at java.io.BufferedOutputStream.flush(BufferedOutputStream.java:140)
        at com.mysql.jdbc.MysqlIO.send(MysqlIO.java:3969)
        ... 39 more