Build #1,962

Deploys Reference Application SNAPSHOT to maven

Build: #1962 failed Changes by mogoodrich <mgoodrich@pih.org>

Stages & jobs

  1. Create Reference Application packages

  2. Deploy to Automated Functional Test Server

  3. Create Standalone and Run UI Tests

  4. Deploy to Manual Test Server

Build result summary

Details

Completed
Duration
9 minutes
Labels
None
Revisions
Distribution
e97dee4f01705a92c8b03fe7db9434e7c7b97da5 e97dee4f01705a92c8b03fe7db9434e7c7b97da5
Standalone RA
e079223a12d083467bfdf179d69959b8befcecdf e079223a12d083467bfdf179d69959b8befcecdf
Total tests
8
Failing since
#1954 (Child of RDD-RDD-567)
Fixed in
#1967 (Changes by Wyclif Luyima)

Responsible

This build has been failing since #1954
No one has taken responsibility

Code commits

Distribution
Author Commit Message Commit date
mogoodrich <mgoodrich@pih.org> mogoodrich <mgoodrich@pih.org> e97dee4f01705a92c8b03fe7db9434e7c7b97da5 e97dee4f01705a92c8b03fe7db9434e7c7b97da5 updated version of EMR-API and added Reporting REST module to the distribution

Configuration changes

Some of the jobs or stages referenced by this result no longer exist.

Restarting failed/incomplete builds only is not possible as some of the affected jobs no longer exist.

Tests

New test failures 1
Status Test View job Duration
Collapse Failed CheckModules org.openmrs.reference.CheckModules History
Run UI tests on Travis 14 secs
org.openqa.selenium.WebDriverException: unknown error: cannot kill Chrome   (Session info: chrome=34.0.1847.116)   (Driver info: chromedriver=2.8.240825,platform=Linux 3.11.0-15-generic x86_64) (WARNING: The server did not provide any stacktrace information) Command duration or timeout: 5.53 seconds Build info: version: '2.37.0', revision: 'a7c61cbd68657e133ae96672cf995890bad2ee42', time: '2013-10-18 09:51:02' System info: host: 'gw108', ip: '149.165.228.106', os.name: 'Linux', os.arch: 'amd64', os.version: '3.11.0-15-generic', java.version: '1.6.0_30' Session ID: 11f2434db5908a361b1516b506cd20f8 Driver info: org.openqa.selenium.chrome.ChromeDriver Capabilities [{platform=LINUX, acceptSslCerts=true, javascriptEnabled=true, browserName=chrome, chrome={userDataDir=/tmp/.org.chromium.Chromium.M5xdSV}, rotatable=false, locationContextEnabled=true, version=34.0.1847.116, takesHeapSnapshot=true, cssSelectorsEnabled=true, databaseEnabled=false, handlesAlerts=true, browserConnectionEnabled=false, webStorageEnabled=true, nativeEvents=true, applicationCacheEnabled=false, takesScreenshot=true}]
org.openqa.selenium.WebDriverException: unknown error: cannot kill Chrome
  (Session info: chrome=34.0.1847.116)
  (Driver info: chromedriver=2.8.240825,platform=Linux 3.11.0-15-generic x86_64) (WARNING: The server did not provide any stacktrace information)
Command duration or timeout: 5.53 seconds
Build info: version: '2.37.0', revision: 'a7c61cbd68657e133ae96672cf995890bad2ee42', time: '2013-10-18 09:51:02'
System info: host: 'gw108', ip: '149.165.228.106', os.name: 'Linux', os.arch: 'amd64', os.version: '3.11.0-15-generic', java.version: '1.6.0_30'
Session ID: 11f2434db5908a361b1516b506cd20f8
(34 more lines...)
Existing test failures 1
Status Test Failing since View job Duration
org.openqa.selenium.TimeoutException: Timed out after 8 seconds waiting for presence of element located by: By.className: active-visit-started-at-message Build info: version: '2.37.0', revision: 'a7c61cbd68657e133ae96672cf995890bad2ee42', time: '2013-10-18 09:51:02' System info: host: 'gw108', ip: '149.165.228.106', os.name: 'Linux', os.arch: 'amd64', os.version: '3.11.0-15-generic', java.version: '1.6.0_30' Driver info: driver.version: unknown
org.openqa.selenium.TimeoutException: Timed out after 8 seconds waiting for presence of element located by: By.className: active-visit-started-at-message
Build info: version: '2.37.0', revision: 'a7c61cbd68657e133ae96672cf995890bad2ee42', time: '2013-10-18 09:51:02'
System info: host: 'gw108', ip: '149.165.228.106', os.name: 'Linux', os.arch: 'amd64', os.version: '3.11.0-15-generic', java.version: '1.6.0_30'
Driver info: driver.version: unknown
	at org.openqa.selenium.support.ui.FluentWait.timeoutException(FluentWait.java:259)
	at org.openqa.selenium.support.ui.FluentWait.until(FluentWait.java:228)
	at org.openmrs.uitestframework.page.AbstractBasePage.findElement(AbstractBasePage.java:51)
(64 more lines...)
Fixed tests 5
Status Test Failing since View job Duration
Successful LoginTest verifyClerkModulesAvailableOnHomePage History
Failing since build #1954 (Child of RDD-RDD-567) Run UI tests on Travis 12 secs
Successful LoginTest verifyModulesAvailableOnHomePage History
Failing since build #1954 (Child of RDD-RDD-567) Run UI tests on Travis 3 secs
Successful LoginTest verifyNurseModulesAvailableOnHomePage History
Failing since build #1954 (Child of RDD-RDD-567) Run UI tests on Travis 15 secs
Successful LoginTest verifyDoctorModulesAvailableOnHomePage History
Failing since build #1954 (Child of RDD-RDD-567) Run UI tests on Travis 11 secs
Successful RegistrationAppTest registerAPatient History
Failing since build #1954 (Child of RDD-RDD-567) Run UI tests on Travis 18 secs