Build #5,103

Deploys Reference Application SNAPSHOT to maven

Stages & jobs

  1. Create Reference Application packages

  2. Deploy to Automated Functional Test Server

  3. Run UI Tests

  4. Deploy to Manual Test Server

  5. Release

    Requires a user to start manually
  6. Create Standalone

Build result summary

Details

Completed
Duration
29 minutes
Labels
None
Revisions
Distribution
a7096fa756ea9a96e528ecc124514cb23a7d9ed4 a7096fa756ea9a96e528ecc124514cb23a7d9ed4
Standalone RA
5765e6c0fd4789543d82a066201f7c69fcdf192f 5765e6c0fd4789543d82a066201f7c69fcdf192f
Release scripts
a72ca16daff268573032d8bd52a15be883f08322 a72ca16daff268573032d8bd52a15be883f08322
Total tests
32
Failing since
#5102 (Changes by Pawel <pawel.gutkowski.1993@gmail.com> and Tomasz Marzeion <marzeion.tomasz@gmail.com>)
Fixed in
#5105 (Child of AUM-AUM-321)

Responsible

This build has been failing since #5102
No one has taken responsibility

Code commits

Distribution
Author Commit Message Commit date
Pawe? Gutkowski <pawel.gutkowski.1993@gmail.com> Pawe? Gutkowski <pawel.gutkowski.1993@gmail.com> a7096fa756ea9a96e528ecc124514cb23a7d9ed4 a7096fa756ea9a96e528ecc124514cb23a7d9ed4 Merge pull request #188 from tmarzeion/RA-1217
RA-1217 - Fix LocationSensitiveApplicationTestBase
Tomasz Marzeion <marzeion.tomasz@gmail.com> Tomasz Marzeion <marzeion.tomasz@gmail.com> a217d8cd59de84814f7ce162b82d59267c98a965 a217d8cd59de84814f7ce162b82d59267c98a965 RA-1217 - Fix LocationSensitiveApplicationTestBase

Configuration changes

Some of the jobs or stages referenced by this result no longer exist.

Restarting failed/incomplete builds only is not possible as some of the affected jobs no longer exist.

Tests

New test failures 2
Status Test View job Duration
Collapse Failed AddNewAllergyTest addNewAllergyTest History
Run UI tests on Travis 6 mins
org.openqa.selenium.TimeoutException: Timed out after 120 seconds waiting for visibility of element located by By.tagName: input
Build info: version: '2.52.0', revision: '4c2593cfc3689a7fcd7be52549167e5ccc93ad28', time: '2016-02-11 11:22:43'
System info: host: 'gw107', ip: '149.165.228.105', os.name: 'Linux', os.arch: 'amd64', os.version: '3.13.0-91-generic', java.version: '1.8.0_91'
Driver info: org.openqa.selenium.remote.RemoteWebDriver
Capabilities [{applicationCacheEnabled=true, rotatable=false, hasMetadata=true, databaseEnabled=true, handlesAlerts=true, version=42.0, platform=LINUX, nativeEvents=false, acceptSslCerts=true, webdriver.remote.sessionid=54c52f1f69a74bd6907c707f22d503b7, locationContextEnabled=true, webStorageEnabled=true, takesScreenshot=true, browserName=firefox, javascriptEnabled=true, cssSelectorsEnabled=true}]
Session ID: 54c52f1f69a74bd6907c707f22d503b7
	at sun.reflect.NativeConstructorAccessorImpl.newInstance0(Native Method)
	at sun.reflect.NativeConstructorAccessorImpl.newInstance(NativeConstructorAccessorImpl.java:62)
(29 more lines...)
Collapse Failed DeleteAllergyTest deleteAllergyTest History
Run UI tests on Travis 2 mins
org.openqa.selenium.TimeoutException: Timed out after 120 seconds waiting for visibility of element located by By.tagName: input
Build info: version: '2.52.0', revision: '4c2593cfc3689a7fcd7be52549167e5ccc93ad28', time: '2016-02-11 11:22:43'
System info: host: 'gw107', ip: '149.165.228.105', os.name: 'Linux', os.arch: 'amd64', os.version: '3.13.0-91-generic', java.version: '1.8.0_91'
Driver info: org.openqa.selenium.remote.RemoteWebDriver
Capabilities [{applicationCacheEnabled=true, rotatable=false, hasMetadata=true, databaseEnabled=true, handlesAlerts=true, version=42.0, platform=LINUX, nativeEvents=false, acceptSslCerts=true, webdriver.remote.sessionid=d4cbb994961b424e9467b2fe0d6db487, locationContextEnabled=true, webStorageEnabled=true, takesScreenshot=true, browserName=firefox, javascriptEnabled=true, cssSelectorsEnabled=true}]
Session ID: d4cbb994961b424e9467b2fe0d6db487
	at sun.reflect.NativeConstructorAccessorImpl.newInstance0(Native Method)
	at sun.reflect.NativeConstructorAccessorImpl.newInstance(NativeConstructorAccessorImpl.java:62)
(29 more lines...)
Existing test failures 3
Status Test Failing since View job Duration
org.openqa.selenium.TimeoutException: Timed out after 120 seconds waiting for visibility of element located by By.tagName: input
Build info: version: '2.52.0', revision: '4c2593cfc3689a7fcd7be52549167e5ccc93ad28', time: '2016-02-11 11:22:43'
System info: host: 'gw107', ip: '149.165.228.105', os.name: 'Linux', os.arch: 'amd64', os.version: '3.13.0-91-generic', java.version: '1.8.0_91'
Driver info: org.openqa.selenium.remote.RemoteWebDriver
Capabilities [{applicationCacheEnabled=true, rotatable=false, hasMetadata=true, databaseEnabled=true, handlesAlerts=true, version=42.0, platform=LINUX, nativeEvents=false, acceptSslCerts=true, webdriver.remote.sessionid=2387de99e82f4e6389b4eee96d337d6a, locationContextEnabled=true, webStorageEnabled=true, takesScreenshot=true, browserName=firefox, javascriptEnabled=true, cssSelectorsEnabled=true}]
Session ID: 2387de99e82f4e6389b4eee96d337d6a
	at sun.reflect.NativeConstructorAccessorImpl.newInstance0(Native Method)
	at sun.reflect.NativeConstructorAccessorImpl.newInstance(NativeConstructorAccessorImpl.java:62)
(29 more lines...)
org.openqa.selenium.TimeoutException: Timed out after 120 seconds waiting for visibility of element located by By.cssSelector: #content div span.PersonName-givenName
Build info: version: '2.52.0', revision: '4c2593cfc3689a7fcd7be52549167e5ccc93ad28', time: '2016-02-11 11:22:43'
System info: host: 'gw107', ip: '149.165.228.105', os.name: 'Linux', os.arch: 'amd64', os.version: '3.13.0-91-generic', java.version: '1.8.0_91'
Driver info: org.openqa.selenium.remote.RemoteWebDriver
Capabilities [{applicationCacheEnabled=true, rotatable=false, hasMetadata=true, databaseEnabled=true, handlesAlerts=true, version=42.0, platform=LINUX, nativeEvents=false, acceptSslCerts=true, webdriver.remote.sessionid=cd93790d9d4548928d0d0cee3ff4a4d0, locationContextEnabled=true, webStorageEnabled=true, takesScreenshot=true, browserName=firefox, javascriptEnabled=true, cssSelectorsEnabled=true}]
Session ID: cd93790d9d4548928d0d0cee3ff4a4d0
	at sun.reflect.NativeConstructorAccessorImpl.newInstance0(Native Method)
	at sun.reflect.NativeConstructorAccessorImpl.newInstance(NativeConstructorAccessorImpl.java:62)
(28 more lines...)
org.openqa.selenium.TimeoutException: Timed out after 120 seconds waiting for visibility of element located by By.className: odd
Build info: version: '2.52.0', revision: '4c2593cfc3689a7fcd7be52549167e5ccc93ad28', time: '2016-02-11 11:22:43'
System info: host: 'gw107', ip: '149.165.228.105', os.name: 'Linux', os.arch: 'amd64', os.version: '3.13.0-91-generic', java.version: '1.8.0_91'
Driver info: org.openqa.selenium.remote.RemoteWebDriver
Capabilities [{applicationCacheEnabled=true, rotatable=false, hasMetadata=true, databaseEnabled=true, handlesAlerts=true, version=42.0, platform=LINUX, nativeEvents=false, acceptSslCerts=true, webdriver.remote.sessionid=3af097590fa649ce9c0e37153d907f31, locationContextEnabled=true, webStorageEnabled=true, takesScreenshot=true, browserName=firefox, javascriptEnabled=true, cssSelectorsEnabled=true}]
Session ID: 3af097590fa649ce9c0e37153d907f31
	at sun.reflect.NativeConstructorAccessorImpl.newInstance0(Native Method)
	at sun.reflect.NativeConstructorAccessorImpl.newInstance(NativeConstructorAccessorImpl.java:62)
(28 more lines...)
Fixed tests 6
Status Test Failing since View job Duration
Successful AddDiagnosisToVisitNoteTest AddDiagnosisToVisitNoteTest History
Failing since build #5102 (Changes by Pawel <pawel.gutkowski.1993@gmail.com> and Tomasz Marzeion <marzeion.tomasz@gmail.com>) Run UI tests on Travis 6 mins
Successful CaptureVitalsTest captureVital History
Failing since build #5102 (Changes by Pawel <pawel.gutkowski.1993@gmail.com> and Tomasz Marzeion <marzeion.tomasz@gmail.com>) Run UI tests on Travis 1 min
Successful EndVisitTest EndVisitTest History
Failing since build #5102 (Changes by Pawel <pawel.gutkowski.1993@gmail.com> and Tomasz Marzeion <marzeion.tomasz@gmail.com>) Run UI tests on Travis 2 mins
Successful MergeVisitsTest mergeVisitsTest History
Failing since build #5102 (Changes by Pawel <pawel.gutkowski.1993@gmail.com> and Tomasz Marzeion <marzeion.tomasz@gmail.com>) Run UI tests on Travis 5 mins
Successful StartVisitTest startVisitTest History
Failing since build #5102 (Changes by Pawel <pawel.gutkowski.1993@gmail.com> and Tomasz Marzeion <marzeion.tomasz@gmail.com>) Run UI tests on Travis 2 mins
Successful XSSOnPhoneNumberFieldTest XSSOnPhoneNumberFieldTest History
Failing since build #5102 (Changes by Pawel <pawel.gutkowski.1993@gmail.com> and Tomasz Marzeion <marzeion.tomasz@gmail.com>) Run UI tests on Travis 2 mins

Jira issues

IssueDescriptionStatus
Unknown Issue TypeRA-1217Could not obtain issue details from Jira