Build #5,103

Deploys Reference Application SNAPSHOT to maven

Build: #5103 failed

Job: Run UI tests on Travis failed

Stages & jobs

  1. Create Reference Application packages

  2. Deploy to Automated Functional Test Server

  3. Run UI Tests

  4. Deploy to Manual Test Server

  5. Release

    Requires a user to start manually
  6. Create Standalone

Job result summary

Completed
Duration
26 minutes
Revision
a7096fa756ea9a96e528ecc124514cb23a7d9ed4 a7096fa756ea9a96e528ecc124514cb23a7d9ed4
Total tests
32
Failing since
#5102 (Code changes detected – )
Fixed in
#5105 (Child of AUM-AUM-321)

Tests

  • 32 tests in total
  • 5 tests failed
  • 2 failures are new
  • 6 tests were fixed
  • 1 test was quarantined / skipped
  • 84 minutes taken in total.
New test failures 2
Status Test Duration
Collapse Failed AddNewAllergyTest addNewAllergyTest History
6 mins
org.openqa.selenium.TimeoutException: Timed out after 120 seconds waiting for visibility of element located by By.tagName: input
Build info: version: '2.52.0', revision: '4c2593cfc3689a7fcd7be52549167e5ccc93ad28', time: '2016-02-11 11:22:43'
System info: host: 'gw107', ip: '149.165.228.105', os.name: 'Linux', os.arch: 'amd64', os.version: '3.13.0-91-generic', java.version: '1.8.0_91'
Driver info: org.openqa.selenium.remote.RemoteWebDriver
Capabilities [{applicationCacheEnabled=true, rotatable=false, hasMetadata=true, databaseEnabled=true, handlesAlerts=true, version=42.0, platform=LINUX, nativeEvents=false, acceptSslCerts=true, webdriver.remote.sessionid=54c52f1f69a74bd6907c707f22d503b7, locationContextEnabled=true, webStorageEnabled=true, takesScreenshot=true, browserName=firefox, javascriptEnabled=true, cssSelectorsEnabled=true}]
Session ID: 54c52f1f69a74bd6907c707f22d503b7
	at sun.reflect.NativeConstructorAccessorImpl.newInstance0(Native Method)
	at sun.reflect.NativeConstructorAccessorImpl.newInstance(NativeConstructorAccessorImpl.java:62)
(29 more lines...)
Collapse Failed DeleteAllergyTest deleteAllergyTest History
2 mins
org.openqa.selenium.TimeoutException: Timed out after 120 seconds waiting for visibility of element located by By.tagName: input
Build info: version: '2.52.0', revision: '4c2593cfc3689a7fcd7be52549167e5ccc93ad28', time: '2016-02-11 11:22:43'
System info: host: 'gw107', ip: '149.165.228.105', os.name: 'Linux', os.arch: 'amd64', os.version: '3.13.0-91-generic', java.version: '1.8.0_91'
Driver info: org.openqa.selenium.remote.RemoteWebDriver
Capabilities [{applicationCacheEnabled=true, rotatable=false, hasMetadata=true, databaseEnabled=true, handlesAlerts=true, version=42.0, platform=LINUX, nativeEvents=false, acceptSslCerts=true, webdriver.remote.sessionid=d4cbb994961b424e9467b2fe0d6db487, locationContextEnabled=true, webStorageEnabled=true, takesScreenshot=true, browserName=firefox, javascriptEnabled=true, cssSelectorsEnabled=true}]
Session ID: d4cbb994961b424e9467b2fe0d6db487
	at sun.reflect.NativeConstructorAccessorImpl.newInstance0(Native Method)
	at sun.reflect.NativeConstructorAccessorImpl.newInstance(NativeConstructorAccessorImpl.java:62)
(29 more lines...)
Existing test failures 3
Status Test Failing since Duration
org.openqa.selenium.TimeoutException: Timed out after 120 seconds waiting for visibility of element located by By.tagName: input
Build info: version: '2.52.0', revision: '4c2593cfc3689a7fcd7be52549167e5ccc93ad28', time: '2016-02-11 11:22:43'
System info: host: 'gw107', ip: '149.165.228.105', os.name: 'Linux', os.arch: 'amd64', os.version: '3.13.0-91-generic', java.version: '1.8.0_91'
Driver info: org.openqa.selenium.remote.RemoteWebDriver
Capabilities [{applicationCacheEnabled=true, rotatable=false, hasMetadata=true, databaseEnabled=true, handlesAlerts=true, version=42.0, platform=LINUX, nativeEvents=false, acceptSslCerts=true, webdriver.remote.sessionid=2387de99e82f4e6389b4eee96d337d6a, locationContextEnabled=true, webStorageEnabled=true, takesScreenshot=true, browserName=firefox, javascriptEnabled=true, cssSelectorsEnabled=true}]
Session ID: 2387de99e82f4e6389b4eee96d337d6a
	at sun.reflect.NativeConstructorAccessorImpl.newInstance0(Native Method)
	at sun.reflect.NativeConstructorAccessorImpl.newInstance(NativeConstructorAccessorImpl.java:62)
(29 more lines...)
org.openqa.selenium.TimeoutException: Timed out after 120 seconds waiting for visibility of element located by By.cssSelector: #content div span.PersonName-givenName
Build info: version: '2.52.0', revision: '4c2593cfc3689a7fcd7be52549167e5ccc93ad28', time: '2016-02-11 11:22:43'
System info: host: 'gw107', ip: '149.165.228.105', os.name: 'Linux', os.arch: 'amd64', os.version: '3.13.0-91-generic', java.version: '1.8.0_91'
Driver info: org.openqa.selenium.remote.RemoteWebDriver
Capabilities [{applicationCacheEnabled=true, rotatable=false, hasMetadata=true, databaseEnabled=true, handlesAlerts=true, version=42.0, platform=LINUX, nativeEvents=false, acceptSslCerts=true, webdriver.remote.sessionid=cd93790d9d4548928d0d0cee3ff4a4d0, locationContextEnabled=true, webStorageEnabled=true, takesScreenshot=true, browserName=firefox, javascriptEnabled=true, cssSelectorsEnabled=true}]
Session ID: cd93790d9d4548928d0d0cee3ff4a4d0
	at sun.reflect.NativeConstructorAccessorImpl.newInstance0(Native Method)
	at sun.reflect.NativeConstructorAccessorImpl.newInstance(NativeConstructorAccessorImpl.java:62)
(28 more lines...)
org.openqa.selenium.TimeoutException: Timed out after 120 seconds waiting for visibility of element located by By.className: odd
Build info: version: '2.52.0', revision: '4c2593cfc3689a7fcd7be52549167e5ccc93ad28', time: '2016-02-11 11:22:43'
System info: host: 'gw107', ip: '149.165.228.105', os.name: 'Linux', os.arch: 'amd64', os.version: '3.13.0-91-generic', java.version: '1.8.0_91'
Driver info: org.openqa.selenium.remote.RemoteWebDriver
Capabilities [{applicationCacheEnabled=true, rotatable=false, hasMetadata=true, databaseEnabled=true, handlesAlerts=true, version=42.0, platform=LINUX, nativeEvents=false, acceptSslCerts=true, webdriver.remote.sessionid=3af097590fa649ce9c0e37153d907f31, locationContextEnabled=true, webStorageEnabled=true, takesScreenshot=true, browserName=firefox, javascriptEnabled=true, cssSelectorsEnabled=true}]
Session ID: 3af097590fa649ce9c0e37153d907f31
	at sun.reflect.NativeConstructorAccessorImpl.newInstance0(Native Method)
	at sun.reflect.NativeConstructorAccessorImpl.newInstance(NativeConstructorAccessorImpl.java:62)
(28 more lines...)
Fixed tests 6
Status Test Failing since Duration
Successful AddDiagnosisToVisitNoteTest AddDiagnosisToVisitNoteTest History
Failing since build #5102 (Code changes detected) 6 mins
Successful CaptureVitalsTest captureVital History
Failing since build #5102 (Code changes detected) 1 min
Successful EndVisitTest EndVisitTest History
Failing since build #5102 (Code changes detected) 2 mins
Successful MergeVisitsTest mergeVisitsTest History
Failing since build #5102 (Code changes detected) 5 mins
Successful StartVisitTest startVisitTest History
Failing since build #5102 (Code changes detected) 2 mins
Successful XSSOnPhoneNumberFieldTest XSSOnPhoneNumberFieldTest History
Failing since build #5102 (Code changes detected) 2 mins