More details of the release in https://wiki.openmrs.org/x/i4DTAw

Build: #772 failed Changes by mgoodrich <mark.goodrich@live.com>

Stages & jobs

  1. Default Stage

  2. Release

    Requires a user to start manually

Build result summary

Details

Completed
Duration
5 minutes
Labels
None
Revisions
Git
cda9399cd2de8d0d08dc2a966cdeaaa6b76e5cab cda9399cd2de8d0d08dc2a966cdeaaa6b76e5cab
Release scripts
8ad880e0b0c21a2d094411a51f7951e0b9148c4a 8ad880e0b0c21a2d094411a51f7951e0b9148c4a
Total tests
4350
Failing since
#770 (Manual run from the stage: Release by Mark Goodrich)
Fixed in
#773 (Changes by mgoodrich <mark.goodrich@live.com>)

Tests

Responsible

This build has been failing since #770
No one has taken responsibility

Code commits

Git
Author Commit Message Commit date
mgoodrich <mark.goodrich@live.com> mgoodrich <mark.goodrich@live.com> cda9399cd2de8d0d08dc2a966cdeaaa6b76e5cab cda9399cd2de8d0d08dc2a966cdeaaa6b76e5cab REPORT-854: Make SortCriteria SortElement inner class static
mgoodrich <mark.goodrich@live.com> mgoodrich <mark.goodrich@live.com> b9709727cc1f4003845bfeb5fc31fd0220e4f4c2 b9709727cc1f4003845bfeb5fc31fd0220e4f4c2 REPORT-853: Add no-args constructors to all converters

Tests

Existing test failures 6
Status Test Failing since View job Duration
java.lang.AssertionError:  Expected: not null      but: was null
java.lang.AssertionError: 
Expected: not null
     but: was null
	at org.hamcrest.MatcherAssert.assertThat(MatcherAssert.java:20)
	at org.junit.Assert.assertThat(Assert.java:865)
	at org.junit.Assert.assertThat(Assert.java:832)
	at org.openmrs.module.reporting.definition.service.DefinitionServiceTest.getDefinitionByUuid_shouldDeserializeCohortIndicatorAndDimensionDataSetDefinition(DefinitionServiceTest.java:43)
(35 more lines...)
java.lang.AssertionError:  Expected: not null      but: was null
java.lang.AssertionError: 
Expected: not null
     but: was null
	at org.hamcrest.MatcherAssert.assertThat(MatcherAssert.java:20)
	at org.junit.Assert.assertThat(Assert.java:865)
	at org.junit.Assert.assertThat(Assert.java:832)
	at org.openmrs.module.reporting.definition.service.DefinitionServiceTest.getDefinitionByUuid_shouldDeserializeCohortIndicatorAndDimensionDataSetDefinition(DefinitionServiceTest.java:43)
(35 more lines...)
java.lang.AssertionError:  Expected: not null      but: was null
java.lang.AssertionError: 
Expected: not null
     but: was null
	at org.hamcrest.MatcherAssert.assertThat(MatcherAssert.java:20)
	at org.junit.Assert.assertThat(Assert.java:865)
	at org.junit.Assert.assertThat(Assert.java:832)
	at org.openmrs.module.reporting.definition.service.DefinitionServiceTest.getDefinitionByUuid_shouldDeserializeCohortIndicatorAndDimensionDataSetDefinition(DefinitionServiceTest.java:43)
(35 more lines...)
java.lang.AssertionError:  Expected: not null      but: was null
java.lang.AssertionError: 
Expected: not null
     but: was null
	at org.hamcrest.MatcherAssert.assertThat(MatcherAssert.java:20)
	at org.junit.Assert.assertThat(Assert.java:865)
	at org.junit.Assert.assertThat(Assert.java:832)
	at org.openmrs.module.reporting.definition.service.DefinitionServiceTest.getDefinitionByUuid_shouldDeserializeCohortIndicatorAndDimensionDataSetDefinition(DefinitionServiceTest.java:43)
(35 more lines...)
java.lang.AssertionError:  Expected: not null      but: was null
java.lang.AssertionError: 
Expected: not null
     but: was null
	at org.hamcrest.MatcherAssert.assertThat(MatcherAssert.java:20)
	at org.junit.Assert.assertThat(Assert.java:865)
	at org.junit.Assert.assertThat(Assert.java:832)
	at org.openmrs.module.reporting.definition.service.DefinitionServiceTest.getDefinitionByUuid_shouldDeserializeCohortIndicatorAndDimensionDataSetDefinition(DefinitionServiceTest.java:43)
(36 more lines...)
java.lang.AssertionError:  Expected: not null      but: was null
java.lang.AssertionError: 
Expected: not null
     but: was null
	at org.hamcrest.MatcherAssert.assertThat(MatcherAssert.java:20)
	at org.junit.Assert.assertThat(Assert.java:865)
	at org.junit.Assert.assertThat(Assert.java:832)
	at org.openmrs.module.reporting.definition.service.DefinitionServiceTest.getDefinitionByUuid_shouldDeserializeCohortIndicatorAndDimensionDataSetDefinition(DefinitionServiceTest.java:43)
(36 more lines...)

Jira issues

IssueDescriptionStatus
Unknown Issue TypeREPORT-853Could not obtain issue details from Jira
Unknown Issue TypeREPORT-854Could not obtain issue details from Jira