More details of the release in https://wiki.openmrs.org/x/i4DTAw

Build: #414 failed

Job: Default Job failed

Stages & jobs

  1. Default Stage

Job result summary

Completed
Duration
4 minutes
Revision
d18fd74c466c426de381857a89b985ac7a48bce6 d18fd74c466c426de381857a89b985ac7a48bce6
Total tests
624
Fixed in
#415 (Code changes detected)

Tests

  • 624 tests in total
  • 4 tests failed
  • 4 failures are new
  • 4 minutes taken in total.
New test failures 4
Status Test Duration
Collapse Failed MySqlDataSetEvaluatorTest evaluate_shouldAllowAliasesWithSpaces History
< 1 sec
java.awt.HeadlessException:  No X11 DISPLAY variable was set, but this program performed an operation which requires it.
java.awt.HeadlessException: 
No X11 DISPLAY variable was set, but this program performed an operation which requires it.
	at java.awt.GraphicsEnvironment.checkHeadless(GraphicsEnvironment.java:173)
	at java.awt.Window.<init>(Window.java:547)
	at java.awt.Frame.<init>(Frame.java:419)
	at java.awt.Frame.<init>(Frame.java:384)
	at javax.swing.JFrame.<init>(JFrame.java:174)
(37 more lines...)
Collapse Failed MySqlDataSetEvaluatorTest evaluate_shouldAllowVariableInQuery History
2 secs
java.awt.HeadlessException:  No X11 DISPLAY variable was set, but this program performed an operation which requires it.
java.awt.HeadlessException: 
No X11 DISPLAY variable was set, but this program performed an operation which requires it.
	at java.awt.GraphicsEnvironment.checkHeadless(GraphicsEnvironment.java:173)
	at java.awt.Window.<init>(Window.java:547)
	at java.awt.Frame.<init>(Frame.java:419)
	at java.awt.Frame.<init>(Frame.java:384)
	at javax.swing.JFrame.<init>(JFrame.java:174)
(37 more lines...)
Collapse Failed MySqlDataSetEvaluatorTest evaluate_shouldHandleMetadataListParameters History
< 1 sec
java.awt.HeadlessException:  No X11 DISPLAY variable was set, but this program performed an operation which requires it.
java.awt.HeadlessException: 
No X11 DISPLAY variable was set, but this program performed an operation which requires it.
	at java.awt.GraphicsEnvironment.checkHeadless(GraphicsEnvironment.java:173)
	at java.awt.Window.<init>(Window.java:547)
	at java.awt.Frame.<init>(Frame.java:419)
	at java.awt.Frame.<init>(Frame.java:384)
	at javax.swing.JFrame.<init>(JFrame.java:174)
(37 more lines...)
Collapse Failed MySqlDataSetEvaluatorTest evaluate_shouldHandleNulls History
< 1 sec
java.awt.HeadlessException:  No X11 DISPLAY variable was set, but this program performed an operation which requires it.
java.awt.HeadlessException: 
No X11 DISPLAY variable was set, but this program performed an operation which requires it.
	at java.awt.GraphicsEnvironment.checkHeadless(GraphicsEnvironment.java:173)
	at java.awt.Window.<init>(Window.java:547)
	at java.awt.Frame.<init>(Frame.java:419)
	at java.awt.Frame.<init>(Frame.java:384)
	at javax.swing.JFrame.<init>(JFrame.java:174)
(37 more lines...)

Error summary

The build generated some errors. See the full build log for more details.

[INFO] ------------------------------------------------------------------------
[ERROR] BUILD FAILURE
[INFO] ------------------------------------------------------------------------
[INFO] There are test failures.

Please refer to /opt/bamboo-agent/agent1-home/xml-data/build-dir/REP-REP-JOB1/api/target/surefire-reports for the individual test results.
[INFO] ------------------------------------------------------------------------
[INFO] For more information, run Maven with the -e switch