More details of the release in https://wiki.openmrs.org/x/i4DTAw

Build: #796 was successful

Job: Default Job was successful

Build log

The build generated 1,857 lines of output.The output is too long and has been truncated to the last 1,000 lines. Download or view full build log

29-Nov-2019 08:53:36         at org.h2.command.CommandContainer.query(CommandContainer.java:91)
29-Nov-2019 08:53:36         at org.h2.command.Command.executeQuery(Command.java:195)
29-Nov-2019 08:53:36         at org.h2.jdbc.JdbcPreparedStatement.executeQuery(JdbcPreparedStatement.java:106)
29-Nov-2019 08:53:36         at com.mchange.v2.c3p0.impl.NewProxyPreparedStatement.executeQuery(NewProxyPreparedStatement.java:76)
29-Nov-2019 08:53:36         at org.openmrs.module.reporting.evaluation.querybuilder.SqlQueryBuilder$2.execute(SqlQueryBuilder.java:159)
29-Nov-2019 08:53:36         at org.hibernate.impl.SessionImpl.doWork(SessionImpl.java:1997)
29-Nov-2019 08:53:36         ... 95 more
29-Nov-2019 08:53:37 Tests run: 13, Failures: 0, Errors: 0, Skipped: 0, Time elapsed: 3.762 sec
29-Nov-2019 08:53:37 Running org.openmrs.module.reporting.evaluation.service.EvaluationServiceTest
29-Nov-2019 08:53:40 Tests run: 6, Failures: 0, Errors: 0, Skipped: 0, Time elapsed: 2.858 sec
29-Nov-2019 08:53:40 Running org.openmrs.module.reporting.data.obs.evaluator.EncounterToObsDataEvaluatorTest
29-Nov-2019 08:53:41 Tests run: 3, Failures: 0, Errors: 0, Skipped: 0, Time elapsed: 1.101 sec
29-Nov-2019 08:53:41 Running org.openmrs.module.reporting.query.encounter.evaluator.MappedParametersEncounterQueryEvaluatorTest
29-Nov-2019 08:53:42 Tests run: 1, Failures: 0, Errors: 0, Skipped: 0, Time elapsed: 0.268 sec
29-Nov-2019 08:53:42 Running org.openmrs.module.reporting.validator.InStateCohortDefinitionValidatorTest
29-Nov-2019 08:53:42 Tests run: 3, Failures: 0, Errors: 0, Skipped: 0, Time elapsed: 0.636 sec
29-Nov-2019 08:53:42 Running org.openmrs.module.reporting.common.ReflectionUtilTest
29-Nov-2019 08:53:42 Tests run: 6, Failures: 0, Errors: 0, Skipped: 0, Time elapsed: 0.005 sec
29-Nov-2019 08:53:42 Running org.openmrs.module.reporting.template.HandlebarsHelpersTest
29-Nov-2019 08:53:43 Tests run: 3, Failures: 0, Errors: 0, Skipped: 0, Time elapsed: 1.056 sec
29-Nov-2019 08:53:43 Running org.openmrs.module.reporting.data.visit.evaluator.VisitIdDataEvaluatorTest
29-Nov-2019 08:53:44 Tests run: 2, Failures: 0, Errors: 0, Skipped: 0, Time elapsed: 0.604 sec
29-Nov-2019 08:53:44 Running org.openmrs.module.reporting.cohort.definition.evaluator.ConditionalParameterCohortDefinitionEvaluatorTest
29-Nov-2019 08:53:44 Tests run: 1, Failures: 0, Errors: 0, Skipped: 0, Time elapsed: 0.335 sec
29-Nov-2019 08:53:44 Running org.openmrs.module.reporting.data.patient.evaluator.CurrentPatientStateDataEvaluatorTest
29-Nov-2019 08:53:45 Tests run: 1, Failures: 0, Errors: 0, Skipped: 0, Time elapsed: 0.332 sec
29-Nov-2019 08:53:45 Running org.openmrs.module.reporting.data.encounter.evaluator.ObsOnSameDateEncounterDataEvaluatorTest
29-Nov-2019 08:53:46 Tests run: 3, Failures: 0, Errors: 0, Skipped: 0, Time elapsed: 1.065 sec
29-Nov-2019 08:53:46 Running org.openmrs.module.reporting.cohort.query.service.CohortQueryServiceTest
29-Nov-2019 08:53:46 Tests run: 1, Failures: 0, Errors: 0, Skipped: 0, Time elapsed: 0.291 sec
29-Nov-2019 08:53:46 Running org.openmrs.module.reporting.data.person.evaluator.ObsForPersonDataEvaluatorTest
29-Nov-2019 08:53:47 Tests run: 3, Failures: 0, Errors: 0, Skipped: 0, Time elapsed: 1.109 sec
29-Nov-2019 08:53:47 Running org.openmrs.module.reporting.validator.StaticCohortDefinitionValidatorTest
29-Nov-2019 08:53:47 Tests run: 1, Failures: 0, Errors: 0, Skipped: 0, Time elapsed: 0.225 sec
29-Nov-2019 08:53:47 Running org.openmrs.module.reporting.dataset.definition.evaluator.EncounterDataSetEvaluatorTest
29-Nov-2019 08:53:48 ENCOUNTER ID        EMR ID        BIRTHDATE           ENCOUNTER DATE        Age At Start        Age At End        
29-Nov-2019 08:53:48 ------------        ------        ------------        --------------        ------------        ----------        
29-Nov-2019 08:53:48 3                   7             ~25/Aug/1976        01/Aug/2008           33                  34                
29-Nov-2019 08:53:48 4                   7             ~25/Aug/1976        15/Aug/2008           33                  34                
29-Nov-2019 08:53:48 5                   7             ~25/Aug/1976        19/Aug/2008           33                  34                
29-Nov-2019 08:53:48 6                   20            08/Feb/1925         19/Aug/2009           80                  80                
29-Nov-2019 08:53:48 7                   21            ~08/Jun/1959        19/Aug/2009           50                  51                
29-Nov-2019 08:53:48 8                   21            ~08/Jun/1959        19/Sep/2009           50                  51                
29-Nov-2019 08:53:48 9                   22            08/Jul/1997         19/Sep/2009           12                  13                
29-Nov-2019 08:53:48 10                  22            08/Jul/1997         19/Oct/2009           12                  13                
29-Nov-2019 08:53:48 11                  23            08/Nov/2000         19/Aug/2009           9                   10                
29-Nov-2019 08:53:48 12                  24            08/Dec/2006         19/Sep/2009           3                   4                 
29-Nov-2019 08:53:48 Tests run: 1, Failures: 0, Errors: 0, Skipped: 0, Time elapsed: 0.421 sec
29-Nov-2019 08:53:48 Running org.openmrs.module.reporting.data.person.evaluator.BirthdateDataEvaluatorTest
29-Nov-2019 08:53:48 Tests run: 1, Failures: 0, Errors: 0, Skipped: 0, Time elapsed: 0.335 sec
29-Nov-2019 08:53:48 Running org.openmrs.module.reporting.cohort.definition.evaluator.EncounterCohortDefinitionEvaluatorTest
29-Nov-2019 08:53:50 Tests run: 9, Failures: 0, Errors: 0, Skipped: 2, Time elapsed: 2.087 sec
29-Nov-2019 08:53:50 Running org.openmrs.module.reporting.data.person.evaluator.PreferredAddressDataEvaluatorTest
29-Nov-2019 08:53:51 Tests run: 1, Failures: 0, Errors: 0, Skipped: 0, Time elapsed: 0.299 sec
29-Nov-2019 08:53:51 Running org.openmrs.module.reporting.cohort.definition.evaluator.GenderCohortDefinitionEvaluatorTest
29-Nov-2019 08:53:52 Tests run: 5, Failures: 0, Errors: 0, Skipped: 0, Time elapsed: 1.706 sec
29-Nov-2019 08:53:52 Running org.openmrs.module.reporting.data.converter.BirthdateConverterTest
29-Nov-2019 08:53:52 Tests run: 1, Failures: 0, Errors: 0, Skipped: 0, Time elapsed: 0.212 sec
29-Nov-2019 08:53:52 Running org.openmrs.module.reporting.data.patient.evaluator.ProgramStatesForPatientDataEvaluatorTest
29-Nov-2019 08:53:55 Tests run: 9, Failures: 0, Errors: 0, Skipped: 0, Time elapsed: 2.434 sec
29-Nov-2019 08:53:55 Running org.openmrs.module.reporting.data.visit.library.BuiltInVisitDataLibraryTest
29-Nov-2019 08:53:55 Tests run: 1, Failures: 0, Errors: 0, Skipped: 0, Time elapsed: 0.217 sec
29-Nov-2019 08:53:55 Running org.openmrs.module.reporting.cohort.definition.evaluator.AgeCohortDefinitionEvaluatorTest
29-Nov-2019 08:53:56 Tests run: 5, Failures: 0, Errors: 0, Skipped: 0, Time elapsed: 1.151 sec
29-Nov-2019 08:53:56 Running org.openmrs.module.reporting.data.encounter.evaluator.EncounterLocationDataEvaluatorTest
29-Nov-2019 08:53:57 Tests run: 3, Failures: 0, Errors: 0, Skipped: 0, Time elapsed: 0.854 sec
29-Nov-2019 08:53:57 Running org.openmrs.module.reporting.data.obs.evaluator.PersonToObsEvaluatorTest
29-Nov-2019 08:53:58 Tests run: 3, Failures: 0, Errors: 0, Skipped: 0, Time elapsed: 1.018 sec
29-Nov-2019 08:53:58 Running org.openmrs.module.reporting.common.DateRangeTest
29-Nov-2019 08:53:58 Tests run: 9, Failures: 0, Errors: 0, Skipped: 0, Time elapsed: 0.008 sec
29-Nov-2019 08:53:58 Running org.openmrs.module.reporting.cohort.definition.evaluator.NumericObsCohortDefinitionEvaluatorTest
29-Nov-2019 08:54:01 Tests run: 11, Failures: 0, Errors: 0, Skipped: 0, Time elapsed: 3.249 sec
29-Nov-2019 08:54:01 Running org.openmrs.module.reporting.indicator.QueryCountIndicatorEvaluatorTest
29-Nov-2019 08:54:02 Tests run: 3, Failures: 0, Errors: 0, Skipped: 0, Time elapsed: 0.877 sec
29-Nov-2019 08:54:02 Running org.openmrs.module.reporting.data.encounter.evaluator.ObsForEncounterEvaluatorTest
29-Nov-2019 08:54:05 Tests run: 7, Failures: 0, Errors: 0, Skipped: 0, Time elapsed: 2.571 sec
29-Nov-2019 08:54:05 Running org.openmrs.module.reporting.common.DateUtilTest
29-Nov-2019 08:54:08 Tests run: 15, Failures: 0, Errors: 0, Skipped: 0, Time elapsed: 2.772 sec
29-Nov-2019 08:54:08 Running org.openmrs.module.reporting.data.patient.evaluator.DrugOrdersForPatientDataEvaluatorTest
29-Nov-2019 08:54:09 Tests run: 8, Failures: 0, Errors: 0, Skipped: 0, Time elapsed: 1.629 sec
29-Nov-2019 08:54:09 Running org.openmrs.module.reporting.query.encounter.evaluator.MappedParametersObsQueryEvaluatorTest
29-Nov-2019 08:54:09 Tests run: 1, Failures: 0, Errors: 0, Skipped: 0, Time elapsed: 0.273 sec
29-Nov-2019 08:54:09 Running org.openmrs.module.reporting.serializer.ReportingSerializerTest
29-Nov-2019 08:54:11 Tests run: 6, Failures: 0, Errors: 0, Skipped: 0, Time elapsed: 1.347 sec
29-Nov-2019 08:54:11 Running org.openmrs.module.reporting.dataset.definition.evaluator.CohortCrossTabDataSetEvaluatorTest
29-Nov-2019 08:54:11 Tests run: 1, Failures: 0, Errors: 0, Skipped: 0, Time elapsed: 0.313 sec
29-Nov-2019 08:54:11 Running org.openmrs.module.reporting.query.person.service.PersonQueryServiceImplTest
29-Nov-2019 08:54:12 Tests run: 2, Failures: 0, Errors: 0, Skipped: 0, Time elapsed: 0.604 sec
29-Nov-2019 08:54:12 Running org.openmrs.module.reporting.dataset.definition.evaluator.MySqlDataSetEvaluatorTest
29-Nov-2019 08:54:12 Tests run: 1, Failures: 0, Errors: 0, Skipped: 1, Time elapsed: 0.001 sec
29-Nov-2019 08:54:12 Running org.openmrs.module.reporting.report.renderer.TextTemplateRendererTest
29-Nov-2019 08:54:14 Tests run: 3, Failures: 0, Errors: 0, Skipped: 0, Time elapsed: 1.958 sec
29-Nov-2019 08:54:14 Running org.openmrs.module.reporting.validator.InverseCohortDefinitionValidatorTest
29-Nov-2019 08:54:14 Tests run: 2, Failures: 0, Errors: 0, Skipped: 0, Time elapsed: 0.501 sec
29-Nov-2019 08:54:14 Running org.openmrs.module.reporting.validator.PatientStateCohortDefinitionValidatorTest
29-Nov-2019 08:54:15 Tests run: 3, Failures: 0, Errors: 0, Skipped: 0, Time elapsed: 0.621 sec
29-Nov-2019 08:54:15 Running org.openmrs.module.reporting.report.service.db.PropertiesTypeTest
29-Nov-2019 08:54:15 Tests run: 1, Failures: 0, Errors: 0, Skipped: 0, Time elapsed: 0.002 sec
29-Nov-2019 08:54:15 Running org.openmrs.module.reporting.query.encounter.evaluator.ObsForEncounterQueryEvaluatorTest
29-Nov-2019 08:54:17 Tests run: 8, Failures: 0, Errors: 0, Skipped: 0, Time elapsed: 2.261 sec
29-Nov-2019 08:54:17 Running org.openmrs.module.reporting.data.encounter.service.EncounterDataServiceImplTest
29-Nov-2019 08:54:18 Tests run: 2, Failures: 0, Errors: 0, Skipped: 0, Time elapsed: 0.518 sec
29-Nov-2019 08:54:18 Running org.openmrs.module.reporting.cohort.definition.evaluator.MappedParametersCohortDefinitionEvaluatorTest
29-Nov-2019 08:54:18 Tests run: 1, Failures: 0, Errors: 0, Skipped: 0, Time elapsed: 0.3 sec
29-Nov-2019 08:54:18 Running org.openmrs.module.reporting.data.encounter.evaluator.ConvertedEncounterDataEvaluatorTest
29-Nov-2019 08:54:18 Tests run: 1, Failures: 0, Errors: 0, Skipped: 0, Time elapsed: 0.299 sec
29-Nov-2019 08:54:18 Running org.openmrs.module.reporting.data.patient.evaluator.PatientIdentifierDataEvaluatorTest
29-Nov-2019 08:54:19 Tests run: 4, Failures: 0, Errors: 0, Skipped: 0, Time elapsed: 1.225 sec
29-Nov-2019 08:54:19 Running org.openmrs.module.reporting.data.converter.ListConverterTest
29-Nov-2019 08:54:19 Tests run: 6, Failures: 0, Errors: 0, Skipped: 0, Time elapsed: 0.005 sec
29-Nov-2019 08:54:19 Running org.openmrs.module.reporting.data.converter.ObsFromObsGroupConverterTest
29-Nov-2019 08:54:20 Tests run: 2, Failures: 0, Errors: 0, Skipped: 0, Time elapsed: 0.4 sec
29-Nov-2019 08:54:20 Running org.openmrs.module.reporting.common.AgeTest
29-Nov-2019 08:54:20 Tests run: 5, Failures: 0, Errors: 0, Skipped: 0, Time elapsed: 0.003 sec
29-Nov-2019 08:54:20 Running org.openmrs.module.reporting.evaluation.CachingCohortDefinitionTest
29-Nov-2019 08:54:20 Tests run: 1, Failures: 0, Errors: 0, Skipped: 0, Time elapsed: 0.326 sec
29-Nov-2019 08:54:20 Running org.openmrs.module.reporting.common.TestUtil
29-Nov-2019 08:54:20 Tests run: 1, Failures: 0, Errors: 0, Skipped: 1, Time elapsed: 0.001 sec
29-Nov-2019 08:54:20 Running org.openmrs.module.reporting.query.encounter.evaluator.CompositionEncounterQueryEvaluatorTest
29-Nov-2019 08:54:22 Tests run: 4, Failures: 0, Errors: 0, Skipped: 0, Time elapsed: 1.337 sec
29-Nov-2019 08:54:22 Running org.openmrs.module.reporting.definition.library.implementerconfigured.ImplementerConfiguredVisitDataDefinitionLibraryTest
29-Nov-2019 08:54:22 Tests run: 2, Failures: 0, Errors: 0, Skipped: 0, Time elapsed: 0.447 sec
29-Nov-2019 08:54:22 Running org.openmrs.module.reporting.common.ObjectUtilTest
29-Nov-2019 08:54:27 Tests run: 23, Failures: 0, Errors: 0, Skipped: 0, Time elapsed: 4.726 sec
29-Nov-2019 08:54:27 Running org.openmrs.module.reporting.data.person.evaluator.AgeDataEvaluatorTest
29-Nov-2019 08:54:28 Tests run: 2, Failures: 0, Errors: 0, Skipped: 0, Time elapsed: 0.825 sec
29-Nov-2019 08:54:28 Running org.openmrs.module.reporting.evaluation.querybuilder.HqlQueryBuilderTest
29-Nov-2019 08:54:39 Tests run: 39, Failures: 0, Errors: 0, Skipped: 0, Time elapsed: 11.55 sec
29-Nov-2019 08:54:39 Running org.openmrs.module.reporting.data.visit.evaluator.ObsForVisitDataEvaluatorTest
29-Nov-2019 08:54:40 Tests run: 2, Failures: 0, Errors: 0, Skipped: 0, Time elapsed: 0.641 sec
29-Nov-2019 08:54:40 Running org.openmrs.module.reporting.query.encounter.evaluator.MostRecentEncounterForPatientQueryEvaluatorTest
29-Nov-2019 08:54:40 Tests run: 1, Failures: 0, Errors: 0, Skipped: 0, Time elapsed: 0.319 sec
29-Nov-2019 08:54:40 Running org.openmrs.module.reporting.cohort.definition.evaluator.OptionalParameterCohortDefinitionEvaluatorTest
29-Nov-2019 08:54:40 Tests run: 1, Failures: 0, Errors: 0, Skipped: 0, Time elapsed: 0.256 sec
29-Nov-2019 08:54:40 Running org.openmrs.module.reporting.report.util.SqlUtilsTest
29-Nov-2019 08:54:40 Tests run: 3, Failures: 0, Errors: 0, Skipped: 0, Time elapsed: 0.001 sec
29-Nov-2019 08:54:40 Running org.openmrs.module.reporting.validator.InProgramCohortDefinitionValidatorTest
29-Nov-2019 08:54:41 Tests run: 3, Failures: 0, Errors: 0, Skipped: 0, Time elapsed: 0.651 sec
29-Nov-2019 08:54:41 Running org.openmrs.module.reporting.data.obs.evaluator.PatientToObsDataEvaluatorTest
29-Nov-2019 08:54:42 Tests run: 3, Failures: 0, Errors: 0, Skipped: 0, Time elapsed: 0.862 sec
29-Nov-2019 08:54:42 Running org.openmrs.module.reporting.definition.library.BaseDefinitionLibraryTest
29-Nov-2019 08:54:43 Tests run: 4, Failures: 0, Errors: 0, Skipped: 0, Time elapsed: 0.727 sec
29-Nov-2019 08:54:43 Running org.openmrs.module.reporting.data.person.evaluator.PersonAttributeDataEvaluatorTest
29-Nov-2019 08:54:43 Tests run: 1, Failures: 0, Errors: 0, Skipped: 0, Time elapsed: 0.29 sec
29-Nov-2019 08:54:43 Running org.openmrs.module.reporting.data.person.evaluator.PreferredNameDataEvaluatorTest
29-Nov-2019 08:54:44 Tests run: 3, Failures: 0, Errors: 0, Skipped: 0, Time elapsed: 0.976 sec
29-Nov-2019 08:54:44 Running org.openmrs.module.reporting.definition.library.implementerconfigured.ImplementerConfiguredCohortDefinitionLibraryTest
29-Nov-2019 08:54:44 Tests run: 3, Failures: 0, Errors: 0, Skipped: 0, Time elapsed: 0.68 sec
29-Nov-2019 08:54:44 Running org.openmrs.module.reporting.evaluation.parameter.ParameterUtilTest
29-Nov-2019 08:54:45 Tests run: 2, Failures: 0, Errors: 0, Skipped: 0, Time elapsed: 0.36 sec
29-Nov-2019 08:54:45 Running org.openmrs.module.reporting.data.encounter.library.BuiltInEncounterDataLibraryTest
29-Nov-2019 08:54:46 Tests run: 6, Failures: 0, Errors: 0, Skipped: 0, Time elapsed: 1.462 sec
29-Nov-2019 08:54:46 Running org.openmrs.module.reporting.cohort.definition.evaluator.ScriptedCohortDefinitionEvaluatorTest
29-Nov-2019 08:54:47 Tests run: 1, Failures: 0, Errors: 0, Skipped: 0, Time elapsed: 0.342 sec
29-Nov-2019 08:54:47 Running org.openmrs.module.reporting.data.converter.PersonNameConverterTest
29-Nov-2019 08:54:47 Tests run: 1, Failures: 0, Errors: 0, Skipped: 0, Time elapsed: 0.185 sec
29-Nov-2019 08:54:47 Running org.openmrs.module.reporting.definition.library.AllDefinitionLibrariesComponentTest
29-Nov-2019 08:54:47 Tests run: 2, Failures: 0, Errors: 0, Skipped: 0, Time elapsed: 0.453 sec
29-Nov-2019 08:54:47 Running org.openmrs.module.reporting.data.person.evaluator.VitalStatusDataEvaluatorTest
29-Nov-2019 08:54:48 Tests run: 1, Failures: 0, Errors: 0, Skipped: 0, Time elapsed: 0.415 sec
29-Nov-2019 08:54:48 Running org.openmrs.module.reporting.dataset.definition.evaluator.PatientDataSetEvaluatorTest
29-Nov-2019 08:54:50 Tests run: 8, Failures: 0, Errors: 0, Skipped: 0, Time elapsed: 2.409 sec
29-Nov-2019 08:54:50 Running org.openmrs.module.reporting.cohort.definition.evaluator.TextObsCohortDefinitionEvaluatorTest
29-Nov-2019 08:54:51 Tests run: 2, Failures: 0, Errors: 0, Skipped: 0, Time elapsed: 0.599 sec
29-Nov-2019 08:54:51 Running org.openmrs.module.reporting.data.encounter.evaluator.AuditInfoEncounterDataEvaluatorTest
29-Nov-2019 08:54:51 Tests run: 1, Failures: 0, Errors: 0, Skipped: 0, Time elapsed: 0.24 sec
29-Nov-2019 08:54:51 Running org.openmrs.module.reporting.data.patient.evaluator.LogicDataEvaluatorTest
29-Nov-2019 08:54:51 Tests run: 1, Failures: 0, Errors: 0, Skipped: 1, Time elapsed: 0.001 sec
29-Nov-2019 08:54:51 Running org.openmrs.module.reporting.data.visit.evaluator.PersonToVisitDataEvaluatorTest
29-Nov-2019 08:54:52 Tests run: 3, Failures: 0, Errors: 0, Skipped: 0, Time elapsed: 0.851 sec
29-Nov-2019 08:54:52 Running org.openmrs.module.reporting.cohort.definition.evaluator.DateObsCohortDefinitionEvaluatorTest
29-Nov-2019 08:54:53 Tests run: 3, Failures: 0, Errors: 0, Skipped: 0, Time elapsed: 0.897 sec
29-Nov-2019 08:54:53 Running org.openmrs.module.reporting.cohort.definition.evaluator.VisitCohortDefinitionEvaluatorTest
29-Nov-2019 08:54:55 Tests run: 13, Failures: 0, Errors: 0, Skipped: 0, Time elapsed: 2.677 sec
29-Nov-2019 08:54:55 Running org.openmrs.module.reporting.data.encounter.evaluator.AgeAtEncounterDataEvaluatorTest
29-Nov-2019 08:54:56 Tests run: 1, Failures: 0, Errors: 0, Skipped: 0, Time elapsed: 0.29 sec
29-Nov-2019 08:54:56 Running org.openmrs.module.reporting.indicator.CohortIndicatorDataSetEvaluatorTest
29-Nov-2019 08:54:56 Tests run: 1, Failures: 0, Errors: 0, Skipped: 0, Time elapsed: 0.33 sec
29-Nov-2019 08:54:56 Running org.openmrs.module.reporting.data.person.evaluator.ObsActiveListPersonDataEvaluatorTest
29-Nov-2019 08:54:56 Tests run: 1, Failures: 0, Errors: 0, Skipped: 0, Time elapsed: 0.365 sec
29-Nov-2019 08:54:56 Running org.openmrs.module.reporting.common.ExcelUtilTest
29-Nov-2019 08:54:58 Tests run: 5, Failures: 0, Errors: 0, Skipped: 0, Time elapsed: 1.32 sec
29-Nov-2019 08:54:58 Running org.openmrs.module.reporting.data.obs.evaluator.GroupMemberObsDataEvaluatorTest
29-Nov-2019 08:54:59 Tests run: 5, Failures: 0, Errors: 0, Skipped: 2, Time elapsed: 1.001 sec
29-Nov-2019 08:54:59 Running org.openmrs.module.reporting.query.visit.evaluator.BasicVisitQueryEvaluatorTest
29-Nov-2019 08:55:00 Tests run: 3, Failures: 0, Errors: 0, Skipped: 0, Time elapsed: 1.054 sec
29-Nov-2019 08:55:00 Running org.openmrs.module.reporting.common.ExcelBuilderTest
29-Nov-2019 08:55:04 Tests run: 3, Failures: 0, Errors: 0, Skipped: 0, Time elapsed: 4.092 sec
29-Nov-2019 08:55:04 Running org.openmrs.module.reporting.query.obs.evaluator.AllObsQueryEvaluatorTest
29-Nov-2019 08:55:05 Tests run: 5, Failures: 0, Errors: 0, Skipped: 0, Time elapsed: 1.48 sec
29-Nov-2019 08:55:05 Running org.openmrs.module.reporting.cohort.definition.evaluator.AllPatientsCohortDefinitionEvaluatorTest
29-Nov-2019 08:55:06 Tests run: 1, Failures: 0, Errors: 0, Skipped: 0, Time elapsed: 0.265 sec
29-Nov-2019 08:55:06 Running org.openmrs.module.reporting.data.encounter.evaluator.SimultaneousEncountersDataEvaluatorTest
29-Nov-2019 08:55:06 Tests run: 2, Failures: 0, Errors: 0, Skipped: 0, Time elapsed: 0.473 sec
29-Nov-2019 08:55:06 Running org.openmrs.module.reporting.validator.ProgramEnrollmentCohortDefinitionValidatorTest
29-Nov-2019 08:55:07 Tests run: 3, Failures: 0, Errors: 0, Skipped: 0, Time elapsed: 0.552 sec
29-Nov-2019 08:55:07 Running org.openmrs.module.reporting.evaluation.EvaluationContextTest
29-Nov-2019 08:55:07 Tests run: 4, Failures: 0, Errors: 0, Skipped: 0, Time elapsed: 0.812 sec
29-Nov-2019 08:55:07 Running org.openmrs.module.reporting.data.patient.evaluator.PreferredIdentifierDataEvaluatorTest
29-Nov-2019 08:55:08 Tests run: 2, Failures: 0, Errors: 0, Skipped: 0, Time elapsed: 0.569 sec
29-Nov-2019 08:55:08 Running org.openmrs.module.reporting.data.encounter.evaluator.EncounterVisitDataEvaluatorTest
29-Nov-2019 08:55:08 Tests run: 1, Failures: 0, Errors: 0, Skipped: 0, Time elapsed: 0.304 sec
29-Nov-2019 08:55:08 Running org.openmrs.module.reporting.query.obs.service.ObsQueryServiceImplTest
29-Nov-2019 08:55:09 Tests run: 2, Failures: 0, Errors: 0, Skipped: 1, Time elapsed: 0.277 sec
29-Nov-2019 08:55:09 Running org.openmrs.module.reporting.data.patient.library.BuiltInPatientDataLibraryTest
29-Nov-2019 08:55:09 Tests run: 4, Failures: 0, Errors: 0, Skipped: 0, Time elapsed: 0.868 sec
29-Nov-2019 08:55:09 Running org.openmrs.module.reporting.indicator.util.IndicatorUtilTest
29-Nov-2019 08:55:09 Tests run: 1, Failures: 0, Errors: 0, Skipped: 0, Time elapsed: 0.002 sec
29-Nov-2019 08:55:09 Running org.openmrs.module.reporting.cohort.definition.evaluator.EvaluatableCohortDefinitionEvaluatorTest
29-Nov-2019 08:55:10 Tests run: 1, Failures: 0, Errors: 0, Skipped: 0, Time elapsed: 0.255 sec
29-Nov-2019 08:55:10 Running org.openmrs.module.reporting.data.patient.evaluator.ConvertedPatientDataEvaluatorTest
29-Nov-2019 08:55:10 Tests run: 2, Failures: 0, Errors: 0, Skipped: 0, Time elapsed: 0.599 sec
29-Nov-2019 08:55:10 Running org.openmrs.module.reporting.cohort.definition.evaluator.CompositionCohortDefinitionEvaluatorTest
29-Nov-2019 08:55:12 Tests run: 4, Failures: 0, Errors: 0, Skipped: 0, Time elapsed: 1.383 sec
29-Nov-2019 08:55:12 Running org.openmrs.module.reporting.data.converter.MapConverterTest
29-Nov-2019 08:55:12 Tests run: 5, Failures: 0, Errors: 0, Skipped: 0, Time elapsed: 0.009 sec
29-Nov-2019 08:55:12 Running org.openmrs.module.reporting.data.patient.evaluator.EncountersForPatientDataEvaluatorTest
29-Nov-2019 08:55:12 Tests run: 1, Failures: 0, Errors: 0, Skipped: 0, Time elapsed: 0.454 sec
29-Nov-2019 08:55:12 Running org.openmrs.module.reporting.indicator.SqlIndicatorTest
29-Nov-2019 08:55:13 ERROR - EvaluationProfiler.log(111) |2019-11-29 08:55:13,950| 1336        2019-11-29 08:55:13.950        >        ERROR        EVALUATING_DEFINITION                        SqlIndicator[sql=SELECT distinct(.222) as res, 33 as res2 from patient]: Failed to evaluate sql because:
29-Nov-2019 08:55:13 Unable to evaluate to a single value. Exactly one column must be defined.
29-Nov-2019 08:55:13 org.openmrs.module.reporting.evaluation.EvaluationException: Failed to evaluate sql because:
29-Nov-2019 08:55:13 Unable to evaluate to a single value. Exactly one column must be defined.
29-Nov-2019 08:55:13         at org.openmrs.module.reporting.indicator.evaluator.SqlIndicatorEvaluator.evaluateSql(SqlIndicatorEvaluator.java:57)
29-Nov-2019 08:55:13         at org.openmrs.module.reporting.indicator.evaluator.SqlIndicatorEvaluator.evaluate(SqlIndicatorEvaluator.java:41)
29-Nov-2019 08:55:13         at org.openmrs.module.reporting.indicator.evaluator.SqlIndicatorEvaluator.evaluate(SqlIndicatorEvaluator.java:28)
29-Nov-2019 08:55:13         at org.openmrs.module.reporting.definition.service.BaseDefinitionService.executeEvaluator(BaseDefinitionService.java:369)
29-Nov-2019 08:55:13         at org.openmrs.module.reporting.definition.service.BaseDefinitionService.evaluateBypassingExclusionOfTestPatients(BaseDefinitionService.java:264)
29-Nov-2019 08:55:13         at org.openmrs.module.reporting.definition.service.BaseDefinitionService.evaluate(BaseDefinitionService.java:229)
29-Nov-2019 08:55:13         at org.openmrs.module.reporting.indicator.service.IndicatorServiceImpl.evaluate(IndicatorServiceImpl.java:41)
29-Nov-2019 08:55:13         at sun.reflect.NativeMethodAccessorImpl.invoke0(Native Method)
29-Nov-2019 08:55:13         at sun.reflect.NativeMethodAccessorImpl.invoke(NativeMethodAccessorImpl.java:62)
29-Nov-2019 08:55:13         at sun.reflect.DelegatingMethodAccessorImpl.invoke(DelegatingMethodAccessorImpl.java:43)
29-Nov-2019 08:55:13         at java.lang.reflect.Method.invoke(Method.java:498)
29-Nov-2019 08:55:13         at org.springframework.aop.support.AopUtils.invokeJoinpointUsingReflection(AopUtils.java:309)
29-Nov-2019 08:55:13         at org.springframework.aop.framework.ReflectiveMethodInvocation.invokeJoinpoint(ReflectiveMethodInvocation.java:183)
29-Nov-2019 08:55:13         at org.springframework.aop.framework.ReflectiveMethodInvocation.proceed(ReflectiveMethodInvocation.java:150)
29-Nov-2019 08:55:13         at org.openmrs.aop.LoggingAdvice.invoke(LoggingAdvice.java:118)
29-Nov-2019 08:55:13         at org.springframework.aop.framework.ReflectiveMethodInvocation.proceed(ReflectiveMethodInvocation.java:172)
29-Nov-2019 08:55:13         at org.springframework.aop.framework.adapter.MethodBeforeAdviceInterceptor.invoke(MethodBeforeAdviceInterceptor.java:50)
29-Nov-2019 08:55:13         at org.springframework.aop.framework.ReflectiveMethodInvocation.proceed(ReflectiveMethodInvocation.java:172)
29-Nov-2019 08:55:13         at org.springframework.aop.framework.adapter.MethodBeforeAdviceInterceptor.invoke(MethodBeforeAdviceInterceptor.java:50)
29-Nov-2019 08:55:13         at org.springframework.aop.framework.ReflectiveMethodInvocation.proceed(ReflectiveMethodInvocation.java:172)
29-Nov-2019 08:55:13         at org.springframework.aop.framework.JdkDynamicAopProxy.invoke(JdkDynamicAopProxy.java:202)
29-Nov-2019 08:55:13         at com.sun.proxy.$Proxy38.evaluate(Unknown Source)
29-Nov-2019 08:55:13         at sun.reflect.NativeMethodAccessorImpl.invoke0(Native Method)
29-Nov-2019 08:55:13         at sun.reflect.NativeMethodAccessorImpl.invoke(NativeMethodAccessorImpl.java:62)
29-Nov-2019 08:55:13         at sun.reflect.DelegatingMethodAccessorImpl.invoke(DelegatingMethodAccessorImpl.java:43)
29-Nov-2019 08:55:13         at java.lang.reflect.Method.invoke(Method.java:498)
29-Nov-2019 08:55:13         at org.springframework.aop.support.AopUtils.invokeJoinpointUsingReflection(AopUtils.java:309)
29-Nov-2019 08:55:13         at org.springframework.aop.framework.JdkDynamicAopProxy.invoke(JdkDynamicAopProxy.java:196)
29-Nov-2019 08:55:13         at com.sun.proxy.$Proxy136.evaluate(Unknown Source)
29-Nov-2019 08:55:13         at org.openmrs.module.reporting.indicator.SqlIndicatorTest.assertIndicatorValue(SqlIndicatorTest.java:94)
29-Nov-2019 08:55:13         at org.openmrs.module.reporting.indicator.SqlIndicatorTest.assertIndicatorValue(SqlIndicatorTest.java:103)
29-Nov-2019 08:55:13         at org.openmrs.module.reporting.indicator.SqlIndicatorTest.assertIndicatorValue(SqlIndicatorTest.java:114)
29-Nov-2019 08:55:13         at org.openmrs.module.reporting.indicator.SqlIndicatorTest.assertIndicatorValue(SqlIndicatorTest.java:107)
29-Nov-2019 08:55:13         at org.openmrs.module.reporting.indicator.SqlIndicatorTest.sqlIndicator_shouldNotAllowQueriesThatReturnMoreThanOneColumn(SqlIndicatorTest.java:85)
29-Nov-2019 08:55:13         at sun.reflect.NativeMethodAccessorImpl.invoke0(Native Method)
29-Nov-2019 08:55:13         at sun.reflect.NativeMethodAccessorImpl.invoke(NativeMethodAccessorImpl.java:62)
29-Nov-2019 08:55:13         at sun.reflect.DelegatingMethodAccessorImpl.invoke(DelegatingMethodAccessorImpl.java:43)
29-Nov-2019 08:55:13         at java.lang.reflect.Method.invoke(Method.java:498)
29-Nov-2019 08:55:13         at org.junit.runners.model.FrameworkMethod$1.runReflectiveCall(FrameworkMethod.java:47)
29-Nov-2019 08:55:13         at org.junit.internal.runners.model.ReflectiveCallable.run(ReflectiveCallable.java:12)
29-Nov-2019 08:55:13         at org.junit.runners.model.FrameworkMethod.invokeExplosively(FrameworkMethod.java:44)
29-Nov-2019 08:55:13         at org.junit.internal.runners.statements.InvokeMethod.evaluate(InvokeMethod.java:17)
29-Nov-2019 08:55:13         at org.junit.internal.runners.statements.ExpectException.evaluate(ExpectException.java:19)
29-Nov-2019 08:55:13         at org.junit.internal.runners.statements.RunBefores.evaluate(RunBefores.java:26)
29-Nov-2019 08:55:13         at org.springframework.test.context.junit4.statements.RunBeforeTestMethodCallbacks.evaluate(RunBeforeTestMethodCallbacks.java:74)
29-Nov-2019 08:55:13         at org.junit.internal.runners.statements.RunAfters.evaluate(RunAfters.java:27)
29-Nov-2019 08:55:13         at org.springframework.test.context.junit4.statements.RunAfterTestMethodCallbacks.evaluate(RunAfterTestMethodCallbacks.java:82)
29-Nov-2019 08:55:13         at org.springframework.test.context.junit4.statements.SpringRepeat.evaluate(SpringRepeat.java:72)
29-Nov-2019 08:55:13         at org.springframework.test.context.junit4.SpringJUnit4ClassRunner.runChild(SpringJUnit4ClassRunner.java:240)
29-Nov-2019 08:55:13         at org.junit.runners.BlockJUnit4ClassRunner.runChild(BlockJUnit4ClassRunner.java:50)
29-Nov-2019 08:55:13         at org.junit.runners.ParentRunner$3.run(ParentRunner.java:238)
29-Nov-2019 08:55:13         at org.junit.runners.ParentRunner$1.schedule(ParentRunner.java:63)
29-Nov-2019 08:55:13         at org.junit.runners.ParentRunner.runChildren(ParentRunner.java:236)
29-Nov-2019 08:55:13         at org.junit.runners.ParentRunner.access$000(ParentRunner.java:53)
29-Nov-2019 08:55:13         at org.junit.runners.ParentRunner$2.evaluate(ParentRunner.java:229)
29-Nov-2019 08:55:13         at org.springframework.test.context.junit4.statements.RunBeforeTestClassCallbacks.evaluate(RunBeforeTestClassCallbacks.java:61)
29-Nov-2019 08:55:13         at org.junit.internal.runners.statements.RunAfters.evaluate(RunAfters.java:27)
29-Nov-2019 08:55:13         at org.springframework.test.context.junit4.statements.RunAfterTestClassCallbacks.evaluate(RunAfterTestClassCallbacks.java:70)
29-Nov-2019 08:55:13         at org.junit.runners.ParentRunner.run(ParentRunner.java:309)
29-Nov-2019 08:55:13         at org.springframework.test.context.junit4.SpringJUnit4ClassRunner.run(SpringJUnit4ClassRunner.java:180)
29-Nov-2019 08:55:13         at org.apache.maven.surefire.junit4.JUnit4TestSet.execute(JUnit4TestSet.java:59)
29-Nov-2019 08:55:13         at org.apache.maven.surefire.suite.AbstractDirectoryTestSuite.executeTestSet(AbstractDirectoryTestSuite.java:115)
29-Nov-2019 08:55:13         at org.apache.maven.surefire.suite.AbstractDirectoryTestSuite.execute(AbstractDirectoryTestSuite.java:102)
29-Nov-2019 08:55:13         at org.apache.maven.surefire.Surefire.run(Surefire.java:180)
29-Nov-2019 08:55:13         at sun.reflect.NativeMethodAccessorImpl.invoke0(Native Method)
29-Nov-2019 08:55:13         at sun.reflect.NativeMethodAccessorImpl.invoke(NativeMethodAccessorImpl.java:62)
29-Nov-2019 08:55:13         at sun.reflect.DelegatingMethodAccessorImpl.invoke(DelegatingMethodAccessorImpl.java:43)
29-Nov-2019 08:55:13         at java.lang.reflect.Method.invoke(Method.java:498)
29-Nov-2019 08:55:13         at org.apache.maven.surefire.booter.SurefireBooter.runSuitesInProcess(SurefireBooter.java:350)
29-Nov-2019 08:55:13         at org.apache.maven.surefire.booter.SurefireBooter.main(SurefireBooter.java:1021)
29-Nov-2019 08:55:13 Caused by: java.lang.IllegalArgumentException: Unable to evaluate to a single value. Exactly one column must be defined.
29-Nov-2019 08:55:13         at org.openmrs.module.reporting.evaluation.service.EvaluationServiceImpl.evaluateToObject(EvaluationServiceImpl.java:90)
29-Nov-2019 08:55:13         at sun.reflect.NativeMethodAccessorImpl.invoke0(Native Method)
29-Nov-2019 08:55:13         at sun.reflect.NativeMethodAccessorImpl.invoke(NativeMethodAccessorImpl.java:62)
29-Nov-2019 08:55:13         at sun.reflect.DelegatingMethodAccessorImpl.invoke(DelegatingMethodAccessorImpl.java:43)
29-Nov-2019 08:55:13         at java.lang.reflect.Method.invoke(Method.java:498)
29-Nov-2019 08:55:13         at org.springframework.aop.support.AopUtils.invokeJoinpointUsingReflection(AopUtils.java:309)
29-Nov-2019 08:55:13         at org.springframework.aop.framework.ReflectiveMethodInvocation.invokeJoinpoint(ReflectiveMethodInvocation.java:183)
29-Nov-2019 08:55:13         at org.springframework.aop.framework.ReflectiveMethodInvocation.proceed(ReflectiveMethodInvocation.java:150)
29-Nov-2019 08:55:13         at org.springframework.transaction.interceptor.TransactionInterceptor.invoke(TransactionInterceptor.java:110)
29-Nov-2019 08:55:13         at org.springframework.aop.framework.ReflectiveMethodInvocation.proceed(ReflectiveMethodInvocation.java:172)
29-Nov-2019 08:55:13         at org.openmrs.aop.LoggingAdvice.invoke(LoggingAdvice.java:118)
29-Nov-2019 08:55:13         at org.springframework.aop.framework.ReflectiveMethodInvocation.proceed(ReflectiveMethodInvocation.java:172)
29-Nov-2019 08:55:13         at org.springframework.aop.framework.adapter.MethodBeforeAdviceInterceptor.invoke(MethodBeforeAdviceInterceptor.java:50)
29-Nov-2019 08:55:13         at org.springframework.aop.framework.ReflectiveMethodInvocation.proceed(ReflectiveMethodInvocation.java:172)
29-Nov-2019 08:55:13         at org.springframework.aop.framework.adapter.MethodBeforeAdviceInterceptor.invoke(MethodBeforeAdviceInterceptor.java:50)
29-Nov-2019 08:55:13         at org.springframework.aop.framework.ReflectiveMethodInvocation.proceed(ReflectiveMethodInvocation.java:172)
29-Nov-2019 08:55:13         at org.springframework.aop.framework.JdkDynamicAopProxy.invoke(JdkDynamicAopProxy.java:202)
29-Nov-2019 08:55:13         at com.sun.proxy.$Proxy25.evaluateToObject(Unknown Source)
29-Nov-2019 08:55:13         at sun.reflect.NativeMethodAccessorImpl.invoke0(Native Method)
29-Nov-2019 08:55:13         at sun.reflect.NativeMethodAccessorImpl.invoke(NativeMethodAccessorImpl.java:62)
29-Nov-2019 08:55:13         at sun.reflect.DelegatingMethodAccessorImpl.invoke(DelegatingMethodAccessorImpl.java:43)
29-Nov-2019 08:55:13         at java.lang.reflect.Method.invoke(Method.java:498)
29-Nov-2019 08:55:13         at org.springframework.aop.support.AopUtils.invokeJoinpointUsingReflection(AopUtils.java:309)
29-Nov-2019 08:55:13         at org.springframework.aop.framework.ReflectiveMethodInvocation.invokeJoinpoint(ReflectiveMethodInvocation.java:183)
29-Nov-2019 08:55:13         at org.springframework.aop.framework.ReflectiveMethodInvocation.proceed(ReflectiveMethodInvocation.java:150)
29-Nov-2019 08:55:13         at org.springframework.transaction.interceptor.TransactionInterceptor.invoke(TransactionInterceptor.java:110)
29-Nov-2019 08:55:13         at org.springframework.aop.framework.ReflectiveMethodInvocation.proceed(ReflectiveMethodInvocation.java:172)
29-Nov-2019 08:55:13         at org.springframework.aop.framework.JdkDynamicAopProxy.invoke(JdkDynamicAopProxy.java:202)
29-Nov-2019 08:55:13         at com.sun.proxy.$Proxy121.evaluateToObject(Unknown Source)
29-Nov-2019 08:55:13         at org.openmrs.module.reporting.indicator.evaluator.SqlIndicatorEvaluator.evaluateSql(SqlIndicatorEvaluator.java:54)
29-Nov-2019 08:55:13         ... 69 more
29-Nov-2019 08:55:14 ERROR - EvaluationProfiler.log(111) |2019-11-29 08:55:14,962| 1344        2019-11-29 08:55:14.962        >        ERROR        EVALUATING_DEFINITION                        SqlIndicator[sql=SELECT person_id from person]: Failed to evaluate sql because:
29-Nov-2019 08:55:14 Unable to evaluate to a single value. Exactly one row must be returned by query.
29-Nov-2019 08:55:14 org.openmrs.module.reporting.evaluation.EvaluationException: Failed to evaluate sql because:
29-Nov-2019 08:55:14 Unable to evaluate to a single value. Exactly one row must be returned by query.
29-Nov-2019 08:55:14         at org.openmrs.module.reporting.indicator.evaluator.SqlIndicatorEvaluator.evaluateSql(SqlIndicatorEvaluator.java:57)
29-Nov-2019 08:55:14         at org.openmrs.module.reporting.indicator.evaluator.SqlIndicatorEvaluator.evaluate(SqlIndicatorEvaluator.java:41)
29-Nov-2019 08:55:14         at org.openmrs.module.reporting.indicator.evaluator.SqlIndicatorEvaluator.evaluate(SqlIndicatorEvaluator.java:28)
29-Nov-2019 08:55:14         at org.openmrs.module.reporting.definition.service.BaseDefinitionService.executeEvaluator(BaseDefinitionService.java:369)
29-Nov-2019 08:55:14         at org.openmrs.module.reporting.definition.service.BaseDefinitionService.evaluateBypassingExclusionOfTestPatients(BaseDefinitionService.java:264)
29-Nov-2019 08:55:14         at org.openmrs.module.reporting.definition.service.BaseDefinitionService.evaluate(BaseDefinitionService.java:229)
29-Nov-2019 08:55:14         at org.openmrs.module.reporting.indicator.service.IndicatorServiceImpl.evaluate(IndicatorServiceImpl.java:41)
29-Nov-2019 08:55:14         at sun.reflect.GeneratedMethodAccessor1037.invoke(Unknown Source)
29-Nov-2019 08:55:14         at sun.reflect.DelegatingMethodAccessorImpl.invoke(DelegatingMethodAccessorImpl.java:43)
29-Nov-2019 08:55:14         at java.lang.reflect.Method.invoke(Method.java:498)
29-Nov-2019 08:55:14         at org.springframework.aop.support.AopUtils.invokeJoinpointUsingReflection(AopUtils.java:309)
29-Nov-2019 08:55:14         at org.springframework.aop.framework.ReflectiveMethodInvocation.invokeJoinpoint(ReflectiveMethodInvocation.java:183)
29-Nov-2019 08:55:14         at org.springframework.aop.framework.ReflectiveMethodInvocation.proceed(ReflectiveMethodInvocation.java:150)
29-Nov-2019 08:55:14         at org.openmrs.aop.LoggingAdvice.invoke(LoggingAdvice.java:118)
29-Nov-2019 08:55:14         at org.springframework.aop.framework.ReflectiveMethodInvocation.proceed(ReflectiveMethodInvocation.java:172)
29-Nov-2019 08:55:14         at org.springframework.aop.framework.adapter.MethodBeforeAdviceInterceptor.invoke(MethodBeforeAdviceInterceptor.java:50)
29-Nov-2019 08:55:14         at org.springframework.aop.framework.ReflectiveMethodInvocation.proceed(ReflectiveMethodInvocation.java:172)
29-Nov-2019 08:55:14         at org.springframework.aop.framework.adapter.MethodBeforeAdviceInterceptor.invoke(MethodBeforeAdviceInterceptor.java:50)
29-Nov-2019 08:55:14         at org.springframework.aop.framework.ReflectiveMethodInvocation.proceed(ReflectiveMethodInvocation.java:172)
29-Nov-2019 08:55:14         at org.springframework.aop.framework.JdkDynamicAopProxy.invoke(JdkDynamicAopProxy.java:202)
29-Nov-2019 08:55:14         at com.sun.proxy.$Proxy38.evaluate(Unknown Source)
29-Nov-2019 08:55:14         at sun.reflect.GeneratedMethodAccessor1037.invoke(Unknown Source)
29-Nov-2019 08:55:14         at sun.reflect.DelegatingMethodAccessorImpl.invoke(DelegatingMethodAccessorImpl.java:43)
29-Nov-2019 08:55:14         at java.lang.reflect.Method.invoke(Method.java:498)
29-Nov-2019 08:55:14         at org.springframework.aop.support.AopUtils.invokeJoinpointUsingReflection(AopUtils.java:309)
29-Nov-2019 08:55:14         at org.springframework.aop.framework.JdkDynamicAopProxy.invoke(JdkDynamicAopProxy.java:196)
29-Nov-2019 08:55:14         at com.sun.proxy.$Proxy136.evaluate(Unknown Source)
29-Nov-2019 08:55:14         at org.openmrs.module.reporting.indicator.SqlIndicatorTest.assertIndicatorValue(SqlIndicatorTest.java:94)
29-Nov-2019 08:55:14         at org.openmrs.module.reporting.indicator.SqlIndicatorTest.assertIndicatorValue(SqlIndicatorTest.java:103)
29-Nov-2019 08:55:14         at org.openmrs.module.reporting.indicator.SqlIndicatorTest.assertIndicatorValue(SqlIndicatorTest.java:114)
29-Nov-2019 08:55:14         at org.openmrs.module.reporting.indicator.SqlIndicatorTest.assertIndicatorValue(SqlIndicatorTest.java:107)
29-Nov-2019 08:55:14         at org.openmrs.module.reporting.indicator.SqlIndicatorTest.sqlIndicator_shouldNotAllowQueriesThatReturnMoreThanOneRow(SqlIndicatorTest.java:90)
29-Nov-2019 08:55:14         at sun.reflect.NativeMethodAccessorImpl.invoke0(Native Method)
29-Nov-2019 08:55:14         at sun.reflect.NativeMethodAccessorImpl.invoke(NativeMethodAccessorImpl.java:62)
29-Nov-2019 08:55:14         at sun.reflect.DelegatingMethodAccessorImpl.invoke(DelegatingMethodAccessorImpl.java:43)
29-Nov-2019 08:55:14         at java.lang.reflect.Method.invoke(Method.java:498)
29-Nov-2019 08:55:14         at org.junit.runners.model.FrameworkMethod$1.runReflectiveCall(FrameworkMethod.java:47)
29-Nov-2019 08:55:14         at org.junit.internal.runners.model.ReflectiveCallable.run(ReflectiveCallable.java:12)
29-Nov-2019 08:55:14         at org.junit.runners.model.FrameworkMethod.invokeExplosively(FrameworkMethod.java:44)
29-Nov-2019 08:55:14         at org.junit.internal.runners.statements.InvokeMethod.evaluate(InvokeMethod.java:17)
29-Nov-2019 08:55:14         at org.junit.internal.runners.statements.ExpectException.evaluate(ExpectException.java:19)
29-Nov-2019 08:55:14         at org.junit.internal.runners.statements.RunBefores.evaluate(RunBefores.java:26)
29-Nov-2019 08:55:14         at org.springframework.test.context.junit4.statements.RunBeforeTestMethodCallbacks.evaluate(RunBeforeTestMethodCallbacks.java:74)
29-Nov-2019 08:55:14         at org.junit.internal.runners.statements.RunAfters.evaluate(RunAfters.java:27)
29-Nov-2019 08:55:14         at org.springframework.test.context.junit4.statements.RunAfterTestMethodCallbacks.evaluate(RunAfterTestMethodCallbacks.java:82)
29-Nov-2019 08:55:14         at org.springframework.test.context.junit4.statements.SpringRepeat.evaluate(SpringRepeat.java:72)
29-Nov-2019 08:55:14         at org.springframework.test.context.junit4.SpringJUnit4ClassRunner.runChild(SpringJUnit4ClassRunner.java:240)
29-Nov-2019 08:55:14         at org.junit.runners.BlockJUnit4ClassRunner.runChild(BlockJUnit4ClassRunner.java:50)
29-Nov-2019 08:55:14         at org.junit.runners.ParentRunner$3.run(ParentRunner.java:238)
29-Nov-2019 08:55:14         at org.junit.runners.ParentRunner$1.schedule(ParentRunner.java:63)
29-Nov-2019 08:55:14         at org.junit.runners.ParentRunner.runChildren(ParentRunner.java:236)
29-Nov-2019 08:55:14         at org.junit.runners.ParentRunner.access$000(ParentRunner.java:53)
29-Nov-2019 08:55:14         at org.junit.runners.ParentRunner$2.evaluate(ParentRunner.java:229)
29-Nov-2019 08:55:14         at org.springframework.test.context.junit4.statements.RunBeforeTestClassCallbacks.evaluate(RunBeforeTestClassCallbacks.java:61)
29-Nov-2019 08:55:14         at org.junit.internal.runners.statements.RunAfters.evaluate(RunAfters.java:27)
29-Nov-2019 08:55:14         at org.springframework.test.context.junit4.statements.RunAfterTestClassCallbacks.evaluate(RunAfterTestClassCallbacks.java:70)
29-Nov-2019 08:55:14         at org.junit.runners.ParentRunner.run(ParentRunner.java:309)
29-Nov-2019 08:55:14         at org.springframework.test.context.junit4.SpringJUnit4ClassRunner.run(SpringJUnit4ClassRunner.java:180)
29-Nov-2019 08:55:14         at org.apache.maven.surefire.junit4.JUnit4TestSet.execute(JUnit4TestSet.java:59)
29-Nov-2019 08:55:14         at org.apache.maven.surefire.suite.AbstractDirectoryTestSuite.executeTestSet(AbstractDirectoryTestSuite.java:115)
29-Nov-2019 08:55:14         at org.apache.maven.surefire.suite.AbstractDirectoryTestSuite.execute(AbstractDirectoryTestSuite.java:102)
29-Nov-2019 08:55:14         at org.apache.maven.surefire.Surefire.run(Surefire.java:180)
29-Nov-2019 08:55:14         at sun.reflect.NativeMethodAccessorImpl.invoke0(Native Method)
29-Nov-2019 08:55:14         at sun.reflect.NativeMethodAccessorImpl.invoke(NativeMethodAccessorImpl.java:62)
29-Nov-2019 08:55:14         at sun.reflect.DelegatingMethodAccessorImpl.invoke(DelegatingMethodAccessorImpl.java:43)
29-Nov-2019 08:55:14         at java.lang.reflect.Method.invoke(Method.java:498)
29-Nov-2019 08:55:14         at org.apache.maven.surefire.booter.SurefireBooter.runSuitesInProcess(SurefireBooter.java:350)
29-Nov-2019 08:55:14         at org.apache.maven.surefire.booter.SurefireBooter.main(SurefireBooter.java:1021)
29-Nov-2019 08:55:14 Caused by: java.lang.IllegalArgumentException: Unable to evaluate to a single value. Exactly one row must be returned by query.
29-Nov-2019 08:55:14         at org.openmrs.module.reporting.evaluation.service.EvaluationServiceImpl.evaluateToObject(EvaluationServiceImpl.java:86)
29-Nov-2019 08:55:14         at sun.reflect.GeneratedMethodAccessor1040.invoke(Unknown Source)
29-Nov-2019 08:55:14         at sun.reflect.DelegatingMethodAccessorImpl.invoke(DelegatingMethodAccessorImpl.java:43)
29-Nov-2019 08:55:14         at java.lang.reflect.Method.invoke(Method.java:498)
29-Nov-2019 08:55:14         at org.springframework.aop.support.AopUtils.invokeJoinpointUsingReflection(AopUtils.java:309)
29-Nov-2019 08:55:14         at org.springframework.aop.framework.ReflectiveMethodInvocation.invokeJoinpoint(ReflectiveMethodInvocation.java:183)
29-Nov-2019 08:55:14         at org.springframework.aop.framework.ReflectiveMethodInvocation.proceed(ReflectiveMethodInvocation.java:150)
29-Nov-2019 08:55:14         at org.springframework.transaction.interceptor.TransactionInterceptor.invoke(TransactionInterceptor.java:110)
29-Nov-2019 08:55:14         at org.springframework.aop.framework.ReflectiveMethodInvocation.proceed(ReflectiveMethodInvocation.java:172)
29-Nov-2019 08:55:14         at org.openmrs.aop.LoggingAdvice.invoke(LoggingAdvice.java:118)
29-Nov-2019 08:55:14         at org.springframework.aop.framework.ReflectiveMethodInvocation.proceed(ReflectiveMethodInvocation.java:172)
29-Nov-2019 08:55:14         at org.springframework.aop.framework.adapter.MethodBeforeAdviceInterceptor.invoke(MethodBeforeAdviceInterceptor.java:50)
29-Nov-2019 08:55:14         at org.springframework.aop.framework.ReflectiveMethodInvocation.proceed(ReflectiveMethodInvocation.java:172)
29-Nov-2019 08:55:14         at org.springframework.aop.framework.adapter.MethodBeforeAdviceInterceptor.invoke(MethodBeforeAdviceInterceptor.java:50)
29-Nov-2019 08:55:14         at org.springframework.aop.framework.ReflectiveMethodInvocation.proceed(ReflectiveMethodInvocation.java:172)
29-Nov-2019 08:55:14         at org.springframework.aop.framework.JdkDynamicAopProxy.invoke(JdkDynamicAopProxy.java:202)
29-Nov-2019 08:55:14         at com.sun.proxy.$Proxy25.evaluateToObject(Unknown Source)
29-Nov-2019 08:55:14         at sun.reflect.GeneratedMethodAccessor1040.invoke(Unknown Source)
29-Nov-2019 08:55:14         at sun.reflect.DelegatingMethodAccessorImpl.invoke(DelegatingMethodAccessorImpl.java:43)
29-Nov-2019 08:55:14         at java.lang.reflect.Method.invoke(Method.java:498)
29-Nov-2019 08:55:14         at org.springframework.aop.support.AopUtils.invokeJoinpointUsingReflection(AopUtils.java:309)
29-Nov-2019 08:55:14         at org.springframework.aop.framework.ReflectiveMethodInvocation.invokeJoinpoint(ReflectiveMethodInvocation.java:183)
29-Nov-2019 08:55:14         at org.springframework.aop.framework.ReflectiveMethodInvocation.proceed(ReflectiveMethodInvocation.java:150)
29-Nov-2019 08:55:14         at org.springframework.transaction.interceptor.TransactionInterceptor.invoke(TransactionInterceptor.java:110)
29-Nov-2019 08:55:14         at org.springframework.aop.framework.ReflectiveMethodInvocation.proceed(ReflectiveMethodInvocation.java:172)
29-Nov-2019 08:55:14         at org.springframework.aop.framework.JdkDynamicAopProxy.invoke(JdkDynamicAopProxy.java:202)
29-Nov-2019 08:55:14         at com.sun.proxy.$Proxy121.evaluateToObject(Unknown Source)
29-Nov-2019 08:55:14         at org.openmrs.module.reporting.indicator.evaluator.SqlIndicatorEvaluator.evaluateSql(SqlIndicatorEvaluator.java:54)
29-Nov-2019 08:55:14         ... 67 more
29-Nov-2019 08:55:15 Tests run: 8, Failures: 0, Errors: 0, Skipped: 0, Time elapsed: 2.684 sec
29-Nov-2019 08:55:15 Running org.openmrs.module.reporting.report.renderer.ExcelTemplateRendererTest
29-Nov-2019 08:55:15 Tests run: 2, Failures: 0, Errors: 0, Skipped: 0, Time elapsed: 0.602 sec
29-Nov-2019 08:55:15 Running org.openmrs.module.reporting.cohort.CohortsTest
29-Nov-2019 08:55:16 Tests run: 3, Failures: 0, Errors: 0, Skipped: 0, Time elapsed: 0.517 sec
29-Nov-2019 08:55:16 Running org.openmrs.module.reporting.data.converter.StringConverterTest
29-Nov-2019 08:55:16 Tests run: 1, Failures: 0, Errors: 0, Skipped: 0, Time elapsed: 0.001 sec
29-Nov-2019 08:55:16 Running org.openmrs.module.reporting.dataset.definition.evaluator.RepeatPerTimePeriodDataSetEvaluatorTest
29-Nov-2019 08:55:16 Tests run: 4, Failures: 0, Errors: 0, Skipped: 0, Time elapsed: 0.072 sec
29-Nov-2019 08:55:16 Running org.openmrs.module.reporting.data.JoinDataDefinitionTest
29-Nov-2019 08:55:16 Tests run: 2, Failures: 0, Errors: 0, Skipped: 0, Time elapsed: 0.001 sec
29-Nov-2019 08:55:16 Running org.openmrs.module.reporting.query.obs.evaluator.BasicObsQueryEvaluatorTest
29-Nov-2019 08:55:16 Tests run: 1, Failures: 0, Errors: 0, Skipped: 0, Time elapsed: 0.373 sec
29-Nov-2019 08:55:16 Running org.openmrs.module.reporting.query.person.evaluator.PatientPersonQueryEvaluatorTest
29-Nov-2019 08:55:17 Tests run: 1, Failures: 0, Errors: 0, Skipped: 0, Time elapsed: 0.307 sec
29-Nov-2019 08:55:17 Running org.openmrs.module.reporting.data.patient.evaluator.ScriptedCompositionPatientDataEvaluatorTest
29-Nov-2019 08:55:17 Tests run: 2, Failures: 0, Errors: 0, Skipped: 0, Time elapsed: 0.685 sec
29-Nov-2019 08:55:17 Running org.openmrs.module.reporting.definition.library.implementerconfigured.ImplementerConfiguredEncounterDataDefinitionLibraryTest
29-Nov-2019 08:55:18 Tests run: 2, Failures: 0, Errors: 0, Skipped: 0, Time elapsed: 0.354 sec
29-Nov-2019 08:55:18 Running org.openmrs.module.reporting.data.encounter.evaluator.PersonToEncounterDataEvaluatorTest
29-Nov-2019 08:55:19 Tests run: 3, Failures: 0, Errors: 0, Skipped: 0, Time elapsed: 0.831 sec
29-Nov-2019 08:55:19 Running org.openmrs.module.reporting.data.visit.evaluator.PatientToVisitDataEvaluatorTest
29-Nov-2019 08:55:19 {1=102, 4=12345K}
29-Nov-2019 08:55:20 Tests run: 3, Failures: 0, Errors: 0, Skipped: 0, Time elapsed: 0.988 sec
29-Nov-2019 08:55:20 Running org.openmrs.module.reporting.validator.CompositionCohortDefinitionValidatorTest
29-Nov-2019 08:55:21 Tests run: 5, Failures: 0, Errors: 0, Skipped: 0, Time elapsed: 0.951 sec
29-Nov-2019 08:55:21 Running org.openmrs.module.reporting.cohort.definition.evaluator.InProgramCohortDefinitionEvaluatorTest
29-Nov-2019 08:55:22 Tests run: 5, Failures: 0, Errors: 0, Skipped: 0, Time elapsed: 1.546 sec
29-Nov-2019 08:55:22 Running org.openmrs.module.reporting.calculation.PatientDataCalculationBehaviorTest
29-Nov-2019 08:55:23 Tests run: 3, Failures: 0, Errors: 0, Skipped: 0, Time elapsed: 0.968 sec
29-Nov-2019 08:55:23 Running org.openmrs.module.reporting.dataset.definition.evaluator.CohortIndicatorDataSetEvaluatorTest
29-Nov-2019 08:55:23 Tests run: 1, Failures: 0, Errors: 0, Skipped: 0, Time elapsed: 0.35 sec
29-Nov-2019 08:55:23 Running org.openmrs.module.reporting.query.encounter.evaluator.AuditEncounterQueryEvaluatorTest
29-Nov-2019 08:55:25 Tests run: 5, Failures: 0, Errors: 0, Skipped: 0, Time elapsed: 1.639 sec
29-Nov-2019 08:55:25 Running org.openmrs.module.reporting.definition.service.DefinitionServiceTest
29-Nov-2019 08:55:25 Tests run: 1, Failures: 0, Errors: 0, Skipped: 0, Time elapsed: 0.247 sec
29-Nov-2019 08:55:25 Running org.openmrs.module.reporting.indicator.aggregation.AggregationTest
29-Nov-2019 08:55:25 Tests run: 12, Failures: 0, Errors: 0, Skipped: 0, Time elapsed: 0.004 sec
29-Nov-2019 08:55:25 Running org.openmrs.module.reporting.data.person.evaluator.ConvertedPersonDataEvaluatorTest
29-Nov-2019 08:55:26 Tests run: 1, Failures: 0, Errors: 0, Skipped: 0, Time elapsed: 0.299 sec
29-Nov-2019 08:55:26 Running org.openmrs.module.reporting.query.encounter.evaluator.SqlEncounterQueryEvaluatorTest
29-Nov-2019 08:55:26 Tests run: 3, Failures: 0, Errors: 0, Skipped: 0, Time elapsed: 0.887 sec
29-Nov-2019 08:55:26 Running org.openmrs.module.reporting.report.renderer.CsvReportRendererTest
29-Nov-2019 08:55:27 Tests run: 1, Failures: 0, Errors: 0, Skipped: 0, Time elapsed: 0.234 sec
29-Nov-2019 08:55:27 Running org.openmrs.module.reporting.dataset.definition.evaluator.LogicDataSetEvaluatorTest
29-Nov-2019 08:55:27 Tests run: 1, Failures: 0, Errors: 0, Skipped: 1, Time elapsed: 0 sec
29-Nov-2019 08:55:27 Running org.openmrs.module.reporting.dataset.definition.evaluator.VisitDataSetEvaluatorTest
29-Nov-2019 08:55:27 VISIT ID        EMR ID        BIRTHDATE          
29-Nov-2019 08:55:27 --------        ------        -----------        
29-Nov-2019 08:55:27 1               2             08/Apr/1975        
29-Nov-2019 08:55:27 2               2             08/Apr/1975        
29-Nov-2019 08:55:27 3               2             08/Apr/1975        
29-Nov-2019 08:55:27 4               6             27/May/2007        
29-Nov-2019 08:55:27 5               6             27/May/2007        
29-Nov-2019 08:55:27 Tests run: 1, Failures: 0, Errors: 0, Skipped: 0, Time elapsed: 0.32 sec
29-Nov-2019 08:55:27 Running org.openmrs.module.reporting.data.person.evaluator.PersonIdDataEvaluatorTest
29-Nov-2019 08:55:27 Tests run: 1, Failures: 0, Errors: 0, Skipped: 0, Time elapsed: 0.272 sec
29-Nov-2019 08:55:27 Running org.openmrs.module.reporting.cohort.definition.evaluator.BirthAndDeathCohortDefinitionEvaluatorTest
29-Nov-2019 08:55:30 Tests run: 8, Failures: 0, Errors: 0, Skipped: 0, Time elapsed: 2.473 sec
29-Nov-2019 08:55:30 Running org.openmrs.module.reporting.data.encounter.evaluator.SqlEncounterDataEvaluatorTest
29-Nov-2019 08:55:30 Tests run: 1, Failures: 0, Errors: 0, Skipped: 0, Time elapsed: 0.263 sec
29-Nov-2019 08:55:30 Running org.openmrs.module.reporting.data.converter.PersonAddressConverterTest
29-Nov-2019 08:55:30 Tests run: 1, Failures: 0, Errors: 0, Skipped: 0, Time elapsed: 0.199 sec
29-Nov-2019 08:55:30 Running org.openmrs.module.reporting.data.converter.AttributeValueConverterTest
29-Nov-2019 08:55:31 Tests run: 2, Failures: 0, Errors: 0, Skipped: 0, Time elapsed: 0.489 sec
29-Nov-2019 08:55:31 Running org.openmrs.module.reporting.common.DelimitedKeyComparatorTest
29-Nov-2019 08:55:31 Tests run: 1, Failures: 0, Errors: 0, Skipped: 0, Time elapsed: 0.001 sec
29-Nov-2019 08:55:31 Running org.openmrs.module.reporting.data.obs.evaluator.ConvertedObsDataEvaluatorTest
29-Nov-2019 08:55:31 Tests run: 1, Failures: 0, Errors: 0, Skipped: 0, Time elapsed: 0.252 sec
29-Nov-2019 08:55:31 Running org.openmrs.module.reporting.query.person.evaluator.SqlPersonQueryEvaluatorTest
29-Nov-2019 08:55:31 Tests run: 2, Failures: 0, Errors: 0, Skipped: 0, Time elapsed: 0.533 sec
29-Nov-2019 08:55:31 Running org.openmrs.module.reporting.query.person.evaluator.AllPersonQueryEvaluatorTest
29-Nov-2019 08:55:33 Tests run: 6, Failures: 0, Errors: 0, Skipped: 0, Time elapsed: 1.613 sec
29-Nov-2019 08:55:33 Running org.openmrs.module.reporting.dataset.definition.evaluator.SqlFileDataSetEvaluatorTest
29-Nov-2019 08:55:34 Tests run: 2, Failures: 0, Errors: 0, Skipped: 0, Time elapsed: 0.495 sec
29-Nov-2019 08:55:34 Running org.openmrs.module.reporting.data.person.evaluator.AgeAtDateOfOtherDataEvaluatorTest
29-Nov-2019 08:55:34 Tests run: 1, Failures: 0, Errors: 0, Skipped: 0, Time elapsed: 0.336 sec
29-Nov-2019 08:55:34 Running org.openmrs.module.reporting.indicator.PeriodIndicatorReportTest
29-Nov-2019 08:55:34 Tests run: 2, Failures: 0, Errors: 0, Skipped: 0, Time elapsed: 0.55 sec
29-Nov-2019 08:55:34 Running org.openmrs.module.reporting.report.renderer.DelimitedTextReportRendererTest
29-Nov-2019 08:55:37 Tests run: 11, Failures: 0, Errors: 0, Skipped: 0, Time elapsed: 2.131 sec
29-Nov-2019 08:55:37 Running org.openmrs.module.reporting.data.patient.evaluator.PatientObjectDataEvaluatorTest
29-Nov-2019 08:55:37 Tests run: 1, Failures: 0, Errors: 0, Skipped: 0, Time elapsed: 0.266 sec
29-Nov-2019 08:55:37 Running org.openmrs.module.reporting.data.patient.evaluator.TestPatientCalculation
29-Nov-2019 08:55:37 Tests run: 1, Failures: 0, Errors: 0, Skipped: 1, Time elapsed: 0.001 sec
29-Nov-2019 08:55:37 Running org.openmrs.module.reporting.validator.SqlCohortDefinitionValidatorTest
29-Nov-2019 08:55:37 Tests run: 3, Failures: 0, Errors: 0, Skipped: 0, Time elapsed: 0.508 sec
29-Nov-2019 08:55:37 Running org.openmrs.module.reporting.cohort.definition.evaluator.PatientStateCohortDefinitionEvaluatorTest
29-Nov-2019 08:55:39 Tests run: 7, Failures: 0, Errors: 0, Skipped: 0, Time elapsed: 2.078 sec
29-Nov-2019 08:55:39 Running org.openmrs.module.reporting.data.converter.NullValueConverterTest
29-Nov-2019 08:55:39 Tests run: 1, Failures: 0, Errors: 0, Skipped: 0, Time elapsed: 0.001 sec
29-Nov-2019 08:55:39 Running org.openmrs.module.reporting.query.encounter.evaluator.ConditionalParameterEncounterQueryEvaluatorTest
29-Nov-2019 08:55:40 Tests run: 1, Failures: 0, Errors: 0, Skipped: 0, Time elapsed: 0.279 sec
29-Nov-2019 08:55:40 Running org.openmrs.module.reporting.report.service.TestReportProcessor
29-Nov-2019 08:55:40 Tests run: 1, Failures: 0, Errors: 0, Skipped: 1, Time elapsed: 0.001 sec
29-Nov-2019 08:55:40 Running org.openmrs.module.reporting.common.FractionTest
29-Nov-2019 08:55:40 Tests run: 7, Failures: 0, Errors: 0, Skipped: 0, Time elapsed: 0.005 sec
29-Nov-2019 08:55:40 Running org.openmrs.module.reporting.report.renderer.ReportDesignRendererTest
29-Nov-2019 08:55:40 Tests run: 2, Failures: 0, Errors: 0, Skipped: 0, Time elapsed: 0.439 sec
29-Nov-2019 08:55:40 Running org.openmrs.module.reporting.data.patient.evaluator.ProgramEnrollmentsForPatientDataEvaluatorTest
29-Nov-2019 08:55:43 Tests run: 8, Failures: 0, Errors: 0, Skipped: 0, Time elapsed: 2.363 sec
29-Nov-2019 08:55:43 Running org.openmrs.module.reporting.data.visit.evaluator.OrderForVisitDataEvaluatorTest
29-Nov-2019 08:55:43 Tests run: 2, Failures: 0, Errors: 0, Skipped: 0, Time elapsed: 0.694 sec
29-Nov-2019 08:55:43 Running org.openmrs.module.reporting.report.util.SqlScriptParserTest
29-Nov-2019 08:55:43 Tests run: 4, Failures: 0, Errors: 0, Skipped: 0, Time elapsed: 0.008 sec
29-Nov-2019 08:55:43 Running org.openmrs.module.reporting.definition.library.implementerconfigured.ImplementerConfiguredDataSetDefinitionLibraryTest
29-Nov-2019 08:55:44 Tests run: 3, Failures: 0, Errors: 0, Skipped: 0, Time elapsed: 0.997 sec
29-Nov-2019 08:55:44 Running org.openmrs.module.reporting.cohort.definition.evaluator.PresenceOrAbsenceCohortDefinitionEvaluatorTest
29-Nov-2019 08:55:45 Tests run: 3, Failures: 0, Errors: 0, Skipped: 0, Time elapsed: 1.019 sec
29-Nov-2019 08:55:45 Running org.openmrs.module.reporting.report.definition.service.ReportDefinitionServiceImplTest
29-Nov-2019 08:55:46 Tests run: 2, Failures: 0, Errors: 0, Skipped: 0, Time elapsed: 0.493 sec
29-Nov-2019 08:55:46 Running org.openmrs.module.reporting.data.converter.ObsValueTextAsCodedConverterTest
29-Nov-2019 08:55:46 Tests run: 3, Failures: 0, Errors: 0, Skipped: 0, Time elapsed: 0.637 sec
29-Nov-2019 08:55:46 Running org.openmrs.module.reporting.cohort.definition.service.BaseCohortDefinitionServiceTest
29-Nov-2019 08:55:47 Tests run: 1, Failures: 0, Errors: 0, Skipped: 0, Time elapsed: 0.268 sec
29-Nov-2019 08:55:47 Running org.openmrs.module.reporting.cohort.definition.evaluator.InStateCohortDefinitionEvaluatorTest
29-Nov-2019 08:55:47 Cohort: Cohort id=null size=2
29-Nov-2019 08:55:49 Tests run: 7, Failures: 0, Errors: 0, Skipped: 0, Time elapsed: 2.263 sec
29-Nov-2019 08:55:49 Running org.openmrs.module.reporting.data.patient.evaluator.DefinitionLibraryPatientDataEvaluatorTest
29-Nov-2019 08:55:50 Tests run: 3, Failures: 0, Errors: 0, Skipped: 0, Time elapsed: 0.95 sec
29-Nov-2019 08:55:50 Running org.openmrs.module.reporting.cohort.definition.evaluator.DefinitionLibraryCohortDefinitionEvaluatorTest
29-Nov-2019 08:55:51 Tests run: 3, Failures: 0, Errors: 0, Skipped: 0, Time elapsed: 0.912 sec
29-Nov-2019 08:55:51 Running org.openmrs.module.reporting.dataset.definition.evaluator.CohortsWithVaryingParametersDataSetEvaluatorTest
29-Nov-2019 08:55:51 Tests run: 1, Failures: 0, Errors: 0, Skipped: 0, Time elapsed: 0.313 sec
29-Nov-2019 08:55:51 Running org.openmrs.module.reporting.dataset.definition.evaluator.ObsDataSetEvaluatorTest
29-Nov-2019 08:55:51 Tests run: 1, Failures: 0, Errors: 0, Skipped: 0, Time elapsed: 0.333 sec
29-Nov-2019 08:55:51 Running org.openmrs.module.reporting.data.patient.evaluator.SqlPatientDataEvaluatorTest
29-Nov-2019 08:55:52 Tests run: 1, Failures: 0, Errors: 0, Skipped: 0, Time elapsed: 0.285 sec
29-Nov-2019 08:55:52 Running org.openmrs.module.reporting.data.converter.PrivilegedDataConverterTest
29-Nov-2019 08:55:52 SLF4J: Class path contains multiple SLF4J bindings.
29-Nov-2019 08:55:52 SLF4J: Found binding in [jar:file:/home/bamboo-agent/.m2/repository/org/slf4j/slf4j-log4j12/1.6.0/slf4j-log4j12-1.6.0.jar!/org/slf4j/impl/StaticLoggerBinder.class]
29-Nov-2019 08:55:52 SLF4J: Found binding in [jar:file:/home/bamboo-agent/.m2/repository/org/slf4j/slf4j-log4j12/1.6.0/slf4j-log4j12-1.6.0.jar!/org/slf4j/impl/StaticLoggerBinder.class]
29-Nov-2019 08:55:52 SLF4J: See http://www.slf4j.org/codes.html#multiple_bindings for an explanation.
29-Nov-2019 08:55:53 Tests run: 2, Failures: 0, Errors: 0, Skipped: 0, Time elapsed: 0.954 sec
29-Nov-2019 08:55:53 Running org.openmrs.module.reporting.data.patient.evaluator.PatientCalculationDataEvaluatorTest
29-Nov-2019 08:55:53 ERROR - EvaluationProfiler.log(111) |2019-11-29 08:55:53,490| 1768        2019-11-29 08:55:53.490        >        ERROR        EVALUATING_DEFINITION                        PatientCalculationDataDefinition[Example]: Failed to evaluate No PatientCalculation found on this PatientCalculationDataDefinition
29-Nov-2019 08:55:53 org.openmrs.module.reporting.evaluation.EvaluationException: Failed to evaluate No PatientCalculation found on this PatientCalculationDataDefinition
29-Nov-2019 08:55:53         at org.openmrs.module.reporting.data.patient.evaluator.PatientCalculationDataEvaluator.evaluate(PatientCalculationDataEvaluator.java:50)
29-Nov-2019 08:55:53         at org.openmrs.module.reporting.data.patient.evaluator.PatientCalculationDataEvaluator.evaluate(PatientCalculationDataEvaluator.java:34)
29-Nov-2019 08:55:53         at org.openmrs.module.reporting.definition.service.BaseDefinitionService.executeEvaluator(BaseDefinitionService.java:369)
29-Nov-2019 08:55:53         at org.openmrs.module.reporting.data.patient.service.PatientDataServiceImpl.executeEvaluator(PatientDataServiceImpl.java:66)
29-Nov-2019 08:55:53         at org.openmrs.module.reporting.data.patient.service.PatientDataServiceImpl.executeEvaluator(PatientDataServiceImpl.java:34)
29-Nov-2019 08:55:53         at org.openmrs.module.reporting.definition.service.BaseDefinitionService.evaluateBypassingExclusionOfTestPatients(BaseDefinitionService.java:264)
29-Nov-2019 08:55:53         at org.openmrs.module.reporting.definition.service.BaseDefinitionService.evaluate(BaseDefinitionService.java:229)
29-Nov-2019 08:55:53         at org.openmrs.module.reporting.data.patient.service.PatientDataServiceImpl.evaluate(PatientDataServiceImpl.java:48)
29-Nov-2019 08:55:53         at sun.reflect.GeneratedMethodAccessor733.invoke(Unknown Source)
29-Nov-2019 08:55:53         at sun.reflect.DelegatingMethodAccessorImpl.invoke(DelegatingMethodAccessorImpl.java:43)
29-Nov-2019 08:55:53         at java.lang.reflect.Method.invoke(Method.java:498)
29-Nov-2019 08:55:53         at org.springframework.aop.support.AopUtils.invokeJoinpointUsingReflection(AopUtils.java:309)
29-Nov-2019 08:55:53         at org.springframework.aop.framework.ReflectiveMethodInvocation.invokeJoinpoint(ReflectiveMethodInvocation.java:183)
29-Nov-2019 08:55:53         at org.springframework.aop.framework.ReflectiveMethodInvocation.proceed(ReflectiveMethodInvocation.java:150)
29-Nov-2019 08:55:53         at org.openmrs.aop.LoggingAdvice.invoke(LoggingAdvice.java:118)
29-Nov-2019 08:55:53         at org.springframework.aop.framework.ReflectiveMethodInvocation.proceed(ReflectiveMethodInvocation.java:172)
29-Nov-2019 08:55:53         at org.springframework.aop.framework.adapter.MethodBeforeAdviceInterceptor.invoke(MethodBeforeAdviceInterceptor.java:50)
29-Nov-2019 08:55:53         at org.springframework.aop.framework.ReflectiveMethodInvocation.proceed(ReflectiveMethodInvocation.java:172)
29-Nov-2019 08:55:53         at org.springframework.aop.framework.adapter.MethodBeforeAdviceInterceptor.invoke(MethodBeforeAdviceInterceptor.java:50)
29-Nov-2019 08:55:53         at org.springframework.aop.framework.ReflectiveMethodInvocation.proceed(ReflectiveMethodInvocation.java:172)
29-Nov-2019 08:55:53         at org.springframework.aop.framework.JdkDynamicAopProxy.invoke(JdkDynamicAopProxy.java:202)
29-Nov-2019 08:55:53         at com.sun.proxy.$Proxy28.evaluate(Unknown Source)
29-Nov-2019 08:55:53         at sun.reflect.GeneratedMethodAccessor733.invoke(Unknown Source)
29-Nov-2019 08:55:53         at sun.reflect.DelegatingMethodAccessorImpl.invoke(DelegatingMethodAccessorImpl.java:43)
29-Nov-2019 08:55:53         at java.lang.reflect.Method.invoke(Method.java:498)
29-Nov-2019 08:55:53         at org.springframework.aop.support.AopUtils.invokeJoinpointUsingReflection(AopUtils.java:309)
29-Nov-2019 08:55:53         at org.springframework.aop.framework.JdkDynamicAopProxy.invoke(JdkDynamicAopProxy.java:196)
29-Nov-2019 08:55:53         at com.sun.proxy.$Proxy124.evaluate(Unknown Source)
29-Nov-2019 08:55:53         at org.openmrs.module.reporting.data.patient.evaluator.PatientCalculationDataEvaluatorTest.evaluate_shouldThrowAnErrorIfNoCalculationRegistrationExistsOnTheDefinition(PatientCalculationDataEvaluatorTest.java:90)
29-Nov-2019 08:55:53         at sun.reflect.NativeMethodAccessorImpl.invoke0(Native Method)
29-Nov-2019 08:55:53         at sun.reflect.NativeMethodAccessorImpl.invoke(NativeMethodAccessorImpl.java:62)
29-Nov-2019 08:55:53         at sun.reflect.DelegatingMethodAccessorImpl.invoke(DelegatingMethodAccessorImpl.java:43)
29-Nov-2019 08:55:53         at java.lang.reflect.Method.invoke(Method.java:498)
29-Nov-2019 08:55:53         at org.junit.runners.model.FrameworkMethod$1.runReflectiveCall(FrameworkMethod.java:47)
29-Nov-2019 08:55:53         at org.junit.internal.runners.model.ReflectiveCallable.run(ReflectiveCallable.java:12)
29-Nov-2019 08:55:53         at org.junit.runners.model.FrameworkMethod.invokeExplosively(FrameworkMethod.java:44)
29-Nov-2019 08:55:53         at org.junit.internal.runners.statements.InvokeMethod.evaluate(InvokeMethod.java:17)
29-Nov-2019 08:55:53         at org.junit.internal.runners.statements.ExpectException.evaluate(ExpectException.java:19)
29-Nov-2019 08:55:53         at org.junit.internal.runners.statements.RunBefores.evaluate(RunBefores.java:26)
29-Nov-2019 08:55:53         at org.springframework.test.context.junit4.statements.RunBeforeTestMethodCallbacks.evaluate(RunBeforeTestMethodCallbacks.java:74)
29-Nov-2019 08:55:53         at org.junit.internal.runners.statements.RunAfters.evaluate(RunAfters.java:27)
29-Nov-2019 08:55:53         at org.springframework.test.context.junit4.statements.RunAfterTestMethodCallbacks.evaluate(RunAfterTestMethodCallbacks.java:82)
29-Nov-2019 08:55:53         at org.springframework.test.context.junit4.statements.SpringRepeat.evaluate(SpringRepeat.java:72)
29-Nov-2019 08:55:53         at org.springframework.test.context.junit4.SpringJUnit4ClassRunner.runChild(SpringJUnit4ClassRunner.java:240)
29-Nov-2019 08:55:53         at org.junit.runners.BlockJUnit4ClassRunner.runChild(BlockJUnit4ClassRunner.java:50)
29-Nov-2019 08:55:53         at org.junit.runners.ParentRunner$3.run(ParentRunner.java:238)
29-Nov-2019 08:55:53         at org.junit.runners.ParentRunner$1.schedule(ParentRunner.java:63)
29-Nov-2019 08:55:53         at org.junit.runners.ParentRunner.runChildren(ParentRunner.java:236)
29-Nov-2019 08:55:53         at org.junit.runners.ParentRunner.access$000(ParentRunner.java:53)
29-Nov-2019 08:55:53         at org.junit.runners.ParentRunner$2.evaluate(ParentRunner.java:229)
29-Nov-2019 08:55:53         at org.springframework.test.context.junit4.statements.RunBeforeTestClassCallbacks.evaluate(RunBeforeTestClassCallbacks.java:61)
29-Nov-2019 08:55:53         at org.junit.internal.runners.statements.RunAfters.evaluate(RunAfters.java:27)
29-Nov-2019 08:55:53         at org.springframework.test.context.junit4.statements.RunAfterTestClassCallbacks.evaluate(RunAfterTestClassCallbacks.java:70)
29-Nov-2019 08:55:53         at org.junit.runners.ParentRunner.run(ParentRunner.java:309)
29-Nov-2019 08:55:53         at org.springframework.test.context.junit4.SpringJUnit4ClassRunner.run(SpringJUnit4ClassRunner.java:180)
29-Nov-2019 08:55:53         at org.apache.maven.surefire.junit4.JUnit4TestSet.execute(JUnit4TestSet.java:59)
29-Nov-2019 08:55:53         at org.apache.maven.surefire.suite.AbstractDirectoryTestSuite.executeTestSet(AbstractDirectoryTestSuite.java:115)
29-Nov-2019 08:55:53         at org.apache.maven.surefire.suite.AbstractDirectoryTestSuite.execute(AbstractDirectoryTestSuite.java:102)
29-Nov-2019 08:55:53         at org.apache.maven.surefire.Surefire.run(Surefire.java:180)
29-Nov-2019 08:55:53         at sun.reflect.NativeMethodAccessorImpl.invoke0(Native Method)
29-Nov-2019 08:55:53         at sun.reflect.NativeMethodAccessorImpl.invoke(NativeMethodAccessorImpl.java:62)
29-Nov-2019 08:55:53         at sun.reflect.DelegatingMethodAccessorImpl.invoke(DelegatingMethodAccessorImpl.java:43)
29-Nov-2019 08:55:53         at java.lang.reflect.Method.invoke(Method.java:498)
29-Nov-2019 08:55:53         at org.apache.maven.surefire.booter.SurefireBooter.runSuitesInProcess(SurefireBooter.java:350)
29-Nov-2019 08:55:53         at org.apache.maven.surefire.booter.SurefireBooter.main(SurefireBooter.java:1021)
29-Nov-2019 08:55:53 Tests run: 2, Failures: 0, Errors: 0, Skipped: 0, Time elapsed: 0.609 sec
29-Nov-2019 08:55:53 Running org.openmrs.module.reporting.data.converter.DateConverterTest
29-Nov-2019 08:55:53 Tests run: 1, Failures: 0, Errors: 0, Skipped: 0, Time elapsed: 0.003 sec
29-Nov-2019 08:55:53 Running org.openmrs.module.reporting.dataset.definition.evaluator.EncounterAndObsDataSetEvaluatorTest
29-Nov-2019 08:55:54 Tests run: 1, Failures: 0, Errors: 0, Skipped: 0, Time elapsed: 0.422 sec
29-Nov-2019 08:55:54 Running org.openmrs.module.reporting.data.encounter.evaluator.PatientToEncounterDataEvaluatorTest
29-Nov-2019 08:55:55 Tests run: 3, Failures: 0, Errors: 0, Skipped: 0, Time elapsed: 0.94 sec
29-Nov-2019 08:55:55 Running org.openmrs.module.reporting.data.patient.evaluator.PatientIdDataEvaluatorTest
29-Nov-2019 08:55:55 Tests run: 1, Failures: 0, Errors: 0, Skipped: 0, Time elapsed: 0.27 sec
29-Nov-2019 08:55:55 Running org.openmrs.module.reporting.data.person.evaluator.RelationshipsForPersonDataEvaluatorTest
29-Nov-2019 08:55:56 Tests run: 3, Failures: 0, Errors: 0, Skipped: 0, Time elapsed: 0.848 sec
29-Nov-2019 08:55:56 Running org.openmrs.module.reporting.data.patient.evaluator.PersonToPatientDataEvaluatorTest
29-Nov-2019 08:55:56 Tests run: 1, Failures: 0, Errors: 0, Skipped: 0, Time elapsed: 0.261 sec
29-Nov-2019 08:55:56 Running org.openmrs.module.reporting.data.patient.service.PatientDataServiceImplTest
29-Nov-2019 08:55:58 Tests run: 6, Failures: 0, Errors: 0, Skipped: 0, Time elapsed: 2.196 sec
29-Nov-2019 08:55:58
29-Nov-2019 08:55:58 Results :
29-Nov-2019 08:55:58
29-Nov-2019 08:55:58 Tests run: 723, Failures: 0, Errors: 0, Skipped: 13
29-Nov-2019 08:55:58
29-Nov-2019 08:55:58 [INFO]
29-Nov-2019 08:55:58 [INFO] --- maven-jar-plugin:2.4:jar (default-jar) @ reporting-api-tests ---
29-Nov-2019 08:55:58 [WARNING] JAR will be empty - no content was marked for inclusion!
29-Nov-2019 08:55:58 [INFO] Building jar: /home/bamboo-agent/bamboo-agent/xml-data/build-dir/REP-REP-JOB1/api-tests/target/reporting-api-tests-1.20.0-SNAPSHOT.jar
29-Nov-2019 08:55:58 [INFO]
29-Nov-2019 08:55:58 [INFO] --- maven-jar-plugin:2.4:test-jar (default) @ reporting-api-tests ---
29-Nov-2019 08:55:59 [INFO] Building jar: /home/bamboo-agent/bamboo-agent/xml-data/build-dir/REP-REP-JOB1/api-tests/target/reporting-api-tests-1.20.0-SNAPSHOT-tests.jar
29-Nov-2019 08:55:59 [INFO]
29-Nov-2019 08:55:59 [INFO] --- maven-install-plugin:2.4:install (default-install) @ reporting-api-tests ---
29-Nov-2019 08:55:59 [INFO] Installing /home/bamboo-agent/bamboo-agent/xml-data/build-dir/REP-REP-JOB1/api-tests/target/reporting-api-tests-1.20.0-SNAPSHOT.jar to /home/bamboo-agent/.m2/repository/org/openmrs/module/reporting-api-tests/1.20.0-SNAPSHOT/reporting-api-tests-1.20.0-SNAPSHOT.jar
29-Nov-2019 08:55:59 [INFO] Installing /home/bamboo-agent/bamboo-agent/xml-data/build-dir/REP-REP-JOB1/api-tests/pom.xml to /home/bamboo-agent/.m2/repository/org/openmrs/module/reporting-api-tests/1.20.0-SNAPSHOT/reporting-api-tests-1.20.0-SNAPSHOT.pom
29-Nov-2019 08:55:59 [INFO] Installing /home/bamboo-agent/bamboo-agent/xml-data/build-dir/REP-REP-JOB1/api-tests/target/reporting-api-tests-1.20.0-SNAPSHOT-tests.jar to /home/bamboo-agent/.m2/repository/org/openmrs/module/reporting-api-tests/1.20.0-SNAPSHOT/reporting-api-tests-1.20.0-SNAPSHOT-tests.jar
29-Nov-2019 08:55:59 [INFO]
29-Nov-2019 08:55:59 [INFO] --- maven-deploy-plugin:2.7:deploy (default-deploy) @ reporting-api-tests ---
29-Nov-2019 08:55:59 [INFO] Downloading: http://mavenrepo.openmrs.org/nexus/content/repositories/snapshots/org/openmrs/module/reporting-api-tests/1.20.0-SNAPSHOT/maven-metadata.xml
29-Nov-2019 08:55:59 [INFO] Downloaded: http://mavenrepo.openmrs.org/nexus/content/repositories/snapshots/org/openmrs/module/reporting-api-tests/1.20.0-SNAPSHOT/maven-metadata.xml (1003 B at 1.4 KB/sec)
29-Nov-2019 08:55:59 [INFO] Uploading: http://mavenrepo.openmrs.org/nexus/content/repositories/snapshots/org/openmrs/module/reporting-api-tests/1.20.0-SNAPSHOT/reporting-api-tests-1.20.0-20191129.085559-2.jar
29-Nov-2019 08:56:00 [INFO] Uploaded: http://mavenrepo.openmrs.org/nexus/content/repositories/snapshots/org/openmrs/module/reporting-api-tests/1.20.0-SNAPSHOT/reporting-api-tests-1.20.0-20191129.085559-2.jar (2 KB at 2.5 KB/sec)
29-Nov-2019 08:56:00 [INFO] Uploading: http://mavenrepo.openmrs.org/nexus/content/repositories/snapshots/org/openmrs/module/reporting-api-tests/1.20.0-SNAPSHOT/reporting-api-tests-1.20.0-20191129.085559-2.pom
29-Nov-2019 08:56:01 [INFO] Uploaded: http://mavenrepo.openmrs.org/nexus/content/repositories/snapshots/org/openmrs/module/reporting-api-tests/1.20.0-SNAPSHOT/reporting-api-tests-1.20.0-20191129.085559-2.pom (4 KB at 4.0 KB/sec)
29-Nov-2019 08:56:01 [INFO] Downloading: http://mavenrepo.openmrs.org/nexus/content/repositories/snapshots/org/openmrs/module/reporting-api-tests/maven-metadata.xml
29-Nov-2019 08:56:01 [INFO] Downloaded: http://mavenrepo.openmrs.org/nexus/content/repositories/snapshots/org/openmrs/module/reporting-api-tests/maven-metadata.xml (803 B at 3.1 KB/sec)
29-Nov-2019 08:56:01 [INFO] Uploading: http://mavenrepo.openmrs.org/nexus/content/repositories/snapshots/org/openmrs/module/reporting-api-tests/1.20.0-SNAPSHOT/maven-metadata.xml
29-Nov-2019 08:56:02 [INFO] Uploaded: http://mavenrepo.openmrs.org/nexus/content/repositories/snapshots/org/openmrs/module/reporting-api-tests/1.20.0-SNAPSHOT/maven-metadata.xml (1003 B at 2.6 KB/sec)
29-Nov-2019 08:56:02 [INFO] Uploading: http://mavenrepo.openmrs.org/nexus/content/repositories/snapshots/org/openmrs/module/reporting-api-tests/maven-metadata.xml
29-Nov-2019 08:56:02 [INFO] Uploaded: http://mavenrepo.openmrs.org/nexus/content/repositories/snapshots/org/openmrs/module/reporting-api-tests/maven-metadata.xml (745 B at 1.3 KB/sec)
29-Nov-2019 08:56:02 [INFO] Uploading: http://mavenrepo.openmrs.org/nexus/content/repositories/snapshots/org/openmrs/module/reporting-api-tests/1.20.0-SNAPSHOT/reporting-api-tests-1.20.0-20191129.085559-2-tests.jar
29-Nov-2019 08:56:04 [INFO] Uploaded: http://mavenrepo.openmrs.org/nexus/content/repositories/snapshots/org/openmrs/module/reporting-api-tests/1.20.0-SNAPSHOT/reporting-api-tests-1.20.0-20191129.085559-2-tests.jar (943 KB at 576.5 KB/sec)
29-Nov-2019 08:56:04 [INFO] Uploading: http://mavenrepo.openmrs.org/nexus/content/repositories/snapshots/org/openmrs/module/reporting-api-tests/1.20.0-SNAPSHOT/maven-metadata.xml
29-Nov-2019 08:56:04 [INFO] Uploaded: http://mavenrepo.openmrs.org/nexus/content/repositories/snapshots/org/openmrs/module/reporting-api-tests/1.20.0-SNAPSHOT/maven-metadata.xml (1003 B at 2.5 KB/sec)
29-Nov-2019 08:56:04 [INFO]                                                                         
29-Nov-2019 08:56:04 [INFO] ------------------------------------------------------------------------
29-Nov-2019 08:56:04 [INFO] Building reporting Module api 1.10 1.20.0-SNAPSHOT
29-Nov-2019 08:56:04 [INFO] ------------------------------------------------------------------------
29-Nov-2019 08:56:04 [INFO] Downloading: http://mavenrepo.openmrs.org/nexus/content/repositories/public/org/openmrs/module/reporting-api-tests/1.20.0-SNAPSHOT/maven-metadata.xml
29-Nov-2019 08:56:05 [INFO] Downloaded: http://mavenrepo.openmrs.org/nexus/content/repositories/public/org/openmrs/module/reporting-api-tests/1.20.0-SNAPSHOT/maven-metadata.xml (1003 B at 2.5 KB/sec)
29-Nov-2019 08:56:05 [INFO]
29-Nov-2019 08:56:05 [INFO] --- maven-clean-plugin:2.5:clean (default-clean) @ reporting-api-1.10 ---
29-Nov-2019 08:56:05 [INFO]
29-Nov-2019 08:56:05 [INFO] --- maven-resources-plugin:2.6:resources (default-resources) @ reporting-api-1.10 ---
29-Nov-2019 08:56:05 [INFO] Using 'UTF-8' encoding to copy filtered resources.
29-Nov-2019 08:56:05 [INFO] skip non existing resourceDirectory /home/bamboo-agent/bamboo-agent/xml-data/build-dir/REP-REP-JOB1/api-1.10/src/main/resources
29-Nov-2019 08:56:05 [INFO]
29-Nov-2019 08:56:05 [INFO] --- maven-compiler-plugin:3.1:compile (default-compile) @ reporting-api-1.10 ---
29-Nov-2019 08:56:05 [INFO] Changes detected - recompiling the module!
29-Nov-2019 08:56:05 [INFO] Compiling 3 source files to /home/bamboo-agent/bamboo-agent/xml-data/build-dir/REP-REP-JOB1/api-1.10/target/classes
29-Nov-2019 08:56:05 [INFO]
29-Nov-2019 08:56:05 [INFO] --- build-helper-maven-plugin:1.7:parse-version (default) @ reporting-api-1.10 ---
29-Nov-2019 08:56:05 [INFO]
29-Nov-2019 08:56:05 [INFO] --- maven-resources-plugin:2.6:testResources (default-testResources) @ reporting-api-1.10 ---
29-Nov-2019 08:56:05 [INFO] Using 'UTF-8' encoding to copy filtered resources.
29-Nov-2019 08:56:05 [INFO] Copying 1 resource
29-Nov-2019 08:56:05 [INFO] Copying 0 resource
29-Nov-2019 08:56:05 [INFO]
29-Nov-2019 08:56:05 [INFO] --- maven-compiler-plugin:3.1:testCompile (default-testCompile) @ reporting-api-1.10 ---
29-Nov-2019 08:56:05 [INFO] Changes detected - recompiling the module!
29-Nov-2019 08:56:05 [INFO] Compiling 2 source files to /home/bamboo-agent/bamboo-agent/xml-data/build-dir/REP-REP-JOB1/api-1.10/target/test-classes
29-Nov-2019 08:56:05 [WARNING] /home/bamboo-agent/bamboo-agent/xml-data/build-dir/REP-REP-JOB1/api-1.10/src/test/java/org/openmrs/module/reporting/cohort/definition/evaluator/DrugOrderCohortDefinitionEvaluatorTest.java: /home/bamboo-agent/bamboo-agent/xml-data/build-dir/REP-REP-JOB1/api-1.10/src/test/java/org/openmrs/module/reporting/cohort/definition/evaluator/DrugOrderCohortDefinitionEvaluatorTest.java uses or overrides a deprecated API.
29-Nov-2019 08:56:05 [WARNING] /home/bamboo-agent/bamboo-agent/xml-data/build-dir/REP-REP-JOB1/api-1.10/src/test/java/org/openmrs/module/reporting/cohort/definition/evaluator/DrugOrderCohortDefinitionEvaluatorTest.java: Recompile with -Xlint:deprecation for details.
29-Nov-2019 08:56:05 [WARNING] /home/bamboo-agent/bamboo-agent/xml-data/build-dir/REP-REP-JOB1/api-1.10/src/test/java/org/openmrs/module/reporting/cohort/definition/evaluator/DrugOrderCohortDefinitionEvaluatorTest.java: /home/bamboo-agent/bamboo-agent/xml-data/build-dir/REP-REP-JOB1/api-1.10/src/test/java/org/openmrs/module/reporting/cohort/definition/evaluator/DrugOrderCohortDefinitionEvaluatorTest.java uses unchecked or unsafe operations.
29-Nov-2019 08:56:05 [WARNING] /home/bamboo-agent/bamboo-agent/xml-data/build-dir/REP-REP-JOB1/api-1.10/src/test/java/org/openmrs/module/reporting/cohort/definition/evaluator/DrugOrderCohortDefinitionEvaluatorTest.java: Recompile with -Xlint:unchecked for details.
29-Nov-2019 08:56:05 [INFO]
29-Nov-2019 08:56:05 [INFO] --- maven-surefire-plugin:2.5:test (default-test) @ reporting-api-1.10 ---
29-Nov-2019 08:56:05 [INFO] Surefire report directory: /home/bamboo-agent/bamboo-agent/xml-data/build-dir/REP-REP-JOB1/api-1.10/target/surefire-reports
29-Nov-2019 08:56:05 OpenJDK 64-Bit Server VM warning: ignoring option MaxPermSize=512m; support was removed in 8.0
29-Nov-2019 08:56:06
29-Nov-2019 08:56:06 -------------------------------------------------------
29-Nov-2019 08:56:06 T E S T S
29-Nov-2019 08:56:06 -------------------------------------------------------
29-Nov-2019 08:56:06 Running org.openmrs.module.reporting.cohort.definition.evaluator.DrugOrderCohortDefinitionEvaluatorTest
29-Nov-2019 08:56:06 log4j:WARN No appenders could be found for logger (org.springframework.test.context.junit4.SpringJUnit4ClassRunner).
29-Nov-2019 08:56:06 log4j:WARN Please initialize the log4j system properly.
29-Nov-2019 08:56:24 Tests run: 18, Failures: 0, Errors: 0, Skipped: 0, Time elapsed: 18.769 sec
29-Nov-2019 08:56:24 Running org.openmrs.module.reporting.cohort.definition.library.BuiltInCohortDefinitionLibrary1_10Test
29-Nov-2019 08:56:24 Tests run: 1, Failures: 0, Errors: 0, Skipped: 0, Time elapsed: 0.006 sec
29-Nov-2019 08:56:24
29-Nov-2019 08:56:24 Results :
29-Nov-2019 08:56:24
29-Nov-2019 08:56:24 Tests run: 19, Failures: 0, Errors: 0, Skipped: 0
29-Nov-2019 08:56:24
29-Nov-2019 08:56:24 [INFO]
29-Nov-2019 08:56:24 [INFO] --- maven-jar-plugin:2.4:jar (default-jar) @ reporting-api-1.10 ---
29-Nov-2019 08:56:24 [INFO] Building jar: /home/bamboo-agent/bamboo-agent/xml-data/build-dir/REP-REP-JOB1/api-1.10/target/reporting-api-1.10-1.20.0-SNAPSHOT.jar
29-Nov-2019 08:56:24 [INFO]
29-Nov-2019 08:56:24 [INFO] --- maven-jar-plugin:2.4:test-jar (default) @ reporting-api-1.10 ---
29-Nov-2019 08:56:24 [INFO] Building jar: /home/bamboo-agent/bamboo-agent/xml-data/build-dir/REP-REP-JOB1/api-1.10/target/reporting-api-1.10-1.20.0-SNAPSHOT-tests.jar
29-Nov-2019 08:56:24 [INFO]
29-Nov-2019 08:56:24 [INFO] --- maven-install-plugin:2.4:install (default-install) @ reporting-api-1.10 ---
29-Nov-2019 08:56:24 [INFO] Installing /home/bamboo-agent/bamboo-agent/xml-data/build-dir/REP-REP-JOB1/api-1.10/target/reporting-api-1.10-1.20.0-SNAPSHOT.jar to /home/bamboo-agent/.m2/repository/org/openmrs/module/reporting-api-1.10/1.20.0-SNAPSHOT/reporting-api-1.10-1.20.0-SNAPSHOT.jar
29-Nov-2019 08:56:24 [INFO] Installing /home/bamboo-agent/bamboo-agent/xml-data/build-dir/REP-REP-JOB1/api-1.10/pom.xml to /home/bamboo-agent/.m2/repository/org/openmrs/module/reporting-api-1.10/1.20.0-SNAPSHOT/reporting-api-1.10-1.20.0-SNAPSHOT.pom
29-Nov-2019 08:56:24 [INFO] Installing /home/bamboo-agent/bamboo-agent/xml-data/build-dir/REP-REP-JOB1/api-1.10/target/reporting-api-1.10-1.20.0-SNAPSHOT-tests.jar to /home/bamboo-agent/.m2/repository/org/openmrs/module/reporting-api-1.10/1.20.0-SNAPSHOT/reporting-api-1.10-1.20.0-SNAPSHOT-tests.jar
29-Nov-2019 08:56:24 [INFO]
29-Nov-2019 08:56:24 [INFO] --- maven-deploy-plugin:2.7:deploy (default-deploy) @ reporting-api-1.10 ---
29-Nov-2019 08:56:24 [INFO] Downloading: http://mavenrepo.openmrs.org/nexus/content/repositories/snapshots/org/openmrs/module/reporting-api-1.10/1.20.0-SNAPSHOT/maven-metadata.xml
29-Nov-2019 08:56:25 [INFO] Downloaded: http://mavenrepo.openmrs.org/nexus/content/repositories/snapshots/org/openmrs/module/reporting-api-1.10/1.20.0-SNAPSHOT/maven-metadata.xml (1002 B at 3.7 KB/sec)
29-Nov-2019 08:56:25 [INFO] Uploading: http://mavenrepo.openmrs.org/nexus/content/repositories/snapshots/org/openmrs/module/reporting-api-1.10/1.20.0-SNAPSHOT/reporting-api-1.10-1.20.0-20191129.085625-2.jar
29-Nov-2019 08:56:26 [INFO] Uploaded: http://mavenrepo.openmrs.org/nexus/content/repositories/snapshots/org/openmrs/module/reporting-api-1.10/1.20.0-SNAPSHOT/reporting-api-1.10-1.20.0-20191129.085625-2.jar (9 KB at 11.1 KB/sec)
29-Nov-2019 08:56:26 [INFO] Uploading: http://mavenrepo.openmrs.org/nexus/content/repositories/snapshots/org/openmrs/module/reporting-api-1.10/1.20.0-SNAPSHOT/reporting-api-1.10-1.20.0-20191129.085625-2.pom
29-Nov-2019 08:56:26 [INFO] Uploaded: http://mavenrepo.openmrs.org/nexus/content/repositories/snapshots/org/openmrs/module/reporting-api-1.10/1.20.0-SNAPSHOT/reporting-api-1.10-1.20.0-20191129.085625-2.pom (3 KB at 3.8 KB/sec)
29-Nov-2019 08:56:26 [INFO] Downloading: http://mavenrepo.openmrs.org/nexus/content/repositories/snapshots/org/openmrs/module/reporting-api-1.10/maven-metadata.xml
29-Nov-2019 08:56:27 [INFO] Downloaded: http://mavenrepo.openmrs.org/nexus/content/repositories/snapshots/org/openmrs/module/reporting-api-1.10/maven-metadata.xml (474 B at 1.8 KB/sec)
29-Nov-2019 08:56:27 [INFO] Uploading: http://mavenrepo.openmrs.org/nexus/content/repositories/snapshots/org/openmrs/module/reporting-api-1.10/1.20.0-SNAPSHOT/maven-metadata.xml
29-Nov-2019 08:56:27 [INFO] Uploaded: http://mavenrepo.openmrs.org/nexus/content/repositories/snapshots/org/openmrs/module/reporting-api-1.10/1.20.0-SNAPSHOT/maven-metadata.xml (1002 B at 2.6 KB/sec)
29-Nov-2019 08:56:27 [INFO] Uploading: http://mavenrepo.openmrs.org/nexus/content/repositories/snapshots/org/openmrs/module/reporting-api-1.10/maven-metadata.xml
29-Nov-2019 08:56:27 [INFO] Uploaded: http://mavenrepo.openmrs.org/nexus/content/repositories/snapshots/org/openmrs/module/reporting-api-1.10/maven-metadata.xml (416 B at 0.7 KB/sec)
29-Nov-2019 08:56:27 [INFO] Uploading: http://mavenrepo.openmrs.org/nexus/content/repositories/snapshots/org/openmrs/module/reporting-api-1.10/1.20.0-SNAPSHOT/reporting-api-1.10-1.20.0-20191129.085625-2-tests.jar
29-Nov-2019 08:56:28 [INFO] Uploaded: http://mavenrepo.openmrs.org/nexus/content/repositories/snapshots/org/openmrs/module/reporting-api-1.10/1.20.0-SNAPSHOT/reporting-api-1.10-1.20.0-20191129.085625-2-tests.jar (12 KB at 14.5 KB/sec)
29-Nov-2019 08:56:28 [INFO] Uploading: http://mavenrepo.openmrs.org/nexus/content/repositories/snapshots/org/openmrs/module/reporting-api-1.10/1.20.0-SNAPSHOT/maven-metadata.xml
29-Nov-2019 08:56:29 [INFO] Uploaded: http://mavenrepo.openmrs.org/nexus/content/repositories/snapshots/org/openmrs/module/reporting-api-1.10/1.20.0-SNAPSHOT/maven-metadata.xml (1002 B at 2.5 KB/sec)
29-Nov-2019 08:56:29 [INFO]                                                                         
29-Nov-2019 08:56:29 [INFO] ------------------------------------------------------------------------
29-Nov-2019 08:56:29 [INFO] Building reporting Module api 2.0 1.20.0-SNAPSHOT
29-Nov-2019 08:56:29 [INFO] ------------------------------------------------------------------------
29-Nov-2019 08:56:29 [INFO]
29-Nov-2019 08:56:29 [INFO] --- maven-clean-plugin:2.5:clean (default-clean) @ reporting-api-2.0 ---
29-Nov-2019 08:56:29 [INFO]
29-Nov-2019 08:56:29 [INFO] --- maven-resources-plugin:2.6:resources (default-resources) @ reporting-api-2.0 ---
29-Nov-2019 08:56:29 [INFO] Using 'UTF-8' encoding to copy filtered resources.
29-Nov-2019 08:56:29 [INFO] skip non existing resourceDirectory /home/bamboo-agent/bamboo-agent/xml-data/build-dir/REP-REP-JOB1/api-2.0/src/main/resources
29-Nov-2019 08:56:29 [INFO]
29-Nov-2019 08:56:29 [INFO] --- maven-compiler-plugin:3.1:compile (default-compile) @ reporting-api-2.0 ---
29-Nov-2019 08:56:29 [INFO] Changes detected - recompiling the module!
29-Nov-2019 08:56:29 [INFO] Compiling 4 source files to /home/bamboo-agent/bamboo-agent/xml-data/build-dir/REP-REP-JOB1/api-2.0/target/classes
29-Nov-2019 08:56:29 [INFO]
29-Nov-2019 08:56:29 [INFO] --- build-helper-maven-plugin:1.7:parse-version (default) @ reporting-api-2.0 ---
29-Nov-2019 08:56:29 [INFO]
29-Nov-2019 08:56:29 [INFO] --- maven-resources-plugin:2.6:testResources (default-testResources) @ reporting-api-2.0 ---
29-Nov-2019 08:56:29 [INFO] Using 'UTF-8' encoding to copy filtered resources.
29-Nov-2019 08:56:29 [INFO] skip non existing resourceDirectory /home/bamboo-agent/bamboo-agent/xml-data/build-dir/REP-REP-JOB1/api-2.0/src/test/resources
29-Nov-2019 08:56:29 [INFO] skip non existing resourceDirectory /home/bamboo-agent/bamboo-agent/xml-data/build-dir/REP-REP-JOB1/api-2.0/src/test/resources
29-Nov-2019 08:56:29 [INFO]
29-Nov-2019 08:56:29 [INFO] --- maven-compiler-plugin:3.1:testCompile (default-testCompile) @ reporting-api-2.0 ---
29-Nov-2019 08:56:29 [INFO] No sources to compile
29-Nov-2019 08:56:29 [INFO]
29-Nov-2019 08:56:29 [INFO] --- maven-surefire-plugin:2.5:test (default-test) @ reporting-api-2.0 ---
29-Nov-2019 08:56:29 [INFO] No tests to run.
29-Nov-2019 08:56:29 [INFO]
29-Nov-2019 08:56:29 [INFO] --- maven-jar-plugin:2.4:jar (default-jar) @ reporting-api-2.0 ---
29-Nov-2019 08:56:29 [INFO] Building jar: /home/bamboo-agent/bamboo-agent/xml-data/build-dir/REP-REP-JOB1/api-2.0/target/reporting-api-2.0-1.20.0-SNAPSHOT.jar
29-Nov-2019 08:56:29 [INFO]
29-Nov-2019 08:56:29 [INFO] --- maven-jar-plugin:2.4:test-jar (default) @ reporting-api-2.0 ---
29-Nov-2019 08:56:29 [WARNING] JAR will be empty - no content was marked for inclusion!
29-Nov-2019 08:56:29 [INFO] Building jar: /home/bamboo-agent/bamboo-agent/xml-data/build-dir/REP-REP-JOB1/api-2.0/target/reporting-api-2.0-1.20.0-SNAPSHOT-tests.jar
29-Nov-2019 08:56:29 [INFO]
29-Nov-2019 08:56:29 [INFO] --- maven-install-plugin:2.4:install (default-install) @ reporting-api-2.0 ---
29-Nov-2019 08:56:29 [INFO] Installing /home/bamboo-agent/bamboo-agent/xml-data/build-dir/REP-REP-JOB1/api-2.0/target/reporting-api-2.0-1.20.0-SNAPSHOT.jar to /home/bamboo-agent/.m2/repository/org/openmrs/module/reporting-api-2.0/1.20.0-SNAPSHOT/reporting-api-2.0-1.20.0-SNAPSHOT.jar
29-Nov-2019 08:56:29 [INFO] Installing /home/bamboo-agent/bamboo-agent/xml-data/build-dir/REP-REP-JOB1/api-2.0/pom.xml to /home/bamboo-agent/.m2/repository/org/openmrs/module/reporting-api-2.0/1.20.0-SNAPSHOT/reporting-api-2.0-1.20.0-SNAPSHOT.pom
29-Nov-2019 08:56:29 [INFO] Installing /home/bamboo-agent/bamboo-agent/xml-data/build-dir/REP-REP-JOB1/api-2.0/target/reporting-api-2.0-1.20.0-SNAPSHOT-tests.jar to /home/bamboo-agent/.m2/repository/org/openmrs/module/reporting-api-2.0/1.20.0-SNAPSHOT/reporting-api-2.0-1.20.0-SNAPSHOT-tests.jar
29-Nov-2019 08:56:29 [INFO]
29-Nov-2019 08:56:29 [INFO] --- maven-deploy-plugin:2.7:deploy (default-deploy) @ reporting-api-2.0 ---
29-Nov-2019 08:56:29 [INFO] Downloading: http://mavenrepo.openmrs.org/nexus/content/repositories/snapshots/org/openmrs/module/reporting-api-2.0/1.20.0-SNAPSHOT/maven-metadata.xml
29-Nov-2019 08:56:30 [INFO] Downloaded: http://mavenrepo.openmrs.org/nexus/content/repositories/snapshots/org/openmrs/module/reporting-api-2.0/1.20.0-SNAPSHOT/maven-metadata.xml (1001 B at 3.2 KB/sec)
29-Nov-2019 08:56:30 [INFO] Uploading: http://mavenrepo.openmrs.org/nexus/content/repositories/snapshots/org/openmrs/module/reporting-api-2.0/1.20.0-SNAPSHOT/reporting-api-2.0-1.20.0-20191129.085630-2.jar
29-Nov-2019 08:56:30 [INFO] Uploaded: http://mavenrepo.openmrs.org/nexus/content/repositories/snapshots/org/openmrs/module/reporting-api-2.0/1.20.0-SNAPSHOT/reporting-api-2.0-1.20.0-20191129.085630-2.jar (12 KB at 14.7 KB/sec)
29-Nov-2019 08:56:30 [INFO] Uploading: http://mavenrepo.openmrs.org/nexus/content/repositories/snapshots/org/openmrs/module/reporting-api-2.0/1.20.0-SNAPSHOT/reporting-api-2.0-1.20.0-20191129.085630-2.pom
29-Nov-2019 08:56:31 [INFO] Uploaded: http://mavenrepo.openmrs.org/nexus/content/repositories/snapshots/org/openmrs/module/reporting-api-2.0/1.20.0-SNAPSHOT/reporting-api-2.0-1.20.0-20191129.085630-2.pom (3 KB at 3.3 KB/sec)
29-Nov-2019 08:56:31 [INFO] Downloading: http://mavenrepo.openmrs.org/nexus/content/repositories/snapshots/org/openmrs/module/reporting-api-2.0/maven-metadata.xml
29-Nov-2019 08:56:31 [INFO] Downloaded: http://mavenrepo.openmrs.org/nexus/content/repositories/snapshots/org/openmrs/module/reporting-api-2.0/maven-metadata.xml (801 B at 3.2 KB/sec)
29-Nov-2019 08:56:31 [INFO] Uploading: http://mavenrepo.openmrs.org/nexus/content/repositories/snapshots/org/openmrs/module/reporting-api-2.0/1.20.0-SNAPSHOT/maven-metadata.xml
29-Nov-2019 08:56:32 [INFO] Uploaded: http://mavenrepo.openmrs.org/nexus/content/repositories/snapshots/org/openmrs/module/reporting-api-2.0/1.20.0-SNAPSHOT/maven-metadata.xml (1001 B at 2.6 KB/sec)
29-Nov-2019 08:56:32 [INFO] Uploading: http://mavenrepo.openmrs.org/nexus/content/repositories/snapshots/org/openmrs/module/reporting-api-2.0/maven-metadata.xml
29-Nov-2019 08:56:32 [INFO] Uploaded: http://mavenrepo.openmrs.org/nexus/content/repositories/snapshots/org/openmrs/module/reporting-api-2.0/maven-metadata.xml (743 B at 1.4 KB/sec)
29-Nov-2019 08:56:32 [INFO] Uploading: http://mavenrepo.openmrs.org/nexus/content/repositories/snapshots/org/openmrs/module/reporting-api-2.0/1.20.0-SNAPSHOT/reporting-api-2.0-1.20.0-20191129.085630-2-tests.jar
29-Nov-2019 08:56:33 [INFO] Uploaded: http://mavenrepo.openmrs.org/nexus/content/repositories/snapshots/org/openmrs/module/reporting-api-2.0/1.20.0-SNAPSHOT/reporting-api-2.0-1.20.0-20191129.085630-2-tests.jar (2 KB at 2.5 KB/sec)
29-Nov-2019 08:56:33 [INFO] Uploading: http://mavenrepo.openmrs.org/nexus/content/repositories/snapshots/org/openmrs/module/reporting-api-2.0/1.20.0-SNAPSHOT/maven-metadata.xml
29-Nov-2019 08:56:33 [INFO] Uploaded: http://mavenrepo.openmrs.org/nexus/content/repositories/snapshots/org/openmrs/module/reporting-api-2.0/1.20.0-SNAPSHOT/maven-metadata.xml (1001 B at 2.5 KB/sec)
29-Nov-2019 08:56:33 [INFO]                                                                         
29-Nov-2019 08:56:33 [INFO] ------------------------------------------------------------------------
29-Nov-2019 08:56:33 [INFO] Building reporting Module api 2.2 1.20.0-SNAPSHOT
29-Nov-2019 08:56:33 [INFO] ------------------------------------------------------------------------
29-Nov-2019 08:56:34 [INFO]
29-Nov-2019 08:56:34 [INFO] --- maven-clean-plugin:2.5:clean (default-clean) @ reporting-api-2.2 ---
29-Nov-2019 08:56:34 [INFO]
29-Nov-2019 08:56:34 [INFO] --- maven-resources-plugin:2.6:resources (default-resources) @ reporting-api-2.2 ---
29-Nov-2019 08:56:34 [INFO] Using 'UTF-8' encoding to copy filtered resources.
29-Nov-2019 08:56:34 [INFO] skip non existing resourceDirectory /home/bamboo-agent/bamboo-agent/xml-data/build-dir/REP-REP-JOB1/api-2.2/src/main/resources
29-Nov-2019 08:56:34 [INFO]
29-Nov-2019 08:56:34 [INFO] --- maven-compiler-plugin:3.1:compile (default-compile) @ reporting-api-2.2 ---
29-Nov-2019 08:56:34 [INFO] Changes detected - recompiling the module!
29-Nov-2019 08:56:34 [INFO] Compiling 3 source files to /home/bamboo-agent/bamboo-agent/xml-data/build-dir/REP-REP-JOB1/api-2.2/target/classes
29-Nov-2019 08:56:34 [INFO]
29-Nov-2019 08:56:34 [INFO] --- build-helper-maven-plugin:1.7:parse-version (default) @ reporting-api-2.2 ---
29-Nov-2019 08:56:34 [INFO]
29-Nov-2019 08:56:34 [INFO] --- maven-resources-plugin:2.6:testResources (default-testResources) @ reporting-api-2.2 ---
29-Nov-2019 08:56:34 [INFO] Using 'UTF-8' encoding to copy filtered resources.
29-Nov-2019 08:56:34 [INFO] Copying 1 resource
29-Nov-2019 08:56:34 [INFO] Copying 0 resource
29-Nov-2019 08:56:34 [INFO]
29-Nov-2019 08:56:34 [INFO] --- maven-compiler-plugin:3.1:testCompile (default-testCompile) @ reporting-api-2.2 ---
29-Nov-2019 08:56:34 [INFO] Changes detected - recompiling the module!
29-Nov-2019 08:56:34 [INFO] Compiling 2 source files to /home/bamboo-agent/bamboo-agent/xml-data/build-dir/REP-REP-JOB1/api-2.2/target/test-classes
29-Nov-2019 08:56:34 [INFO]
29-Nov-2019 08:56:34 [INFO] --- maven-surefire-plugin:2.5:test (default-test) @ reporting-api-2.2 ---
29-Nov-2019 08:56:34 [INFO] Surefire report directory: /home/bamboo-agent/bamboo-agent/xml-data/build-dir/REP-REP-JOB1/api-2.2/target/surefire-reports
29-Nov-2019 08:56:34 OpenJDK 64-Bit Server VM warning: ignoring option MaxPermSize=512m; support was removed in 8.0
29-Nov-2019 08:56:34
29-Nov-2019 08:56:34 -------------------------------------------------------
29-Nov-2019 08:56:34 T E S T S
29-Nov-2019 08:56:34 -------------------------------------------------------
29-Nov-2019 08:56:34 Running org.openmrs.module.reporting.cohort.definition.evaluator.ConditionCohortDefinitionEvaluatorTest
29-Nov-2019 08:56:35 log4j:WARN No appenders could be found for logger (org.springframework.test.context.junit4.SpringJUnit4ClassRunner).
29-Nov-2019 08:56:35 log4j:WARN Please initialize the log4j system properly.
29-Nov-2019 08:56:51 Tests run: 12, Failures: 0, Errors: 0, Skipped: 0, Time elapsed: 16.969 sec
29-Nov-2019 08:56:51 Running org.openmrs.module.reporting.cohort.definition.library.BuiltInCohortDefinitionLibrary2_2Test
29-Nov-2019 08:56:51 Tests run: 1, Failures: 0, Errors: 0, Skipped: 0, Time elapsed: 0.005 sec
29-Nov-2019 08:56:51
29-Nov-2019 08:56:51 Results :
29-Nov-2019 08:56:51
29-Nov-2019 08:56:51 Tests run: 13, Failures: 0, Errors: 0, Skipped: 0
29-Nov-2019 08:56:51
29-Nov-2019 08:56:51 [INFO]
29-Nov-2019 08:56:51 [INFO] --- maven-jar-plugin:2.4:jar (default-jar) @ reporting-api-2.2 ---
29-Nov-2019 08:56:51 [INFO] Building jar: /home/bamboo-agent/bamboo-agent/xml-data/build-dir/REP-REP-JOB1/api-2.2/target/reporting-api-2.2-1.20.0-SNAPSHOT.jar
29-Nov-2019 08:56:51 [INFO]
29-Nov-2019 08:56:51 [INFO] --- maven-jar-plugin:2.4:test-jar (default) @ reporting-api-2.2 ---
29-Nov-2019 08:56:51 [INFO] Building jar: /home/bamboo-agent/bamboo-agent/xml-data/build-dir/REP-REP-JOB1/api-2.2/target/reporting-api-2.2-1.20.0-SNAPSHOT-tests.jar
29-Nov-2019 08:56:51 [INFO]
29-Nov-2019 08:56:51 [INFO] --- maven-install-plugin:2.4:install (default-install) @ reporting-api-2.2 ---
29-Nov-2019 08:56:51 [INFO] Installing /home/bamboo-agent/bamboo-agent/xml-data/build-dir/REP-REP-JOB1/api-2.2/target/reporting-api-2.2-1.20.0-SNAPSHOT.jar to /home/bamboo-agent/.m2/repository/org/openmrs/module/reporting-api-2.2/1.20.0-SNAPSHOT/reporting-api-2.2-1.20.0-SNAPSHOT.jar
29-Nov-2019 08:56:51 [INFO] Installing /home/bamboo-agent/bamboo-agent/xml-data/build-dir/REP-REP-JOB1/api-2.2/pom.xml to /home/bamboo-agent/.m2/repository/org/openmrs/module/reporting-api-2.2/1.20.0-SNAPSHOT/reporting-api-2.2-1.20.0-SNAPSHOT.pom
29-Nov-2019 08:56:51 [INFO] Installing /home/bamboo-agent/bamboo-agent/xml-data/build-dir/REP-REP-JOB1/api-2.2/target/reporting-api-2.2-1.20.0-SNAPSHOT-tests.jar to /home/bamboo-agent/.m2/repository/org/openmrs/module/reporting-api-2.2/1.20.0-SNAPSHOT/reporting-api-2.2-1.20.0-SNAPSHOT-tests.jar
29-Nov-2019 08:56:51 [INFO]
29-Nov-2019 08:56:51 [INFO] --- maven-deploy-plugin:2.7:deploy (default-deploy) @ reporting-api-2.2 ---
29-Nov-2019 08:56:51 [INFO] Downloading: http://mavenrepo.openmrs.org/nexus/content/repositories/snapshots/org/openmrs/module/reporting-api-2.2/1.20.0-SNAPSHOT/maven-metadata.xml
29-Nov-2019 08:56:52 [INFO] Downloaded: http://mavenrepo.openmrs.org/nexus/content/repositories/snapshots/org/openmrs/module/reporting-api-2.2/1.20.0-SNAPSHOT/maven-metadata.xml (1001 B at 3.1 KB/sec)
29-Nov-2019 08:56:52 [INFO] Uploading: http://mavenrepo.openmrs.org/nexus/content/repositories/snapshots/org/openmrs/module/reporting-api-2.2/1.20.0-SNAPSHOT/reporting-api-2.2-1.20.0-20191129.085652-2.jar
29-Nov-2019 08:56:52 [INFO] Uploaded: http://mavenrepo.openmrs.org/nexus/content/repositories/snapshots/org/openmrs/module/reporting-api-2.2/1.20.0-SNAPSHOT/reporting-api-2.2-1.20.0-20191129.085652-2.jar (7 KB at 8.9 KB/sec)
29-Nov-2019 08:56:52 [INFO] Uploading: http://mavenrepo.openmrs.org/nexus/content/repositories/snapshots/org/openmrs/module/reporting-api-2.2/1.20.0-SNAPSHOT/reporting-api-2.2-1.20.0-20191129.085652-2.pom
29-Nov-2019 08:56:53 [INFO] Uploaded: http://mavenrepo.openmrs.org/nexus/content/repositories/snapshots/org/openmrs/module/reporting-api-2.2/1.20.0-SNAPSHOT/reporting-api-2.2-1.20.0-20191129.085652-2.pom (3 KB at 3.7 KB/sec)
29-Nov-2019 08:56:53 [INFO] Downloading: http://mavenrepo.openmrs.org/nexus/content/repositories/snapshots/org/openmrs/module/reporting-api-2.2/maven-metadata.xml
29-Nov-2019 08:56:53 [INFO] Downloaded: http://mavenrepo.openmrs.org/nexus/content/repositories/snapshots/org/openmrs/module/reporting-api-2.2/maven-metadata.xml (432 B at 1.7 KB/sec)
29-Nov-2019 08:56:53 [INFO] Uploading: http://mavenrepo.openmrs.org/nexus/content/repositories/snapshots/org/openmrs/module/reporting-api-2.2/1.20.0-SNAPSHOT/maven-metadata.xml
29-Nov-2019 08:56:54 [INFO] Uploaded: http://mavenrepo.openmrs.org/nexus/content/repositories/snapshots/org/openmrs/module/reporting-api-2.2/1.20.0-SNAPSHOT/maven-metadata.xml (1001 B at 2.7 KB/sec)
29-Nov-2019 08:56:54 [INFO] Uploading: http://mavenrepo.openmrs.org/nexus/content/repositories/snapshots/org/openmrs/module/reporting-api-2.2/maven-metadata.xml
29-Nov-2019 08:56:54 [INFO] Uploaded: http://mavenrepo.openmrs.org/nexus/content/repositories/snapshots/org/openmrs/module/reporting-api-2.2/maven-metadata.xml (374 B at 0.7 KB/sec)
29-Nov-2019 08:56:54 [INFO] Uploading: http://mavenrepo.openmrs.org/nexus/content/repositories/snapshots/org/openmrs/module/reporting-api-2.2/1.20.0-SNAPSHOT/reporting-api-2.2-1.20.0-20191129.085652-2-tests.jar
29-Nov-2019 08:56:55 [INFO] Uploaded: http://mavenrepo.openmrs.org/nexus/content/repositories/snapshots/org/openmrs/module/reporting-api-2.2/1.20.0-SNAPSHOT/reporting-api-2.2-1.20.0-20191129.085652-2-tests.jar (8 KB at 10.0 KB/sec)
29-Nov-2019 08:56:55 [INFO] Uploading: http://mavenrepo.openmrs.org/nexus/content/repositories/snapshots/org/openmrs/module/reporting-api-2.2/1.20.0-SNAPSHOT/maven-metadata.xml
29-Nov-2019 08:56:56 [INFO] Uploaded: http://mavenrepo.openmrs.org/nexus/content/repositories/snapshots/org/openmrs/module/reporting-api-2.2/1.20.0-SNAPSHOT/maven-metadata.xml (1001 B at 2.5 KB/sec)
29-Nov-2019 08:56:56 [INFO]                                                                         
29-Nov-2019 08:56:56 [INFO] ------------------------------------------------------------------------
29-Nov-2019 08:56:56 [INFO] Building Reporting OMOD 1.20.0-SNAPSHOT
29-Nov-2019 08:56:56 [INFO] ------------------------------------------------------------------------
29-Nov-2019 08:56:56 [INFO]
29-Nov-2019 08:56:56 [INFO] --- maven-clean-plugin:2.5:clean (default-clean) @ reporting-omod ---
29-Nov-2019 08:56:56 [INFO]
29-Nov-2019 08:56:56 [INFO] --- maven-openmrs-plugin:1.0.1:initialize-module (init) @ reporting-omod ---
29-Nov-2019 08:56:56 [INFO]
29-Nov-2019 08:56:56 [INFO] --- maven-dependency-plugin:2.8:unpack-dependencies (Expand resources) @ reporting-omod ---
29-Nov-2019 08:56:56 [INFO] Unpacking /home/bamboo-agent/bamboo-agent/xml-data/build-dir/REP-REP-JOB1/api/target/reporting-api-1.20.0-SNAPSHOT.jar to /home/bamboo-agent/bamboo-agent/xml-data/build-dir/REP-REP-JOB1/omod/target/classes with includes "**\/*.xml,**\/*.properties" and excludes ""
29-Nov-2019 08:56:56 [INFO]
29-Nov-2019 08:56:56 [INFO] --- maven-resources-plugin:2.6:resources (default-resources) @ reporting-omod ---
29-Nov-2019 08:56:56 [INFO] Using 'UTF-8' encoding to copy filtered resources.
29-Nov-2019 08:56:56 [INFO] Copying 0 resource
29-Nov-2019 08:56:56 [INFO] Copying 2 resources
29-Nov-2019 08:56:56 [INFO] Copying 224 resources to web/module
29-Nov-2019 08:56:56 [INFO] Copying 224 resources to web/module
29-Nov-2019 08:56:56 [INFO]
29-Nov-2019 08:56:56 [INFO] --- maven-compiler-plugin:3.1:compile (default-compile) @ reporting-omod ---
29-Nov-2019 08:56:56 [INFO] Changes detected - recompiling the module!
29-Nov-2019 08:56:56 [INFO] Compiling 113 source files to /home/bamboo-agent/bamboo-agent/xml-data/build-dir/REP-REP-JOB1/omod/target/classes
29-Nov-2019 08:56:57 [WARNING] /home/bamboo-agent/bamboo-agent/xml-data/build-dir/REP-REP-JOB1/omod/src/main/java/org/openmrs/module/reporting/web/datasets/LogicDataSetEditor.java: Some input files use or override a deprecated API.
29-Nov-2019 08:56:57 [WARNING] /home/bamboo-agent/bamboo-agent/xml-data/build-dir/REP-REP-JOB1/omod/src/main/java/org/openmrs/module/reporting/web/datasets/LogicDataSetEditor.java: Recompile with -Xlint:deprecation for details.
29-Nov-2019 08:56:57 [WARNING] /home/bamboo-agent/bamboo-agent/xml-data/build-dir/REP-REP-JOB1/omod/src/main/java/org/openmrs/module/reporting/web/datasets/PatientDataSetEditor.java: Some input files use unchecked or unsafe operations.
29-Nov-2019 08:56:57 [WARNING] /home/bamboo-agent/bamboo-agent/xml-data/build-dir/REP-REP-JOB1/omod/src/main/java/org/openmrs/module/reporting/web/datasets/PatientDataSetEditor.java: Recompile with -Xlint:unchecked for details.
29-Nov-2019 08:56:57 [INFO]
29-Nov-2019 08:56:57 [INFO] --- build-helper-maven-plugin:1.7:parse-version (default) @ reporting-omod ---
29-Nov-2019 08:56:57 [INFO]
29-Nov-2019 08:56:57 [INFO] --- maven-resources-plugin:2.6:testResources (default-testResources) @ reporting-omod ---
29-Nov-2019 08:56:57 [INFO] Using 'UTF-8' encoding to copy filtered resources.
29-Nov-2019 08:56:57 [INFO] skip non existing resourceDirectory /home/bamboo-agent/bamboo-agent/xml-data/build-dir/REP-REP-JOB1/omod/src/test/resources
29-Nov-2019 08:56:57 [INFO] skip non existing resourceDirectory /home/bamboo-agent/bamboo-agent/xml-data/build-dir/REP-REP-JOB1/omod/src/test/resources
29-Nov-2019 08:56:57 [INFO]
29-Nov-2019 08:56:57 [INFO] --- maven-compiler-plugin:3.1:testCompile (default-testCompile) @ reporting-omod ---
29-Nov-2019 08:56:57 [INFO] No sources to compile
29-Nov-2019 08:56:57 [INFO]
29-Nov-2019 08:56:57 [INFO] --- maven-surefire-plugin:2.5:test (default-test) @ reporting-omod ---
29-Nov-2019 08:56:57 [INFO] No tests to run.
29-Nov-2019 08:56:57 [INFO]
29-Nov-2019 08:56:57 [INFO] --- maven-jar-plugin:2.4:jar (default-jar) @ reporting-omod ---
29-Nov-2019 08:56:57 [INFO] Building jar: /home/bamboo-agent/bamboo-agent/xml-data/build-dir/REP-REP-JOB1/omod/target/reporting-1.20.0-SNAPSHOT.jar
29-Nov-2019 08:56:58 [INFO]
29-Nov-2019 08:56:58 [INFO] --- maven-openmrs-plugin:1.0.1:package-module (pack) @ reporting-omod ---
29-Nov-2019 08:56:58 [INFO] Packaging OpenMRS module
29-Nov-2019 08:56:58 [INFO] Building jar: /home/bamboo-agent/bamboo-agent/xml-data/build-dir/REP-REP-JOB1/omod/target/reporting-1.20.0-SNAPSHOT.omod
29-Nov-2019 08:56:59 [INFO]
29-Nov-2019 08:56:59 [INFO] --- maven-jar-plugin:2.4:test-jar (default) @ reporting-omod ---
29-Nov-2019 08:56:59 [WARNING] JAR will be empty - no content was marked for inclusion!
29-Nov-2019 08:56:59 [INFO] Building jar: /home/bamboo-agent/bamboo-agent/xml-data/build-dir/REP-REP-JOB1/omod/target/reporting-1.20.0-SNAPSHOT-tests.jar
29-Nov-2019 08:56:59 [INFO]
29-Nov-2019 08:56:59 [INFO] --- maven-install-plugin:2.4:install (default-install) @ reporting-omod ---
29-Nov-2019 08:56:59 [INFO] Installing /home/bamboo-agent/bamboo-agent/xml-data/build-dir/REP-REP-JOB1/omod/target/reporting-1.20.0-SNAPSHOT.omod to /home/bamboo-agent/.m2/repository/org/openmrs/module/reporting-omod/1.20.0-SNAPSHOT/reporting-omod-1.20.0-SNAPSHOT.jar
29-Nov-2019 08:56:59 [INFO] Installing /home/bamboo-agent/bamboo-agent/xml-data/build-dir/REP-REP-JOB1/omod/pom.xml to /home/bamboo-agent/.m2/repository/org/openmrs/module/reporting-omod/1.20.0-SNAPSHOT/reporting-omod-1.20.0-SNAPSHOT.pom
29-Nov-2019 08:56:59 [INFO] Installing /home/bamboo-agent/bamboo-agent/xml-data/build-dir/REP-REP-JOB1/omod/target/reporting-1.20.0-SNAPSHOT-tests.jar to /home/bamboo-agent/.m2/repository/org/openmrs/module/reporting-omod/1.20.0-SNAPSHOT/reporting-omod-1.20.0-SNAPSHOT-tests.jar
29-Nov-2019 08:56:59 [INFO]
29-Nov-2019 08:56:59 [INFO] --- maven-deploy-plugin:2.7:deploy (default-deploy) @ reporting-omod ---
29-Nov-2019 08:56:59 [INFO] Downloading: http://mavenrepo.openmrs.org/nexus/content/repositories/snapshots/org/openmrs/module/reporting-omod/1.20.0-SNAPSHOT/maven-metadata.xml
29-Nov-2019 08:56:59 [INFO] Downloaded: http://mavenrepo.openmrs.org/nexus/content/repositories/snapshots/org/openmrs/module/reporting-omod/1.20.0-SNAPSHOT/maven-metadata.xml (998 B at 2.9 KB/sec)
29-Nov-2019 08:56:59 [INFO] Uploading: http://mavenrepo.openmrs.org/nexus/content/repositories/snapshots/org/openmrs/module/reporting-omod/1.20.0-SNAPSHOT/reporting-omod-1.20.0-20191129.085659-2.jar
29-Nov-2019 08:57:02 [INFO] Uploaded: http://mavenrepo.openmrs.org/nexus/content/repositories/snapshots/org/openmrs/module/reporting-omod/1.20.0-SNAPSHOT/reporting-omod-1.20.0-20191129.085659-2.jar (14264 KB at 4655.1 KB/sec)
29-Nov-2019 08:57:02 [INFO] Uploading: http://mavenrepo.openmrs.org/nexus/content/repositories/snapshots/org/openmrs/module/reporting-omod/1.20.0-SNAPSHOT/reporting-omod-1.20.0-20191129.085659-2.pom
29-Nov-2019 08:57:03 [INFO] Uploaded: http://mavenrepo.openmrs.org/nexus/content/repositories/snapshots/org/openmrs/module/reporting-omod/1.20.0-SNAPSHOT/reporting-omod-1.20.0-20191129.085659-2.pom (4 KB at 4.6 KB/sec)
29-Nov-2019 08:57:03 [INFO] Downloading: http://mavenrepo.openmrs.org/nexus/content/repositories/snapshots/org/openmrs/module/reporting-omod/maven-metadata.xml
29-Nov-2019 08:57:03 [INFO] Downloaded: http://mavenrepo.openmrs.org/nexus/content/repositories/snapshots/org/openmrs/module/reporting-omod/maven-metadata.xml (838 B at 3.1 KB/sec)
29-Nov-2019 08:57:03 [INFO] Uploading: http://mavenrepo.openmrs.org/nexus/content/repositories/snapshots/org/openmrs/module/reporting-omod/1.20.0-SNAPSHOT/maven-metadata.xml
29-Nov-2019 08:57:06 [INFO] Uploaded: http://mavenrepo.openmrs.org/nexus/content/repositories/snapshots/org/openmrs/module/reporting-omod/1.20.0-SNAPSHOT/maven-metadata.xml (998 B at 0.3 KB/sec)
29-Nov-2019 08:57:06 [INFO] Uploading: http://mavenrepo.openmrs.org/nexus/content/repositories/snapshots/org/openmrs/module/reporting-omod/maven-metadata.xml
29-Nov-2019 08:57:07 [INFO] Uploaded: http://mavenrepo.openmrs.org/nexus/content/repositories/snapshots/org/openmrs/module/reporting-omod/maven-metadata.xml (780 B at 1.5 KB/sec)
29-Nov-2019 08:57:07 [INFO] Uploading: http://mavenrepo.openmrs.org/nexus/content/repositories/snapshots/org/openmrs/module/reporting-omod/1.20.0-SNAPSHOT/reporting-omod-1.20.0-20191129.085659-2-tests.jar
29-Nov-2019 08:57:08 [INFO] Uploaded: http://mavenrepo.openmrs.org/nexus/content/repositories/snapshots/org/openmrs/module/reporting-omod/1.20.0-SNAPSHOT/reporting-omod-1.20.0-20191129.085659-2-tests.jar (3 KB at 2.8 KB/sec)
29-Nov-2019 08:57:08 [INFO] Uploading: http://mavenrepo.openmrs.org/nexus/content/repositories/snapshots/org/openmrs/module/reporting-omod/1.20.0-SNAPSHOT/maven-metadata.xml
29-Nov-2019 08:57:08 [INFO] Uploaded: http://mavenrepo.openmrs.org/nexus/content/repositories/snapshots/org/openmrs/module/reporting-omod/1.20.0-SNAPSHOT/maven-metadata.xml (998 B at 2.6 KB/sec)
29-Nov-2019 08:57:08 [INFO] ------------------------------------------------------------------------
29-Nov-2019 08:57:08 [INFO] Reactor Summary:
29-Nov-2019 08:57:08 [INFO]
29-Nov-2019 08:57:08 [INFO] Reporting .......................................... SUCCESS [  5.113 s]
29-Nov-2019 08:57:08 [INFO] Reporting API ...................................... SUCCESS [ 12.059 s]
29-Nov-2019 08:57:08 [INFO] reporting Module api 1.9 ........................... SUCCESS [  5.422 s]
29-Nov-2019 08:57:08 [INFO] reporting API Tests ................................ SUCCESS [03:26 min]
29-Nov-2019 08:57:08 [INFO] reporting Module api 1.10 .......................... SUCCESS [ 24.285 s]
29-Nov-2019 08:57:08 [INFO] reporting Module api 2.0 ........................... SUCCESS [  4.785 s]
29-Nov-2019 08:57:08 [INFO] reporting Module api 2.2 ........................... SUCCESS [ 22.128 s]
29-Nov-2019 08:57:08 [INFO] Reporting OMOD ..................................... SUCCESS [ 12.527 s]
29-Nov-2019 08:57:08 [INFO] ------------------------------------------------------------------------
29-Nov-2019 08:57:08 [INFO] BUILD SUCCESS
29-Nov-2019 08:57:08 [INFO] ------------------------------------------------------------------------
29-Nov-2019 08:57:08 [INFO] Total time: 04:53 min
29-Nov-2019 08:57:08 [INFO] Finished at: 2019-11-29T08:57:08+00:00
29-Nov-2019 08:57:08 [INFO] Final Memory: 61M/386M
29-Nov-2019 08:57:08 [INFO] ------------------------------------------------------------------------
29-Nov-2019 08:57:09 Parsing test results under /home/bamboo-agent/bamboo-agent/xml-data/build-dir/REP-REP-JOB1...
29-Nov-2019 08:57:09 Finished task 'Test and deploy' with result: Success
29-Nov-2019 08:57:09 Running post build plugin 'Docker Container Cleanup'
29-Nov-2019 08:57:09 Running post build plugin 'NCover Results Collector'
29-Nov-2019 08:57:09 Running post build plugin 'Clover Results Collector'
29-Nov-2019 08:57:09 Running post build plugin 'Sauce OnDemand Post Runner'
29-Nov-2019 08:57:09 Running post build plugin 'npm Cache Cleanup'
29-Nov-2019 08:57:09 Running post build plugin 'Artifact Copier'
29-Nov-2019 08:57:09 Finalising the build...
29-Nov-2019 08:57:09 Stopping timer.
29-Nov-2019 08:57:09 Build REP-REP-JOB1-796 completed.
29-Nov-2019 08:57:09 Running on server: post build plugin 'NCover Results Collector'
29-Nov-2019 08:57:09 Running on server: post build plugin 'Build Hanging Detection Configuration'
29-Nov-2019 08:57:09 Running on server: post build plugin 'Clover Delta Calculator'
29-Nov-2019 08:57:09 Running on server: post build plugin 'Maven Dependencies Postprocessor'
29-Nov-2019 08:57:09 All post build plugins have finished
29-Nov-2019 08:57:09 Generating build results summary...
29-Nov-2019 08:57:10 Saving build results to disk...
29-Nov-2019 08:57:10 Logging substituted variables...
29-Nov-2019 08:57:10 Indexing build results...
29-Nov-2019 08:57:10 Finished building REP-REP-JOB1-796.