More details of the release in https://wiki.openmrs.org/x/i4DTAw

Build: #865 was successful

Job: Test against 2.0 was successful

Build log

The build generated 1,746 lines of output.The output is too long and has been truncated to the last 1,000 lines. Download or view full build log

14-Jul-2021 21:03:00         at org.springframework.aop.support.AopUtils.invokeJoinpointUsingReflection(AopUtils.java:317)
14-Jul-2021 21:03:00         at org.springframework.aop.framework.ReflectiveMethodInvocation.invokeJoinpoint(ReflectiveMethodInvocation.java:190)
14-Jul-2021 21:03:00         at org.springframework.aop.framework.ReflectiveMethodInvocation.proceed(ReflectiveMethodInvocation.java:157)
14-Jul-2021 21:03:00         at org.openmrs.aop.LoggingAdvice.invoke(LoggingAdvice.java:121)
14-Jul-2021 21:03:00         at org.springframework.aop.framework.ReflectiveMethodInvocation.proceed(ReflectiveMethodInvocation.java:179)
14-Jul-2021 21:03:00         at org.springframework.aop.framework.adapter.MethodBeforeAdviceInterceptor.invoke(MethodBeforeAdviceInterceptor.java:52)
14-Jul-2021 21:03:00         at org.springframework.aop.framework.ReflectiveMethodInvocation.proceed(ReflectiveMethodInvocation.java:179)
14-Jul-2021 21:03:00         at org.springframework.aop.framework.adapter.MethodBeforeAdviceInterceptor.invoke(MethodBeforeAdviceInterceptor.java:52)
14-Jul-2021 21:03:00         at org.springframework.aop.framework.ReflectiveMethodInvocation.proceed(ReflectiveMethodInvocation.java:179)
14-Jul-2021 21:03:00         at org.springframework.aop.framework.JdkDynamicAopProxy.invoke(JdkDynamicAopProxy.java:207)
14-Jul-2021 21:03:00         at com.sun.proxy.$Proxy40.evaluate(Unknown Source)
14-Jul-2021 21:03:00         at sun.reflect.GeneratedMethodAccessor287.invoke(Unknown Source)
14-Jul-2021 21:03:00         at sun.reflect.DelegatingMethodAccessorImpl.invoke(DelegatingMethodAccessorImpl.java:43)
14-Jul-2021 21:03:00         at java.lang.reflect.Method.invoke(Method.java:498)
14-Jul-2021 21:03:00         at org.springframework.aop.support.AopUtils.invokeJoinpointUsingReflection(AopUtils.java:317)
14-Jul-2021 21:03:00         at org.springframework.aop.framework.JdkDynamicAopProxy.invoke(JdkDynamicAopProxy.java:201)
14-Jul-2021 21:03:00         at com.sun.proxy.$Proxy139.evaluate(Unknown Source)
14-Jul-2021 21:03:00         at org.openmrs.module.reporting.cohort.definition.evaluator.SqlCohortDefinitionEvaluatorTest.shouldProtectSqlQueryAgainstDatabaseModifications(SqlCohortDefinitionEvaluatorTest.java:308)
14-Jul-2021 21:03:00         at sun.reflect.NativeMethodAccessorImpl.invoke0(Native Method)
14-Jul-2021 21:03:00         at sun.reflect.NativeMethodAccessorImpl.invoke(NativeMethodAccessorImpl.java:62)
14-Jul-2021 21:03:00         at sun.reflect.DelegatingMethodAccessorImpl.invoke(DelegatingMethodAccessorImpl.java:43)
14-Jul-2021 21:03:00         at java.lang.reflect.Method.invoke(Method.java:498)
14-Jul-2021 21:03:00         at org.junit.runners.model.FrameworkMethod$1.runReflectiveCall(FrameworkMethod.java:47)
14-Jul-2021 21:03:00         at org.junit.internal.runners.model.ReflectiveCallable.run(ReflectiveCallable.java:12)
14-Jul-2021 21:03:00         at org.junit.runners.model.FrameworkMethod.invokeExplosively(FrameworkMethod.java:44)
14-Jul-2021 21:03:00         at org.junit.internal.runners.statements.InvokeMethod.evaluate(InvokeMethod.java:17)
14-Jul-2021 21:03:00         at org.junit.internal.runners.statements.ExpectException.evaluate(ExpectException.java:19)
14-Jul-2021 21:03:00         at org.junit.internal.runners.statements.RunBefores.evaluate(RunBefores.java:26)
14-Jul-2021 21:03:00         at org.springframework.test.context.junit4.statements.RunBeforeTestMethodCallbacks.evaluate(RunBeforeTestMethodCallbacks.java:73)
14-Jul-2021 21:03:00         at org.junit.internal.runners.statements.RunAfters.evaluate(RunAfters.java:27)
14-Jul-2021 21:03:00         at org.springframework.test.context.junit4.statements.RunAfterTestMethodCallbacks.evaluate(RunAfterTestMethodCallbacks.java:82)
14-Jul-2021 21:03:00         at org.springframework.test.context.junit4.statements.SpringRepeat.evaluate(SpringRepeat.java:73)
14-Jul-2021 21:03:00         at org.junit.runners.ParentRunner.runLeaf(ParentRunner.java:271)
14-Jul-2021 21:03:00         at org.springframework.test.context.junit4.SpringJUnit4ClassRunner.runChild(SpringJUnit4ClassRunner.java:217)
14-Jul-2021 21:03:00         at org.springframework.test.context.junit4.SpringJUnit4ClassRunner.runChild(SpringJUnit4ClassRunner.java:83)
14-Jul-2021 21:03:00         at org.junit.runners.ParentRunner$3.run(ParentRunner.java:238)
14-Jul-2021 21:03:00         at org.junit.runners.ParentRunner$1.schedule(ParentRunner.java:63)
14-Jul-2021 21:03:00         at org.junit.runners.ParentRunner.runChildren(ParentRunner.java:236)
14-Jul-2021 21:03:00         at org.junit.runners.ParentRunner.access$000(ParentRunner.java:53)
14-Jul-2021 21:03:00         at org.junit.runners.ParentRunner$2.evaluate(ParentRunner.java:229)
14-Jul-2021 21:03:00         at org.springframework.test.context.junit4.statements.RunBeforeTestClassCallbacks.evaluate(RunBeforeTestClassCallbacks.java:61)
14-Jul-2021 21:03:00         at org.junit.internal.runners.statements.RunAfters.evaluate(RunAfters.java:27)
14-Jul-2021 21:03:00         at org.springframework.test.context.junit4.statements.RunAfterTestClassCallbacks.evaluate(RunAfterTestClassCallbacks.java:68)
14-Jul-2021 21:03:00         at org.junit.runners.ParentRunner.run(ParentRunner.java:309)
14-Jul-2021 21:03:00         at org.springframework.test.context.junit4.SpringJUnit4ClassRunner.run(SpringJUnit4ClassRunner.java:163)
14-Jul-2021 21:03:00         at org.apache.maven.surefire.junit4.JUnit4TestSet.execute(JUnit4TestSet.java:59)
14-Jul-2021 21:03:00         at org.apache.maven.surefire.suite.AbstractDirectoryTestSuite.executeTestSet(AbstractDirectoryTestSuite.java:115)
14-Jul-2021 21:03:00         at org.apache.maven.surefire.suite.AbstractDirectoryTestSuite.execute(AbstractDirectoryTestSuite.java:102)
14-Jul-2021 21:03:00         at org.apache.maven.surefire.Surefire.run(Surefire.java:180)
14-Jul-2021 21:03:00         at sun.reflect.NativeMethodAccessorImpl.invoke0(Native Method)
14-Jul-2021 21:03:00         at sun.reflect.NativeMethodAccessorImpl.invoke(NativeMethodAccessorImpl.java:62)
14-Jul-2021 21:03:00         at sun.reflect.DelegatingMethodAccessorImpl.invoke(DelegatingMethodAccessorImpl.java:43)
14-Jul-2021 21:03:00         at java.lang.reflect.Method.invoke(Method.java:498)
14-Jul-2021 21:03:00         at org.apache.maven.surefire.booter.SurefireBooter.runSuitesInProcess(SurefireBooter.java:350)
14-Jul-2021 21:03:00         at org.apache.maven.surefire.booter.SurefireBooter.main(SurefireBooter.java:1021)
14-Jul-2021 21:03:00 Caused by: org.hibernate.exception.GenericJDBCException: error executing work
14-Jul-2021 21:03:00         at org.hibernate.exception.internal.StandardSQLExceptionConverter.convert(StandardSQLExceptionConverter.java:54)
14-Jul-2021 21:03:00         at org.hibernate.engine.jdbc.spi.SqlExceptionHelper.convert(SqlExceptionHelper.java:126)
14-Jul-2021 21:03:00         at org.hibernate.engine.jdbc.spi.SqlExceptionHelper.convert(SqlExceptionHelper.java:112)
14-Jul-2021 21:03:00         at org.hibernate.engine.jdbc.internal.JdbcCoordinatorImpl.coordinateWork(JdbcCoordinatorImpl.java:318)
14-Jul-2021 21:03:00         at org.hibernate.internal.SessionImpl.doWork(SessionImpl.java:2095)
14-Jul-2021 21:03:00         at org.hibernate.internal.SessionImpl.doWork(SessionImpl.java:2080)
14-Jul-2021 21:03:00         at org.openmrs.api.db.hibernate.DbSession.doWork(DbSession.java:1005)
14-Jul-2021 21:03:00         at org.openmrs.module.reporting.evaluation.querybuilder.SqlQueryBuilder.evaluateToList(SqlQueryBuilder.java:152)
14-Jul-2021 21:03:00         ... 98 more
14-Jul-2021 21:03:00 Caused by: org.h2.jdbc.JdbcSQLException: Method is only allowed for a query. Use execute or executeUpdate instead of executeQuery; SQL statement:
14-Jul-2021 21:03:00 update person set gender='F'  [90002-173]
14-Jul-2021 21:03:00         at org.h2.message.DbException.getJdbcSQLException(DbException.java:331)
14-Jul-2021 21:03:00         at org.h2.message.DbException.get(DbException.java:171)
14-Jul-2021 21:03:00         at org.h2.message.DbException.get(DbException.java:148)
14-Jul-2021 21:03:00         at org.h2.message.DbException.get(DbException.java:137)
14-Jul-2021 21:03:00         at org.h2.command.Prepared.query(Prepared.java:211)
14-Jul-2021 21:03:00         at org.h2.command.CommandContainer.query(CommandContainer.java:91)
14-Jul-2021 21:03:00         at org.h2.command.Command.executeQuery(Command.java:195)
14-Jul-2021 21:03:00         at org.h2.jdbc.JdbcPreparedStatement.executeQuery(JdbcPreparedStatement.java:106)
14-Jul-2021 21:03:00         at com.mchange.v2.c3p0.impl.NewProxyPreparedStatement.executeQuery(NewProxyPreparedStatement.java:116)
14-Jul-2021 21:03:00         at org.openmrs.module.reporting.evaluation.querybuilder.SqlQueryBuilder$2.execute(SqlQueryBuilder.java:159)
14-Jul-2021 21:03:00         at org.hibernate.jdbc.WorkExecutor.executeWork(WorkExecutor.java:54)
14-Jul-2021 21:03:00         at org.hibernate.internal.SessionImpl$2.accept(SessionImpl.java:2076)
14-Jul-2021 21:03:00         at org.hibernate.internal.SessionImpl$2.accept(SessionImpl.java:2073)
14-Jul-2021 21:03:00         at org.hibernate.engine.jdbc.internal.JdbcCoordinatorImpl.coordinateWork(JdbcCoordinatorImpl.java:313)
14-Jul-2021 21:03:00         ... 102 more
14-Jul-2021 21:03:00 Tests run: 13, Failures: 0, Errors: 0, Skipped: 0, Time elapsed: 1.737 sec
14-Jul-2021 21:03:00 Running org.openmrs.module.reporting.evaluation.service.EvaluationServiceTest
14-Jul-2021 21:03:02 Tests run: 6, Failures: 0, Errors: 0, Skipped: 0, Time elapsed: 1.791 sec
14-Jul-2021 21:03:02 Running org.openmrs.module.reporting.data.obs.evaluator.EncounterToObsDataEvaluatorTest
14-Jul-2021 21:03:02 Tests run: 3, Failures: 0, Errors: 0, Skipped: 0, Time elapsed: 0.419 sec
14-Jul-2021 21:03:02 Running org.openmrs.module.reporting.query.encounter.evaluator.MappedParametersEncounterQueryEvaluatorTest
14-Jul-2021 21:03:03 Tests run: 1, Failures: 0, Errors: 0, Skipped: 0, Time elapsed: 0.291 sec
14-Jul-2021 21:03:03 Running org.openmrs.module.reporting.validator.InStateCohortDefinitionValidatorTest
14-Jul-2021 21:03:03 Tests run: 3, Failures: 0, Errors: 0, Skipped: 0, Time elapsed: 0.06 sec
14-Jul-2021 21:03:03 Running org.openmrs.module.reporting.common.ReflectionUtilTest
14-Jul-2021 21:03:03 Tests run: 6, Failures: 0, Errors: 0, Skipped: 0, Time elapsed: 0.043 sec
14-Jul-2021 21:03:03 Running org.openmrs.module.reporting.template.HandlebarsHelpersTest
14-Jul-2021 21:03:03 Tests run: 3, Failures: 0, Errors: 0, Skipped: 0, Time elapsed: 0.538 sec
14-Jul-2021 21:03:03 Running org.openmrs.module.reporting.data.visit.evaluator.VisitIdDataEvaluatorTest
14-Jul-2021 21:03:04 Tests run: 2, Failures: 0, Errors: 0, Skipped: 0, Time elapsed: 0.376 sec
14-Jul-2021 21:03:04 Running org.openmrs.module.reporting.cohort.definition.evaluator.ConditionalParameterCohortDefinitionEvaluatorTest
14-Jul-2021 21:03:04 Tests run: 1, Failures: 0, Errors: 0, Skipped: 0, Time elapsed: 0.249 sec
14-Jul-2021 21:03:04 Running org.openmrs.module.reporting.data.patient.evaluator.CurrentPatientStateDataEvaluatorTest
14-Jul-2021 21:03:04 Tests run: 1, Failures: 0, Errors: 0, Skipped: 0, Time elapsed: 0.303 sec
14-Jul-2021 21:03:04 Running org.openmrs.module.reporting.data.encounter.evaluator.ObsOnSameDateEncounterDataEvaluatorTest
14-Jul-2021 21:03:05 Tests run: 3, Failures: 0, Errors: 0, Skipped: 0, Time elapsed: 0.957 sec
14-Jul-2021 21:03:05 Running org.openmrs.module.reporting.cohort.query.service.CohortQueryServiceTest
14-Jul-2021 21:03:05 Tests run: 1, Failures: 0, Errors: 0, Skipped: 0, Time elapsed: 0.171 sec
14-Jul-2021 21:03:05 Running org.openmrs.module.reporting.data.person.evaluator.ObsForPersonDataEvaluatorTest
14-Jul-2021 21:03:06 Tests run: 3, Failures: 0, Errors: 0, Skipped: 0, Time elapsed: 0.517 sec
14-Jul-2021 21:03:06 Running org.openmrs.module.reporting.validator.StaticCohortDefinitionValidatorTest
14-Jul-2021 21:03:06 Tests run: 1, Failures: 0, Errors: 0, Skipped: 0, Time elapsed: 0.026 sec
14-Jul-2021 21:03:06 Running org.openmrs.module.reporting.dataset.definition.evaluator.EncounterDataSetEvaluatorTest
14-Jul-2021 21:03:06 ENCOUNTER ID        EMR ID        BIRTHDATE           ENCOUNTER DATE        Age At Start        Age At End        
14-Jul-2021 21:03:06 ------------        ------        ------------        --------------        ------------        ----------        
14-Jul-2021 21:03:06 3                   7             ~25/Aug/1976        01/Aug/2008           33                  34                
14-Jul-2021 21:03:06 4                   7             ~25/Aug/1976        15/Aug/2008           33                  34                
14-Jul-2021 21:03:06 5                   7             ~25/Aug/1976        19/Aug/2008           33                  34                
14-Jul-2021 21:03:06 6                   20            08/Feb/1925         19/Aug/2009           80                  80                
14-Jul-2021 21:03:06 7                   21            ~08/Jun/1959        19/Aug/2009           50                  51                
14-Jul-2021 21:03:06 8                   21            ~08/Jun/1959        19/Sep/2009           50                  51                
14-Jul-2021 21:03:06 9                   22            08/Jul/1997         19/Sep/2009           12                  13                
14-Jul-2021 21:03:06 10                  22            08/Jul/1997         19/Oct/2009           12                  13                
14-Jul-2021 21:03:06 11                  23            08/Nov/2000         19/Aug/2009           9                   10                
14-Jul-2021 21:03:06 12                  24            08/Dec/2006         19/Sep/2009           3                   4                 
14-Jul-2021 21:03:06 Tests run: 1, Failures: 0, Errors: 0, Skipped: 0, Time elapsed: 0.218 sec
14-Jul-2021 21:03:06 Running org.openmrs.module.reporting.data.person.evaluator.BirthdateDataEvaluatorTest
14-Jul-2021 21:03:06 Tests run: 1, Failures: 0, Errors: 0, Skipped: 0, Time elapsed: 0.127 sec
14-Jul-2021 21:03:06 Running org.openmrs.module.reporting.cohort.definition.evaluator.EncounterCohortDefinitionEvaluatorTest
14-Jul-2021 21:03:08 Tests run: 9, Failures: 0, Errors: 0, Skipped: 2, Time elapsed: 1.406 sec
14-Jul-2021 21:03:08 Running org.openmrs.module.reporting.data.person.evaluator.PreferredAddressDataEvaluatorTest
14-Jul-2021 21:03:08 Tests run: 1, Failures: 0, Errors: 0, Skipped: 0, Time elapsed: 0.134 sec
14-Jul-2021 21:03:08 Running org.openmrs.module.reporting.cohort.definition.evaluator.GenderCohortDefinitionEvaluatorTest
14-Jul-2021 21:03:09 Tests run: 5, Failures: 0, Errors: 0, Skipped: 0, Time elapsed: 0.648 sec
14-Jul-2021 21:03:09 Running org.openmrs.module.reporting.data.converter.BirthdateConverterTest
14-Jul-2021 21:03:09 Tests run: 1, Failures: 0, Errors: 0, Skipped: 0, Time elapsed: 0.03 sec
14-Jul-2021 21:03:09 Running org.openmrs.module.reporting.data.patient.evaluator.ProgramStatesForPatientDataEvaluatorTest
14-Jul-2021 21:03:10 Tests run: 9, Failures: 0, Errors: 0, Skipped: 0, Time elapsed: 1.204 sec
14-Jul-2021 21:03:10 Running org.openmrs.module.reporting.data.visit.library.BuiltInVisitDataLibraryTest
14-Jul-2021 21:03:10 Tests run: 1, Failures: 0, Errors: 0, Skipped: 0, Time elapsed: 0.036 sec
14-Jul-2021 21:03:10 Running org.openmrs.module.reporting.cohort.definition.evaluator.AgeCohortDefinitionEvaluatorTest
14-Jul-2021 21:03:10 Tests run: 5, Failures: 0, Errors: 0, Skipped: 0, Time elapsed: 0.444 sec
14-Jul-2021 21:03:10 Running org.openmrs.module.reporting.data.encounter.evaluator.EncounterLocationDataEvaluatorTest
14-Jul-2021 21:03:11 Tests run: 3, Failures: 0, Errors: 0, Skipped: 0, Time elapsed: 0.467 sec
14-Jul-2021 21:03:11 Running org.openmrs.module.reporting.data.obs.evaluator.PersonToObsEvaluatorTest
14-Jul-2021 21:03:11 Tests run: 3, Failures: 0, Errors: 0, Skipped: 0, Time elapsed: 0.422 sec
14-Jul-2021 21:03:11 Running org.openmrs.module.reporting.common.DateRangeTest
14-Jul-2021 21:03:11 Tests run: 9, Failures: 0, Errors: 0, Skipped: 0, Time elapsed: 0.004 sec
14-Jul-2021 21:03:11 Running org.openmrs.module.reporting.cohort.definition.evaluator.NumericObsCohortDefinitionEvaluatorTest
14-Jul-2021 21:03:13 Tests run: 11, Failures: 0, Errors: 0, Skipped: 0, Time elapsed: 1.957 sec
14-Jul-2021 21:03:13 Running org.openmrs.module.reporting.indicator.QueryCountIndicatorEvaluatorTest
14-Jul-2021 21:03:14 Tests run: 3, Failures: 0, Errors: 0, Skipped: 0, Time elapsed: 0.535 sec
14-Jul-2021 21:03:14 Running org.openmrs.module.reporting.data.encounter.evaluator.ObsForEncounterEvaluatorTest
14-Jul-2021 21:03:15 Tests run: 7, Failures: 0, Errors: 0, Skipped: 0, Time elapsed: 1.28 sec
14-Jul-2021 21:03:15 Running org.openmrs.module.reporting.common.DateUtilTest
14-Jul-2021 21:03:15 Tests run: 15, Failures: 0, Errors: 0, Skipped: 0, Time elapsed: 0.135 sec
14-Jul-2021 21:03:15 Running org.openmrs.module.reporting.data.patient.evaluator.DrugOrdersForPatientDataEvaluatorTest
14-Jul-2021 21:03:18 Tests run: 8, Failures: 0, Errors: 0, Skipped: 0, Time elapsed: 2.711 sec
14-Jul-2021 21:03:18 Running org.openmrs.module.reporting.query.encounter.evaluator.MappedParametersObsQueryEvaluatorTest
14-Jul-2021 21:03:18 Tests run: 1, Failures: 0, Errors: 0, Skipped: 0, Time elapsed: 0.66 sec
14-Jul-2021 21:03:18 Running org.openmrs.module.reporting.serializer.ReportingSerializerTest
14-Jul-2021 21:03:19 Tests run: 6, Failures: 0, Errors: 0, Skipped: 0, Time elapsed: 0.407 sec
14-Jul-2021 21:03:19 Running org.openmrs.module.reporting.dataset.definition.evaluator.CohortCrossTabDataSetEvaluatorTest
14-Jul-2021 21:03:19 Tests run: 1, Failures: 0, Errors: 0, Skipped: 0, Time elapsed: 0.209 sec
14-Jul-2021 21:03:19 Running org.openmrs.module.reporting.query.person.service.PersonQueryServiceImplTest
14-Jul-2021 21:03:19 Tests run: 2, Failures: 0, Errors: 0, Skipped: 0, Time elapsed: 0.276 sec
14-Jul-2021 21:03:19 Running org.openmrs.module.reporting.dataset.definition.evaluator.MySqlDataSetEvaluatorTest
14-Jul-2021 21:03:19 Tests run: 1, Failures: 0, Errors: 0, Skipped: 1, Time elapsed: 0.001 sec
14-Jul-2021 21:03:19 Running org.openmrs.module.reporting.report.renderer.TextTemplateRendererTest
14-Jul-2021 21:03:21 Tests run: 3, Failures: 0, Errors: 0, Skipped: 0, Time elapsed: 1.276 sec
14-Jul-2021 21:03:21 Running org.openmrs.module.reporting.validator.InverseCohortDefinitionValidatorTest
14-Jul-2021 21:03:21 Tests run: 2, Failures: 0, Errors: 0, Skipped: 0, Time elapsed: 0.028 sec
14-Jul-2021 21:03:21 Running org.openmrs.module.reporting.validator.PatientStateCohortDefinitionValidatorTest
14-Jul-2021 21:03:21 Tests run: 3, Failures: 0, Errors: 0, Skipped: 0, Time elapsed: 0.037 sec
14-Jul-2021 21:03:21 Running org.openmrs.module.reporting.report.service.db.PropertiesTypeTest
14-Jul-2021 21:03:21 Tests run: 1, Failures: 0, Errors: 0, Skipped: 0, Time elapsed: 0.002 sec
14-Jul-2021 21:03:21 Running org.openmrs.module.reporting.query.encounter.evaluator.ObsForEncounterQueryEvaluatorTest
14-Jul-2021 21:03:22 Tests run: 8, Failures: 0, Errors: 0, Skipped: 0, Time elapsed: 1.154 sec
14-Jul-2021 21:03:22 Running org.openmrs.module.reporting.data.encounter.service.EncounterDataServiceImplTest
14-Jul-2021 21:03:22 Tests run: 2, Failures: 0, Errors: 0, Skipped: 0, Time elapsed: 0.277 sec
14-Jul-2021 21:03:22 Running org.openmrs.module.reporting.cohort.definition.evaluator.MappedParametersCohortDefinitionEvaluatorTest
14-Jul-2021 21:03:22 Tests run: 1, Failures: 0, Errors: 0, Skipped: 0, Time elapsed: 0.117 sec
14-Jul-2021 21:03:22 Running org.openmrs.module.reporting.data.encounter.evaluator.ConvertedEncounterDataEvaluatorTest
14-Jul-2021 21:03:22 Tests run: 1, Failures: 0, Errors: 0, Skipped: 0, Time elapsed: 0.125 sec
14-Jul-2021 21:03:22 Running org.openmrs.module.reporting.data.patient.evaluator.PatientIdentifierDataEvaluatorTest
14-Jul-2021 21:03:23 Tests run: 4, Failures: 0, Errors: 0, Skipped: 0, Time elapsed: 0.544 sec
14-Jul-2021 21:03:23 Running org.openmrs.module.reporting.data.converter.ListConverterTest
14-Jul-2021 21:03:23 Tests run: 6, Failures: 0, Errors: 0, Skipped: 0, Time elapsed: 0.003 sec
14-Jul-2021 21:03:23 Running org.openmrs.module.reporting.data.converter.ObsFromObsGroupConverterTest
14-Jul-2021 21:03:23 Tests run: 2, Failures: 0, Errors: 0, Skipped: 0, Time elapsed: 0.028 sec
14-Jul-2021 21:03:23 Running org.openmrs.module.reporting.common.AgeTest
14-Jul-2021 21:03:23 Tests run: 5, Failures: 0, Errors: 0, Skipped: 0, Time elapsed: 0.003 sec
14-Jul-2021 21:03:23 Running org.openmrs.module.reporting.evaluation.CachingCohortDefinitionTest
14-Jul-2021 21:03:23 Tests run: 1, Failures: 0, Errors: 0, Skipped: 0, Time elapsed: 0.113 sec
14-Jul-2021 21:03:23 Running org.openmrs.module.reporting.config.ReportLoaderIntegrationTest
14-Jul-2021 21:03:24 Tests run: 4, Failures: 0, Errors: 0, Skipped: 0, Time elapsed: 1.02 sec
14-Jul-2021 21:03:24 Running org.openmrs.module.reporting.common.TestUtil
14-Jul-2021 21:03:24 Tests run: 1, Failures: 0, Errors: 0, Skipped: 1, Time elapsed: 0 sec
14-Jul-2021 21:03:24 Running org.openmrs.module.reporting.query.encounter.evaluator.CompositionEncounterQueryEvaluatorTest
14-Jul-2021 21:03:25 Tests run: 4, Failures: 0, Errors: 0, Skipped: 0, Time elapsed: 0.516 sec
14-Jul-2021 21:03:25 Running org.openmrs.module.reporting.definition.library.implementerconfigured.ImplementerConfiguredVisitDataDefinitionLibraryTest
14-Jul-2021 21:03:25 Tests run: 2, Failures: 0, Errors: 0, Skipped: 0, Time elapsed: 0.031 sec
14-Jul-2021 21:03:25 Running org.openmrs.module.reporting.common.ObjectUtilTest
14-Jul-2021 21:03:25 Tests run: 23, Failures: 0, Errors: 0, Skipped: 0, Time elapsed: 0.816 sec
14-Jul-2021 21:03:25 Running org.openmrs.module.reporting.data.person.evaluator.AgeDataEvaluatorTest
14-Jul-2021 21:03:26 Tests run: 2, Failures: 0, Errors: 0, Skipped: 0, Time elapsed: 0.362 sec
14-Jul-2021 21:03:26 Running org.openmrs.module.reporting.evaluation.querybuilder.HqlQueryBuilderTest
14-Jul-2021 21:03:31 Tests run: 39, Failures: 0, Errors: 0, Skipped: 0, Time elapsed: 5.062 sec
14-Jul-2021 21:03:31 Running org.openmrs.module.reporting.data.visit.evaluator.ObsForVisitDataEvaluatorTest
14-Jul-2021 21:03:31 Tests run: 2, Failures: 0, Errors: 0, Skipped: 0, Time elapsed: 0.269 sec
14-Jul-2021 21:03:31 Running org.openmrs.module.reporting.query.encounter.evaluator.MostRecentEncounterForPatientQueryEvaluatorTest
14-Jul-2021 21:03:31 Tests run: 1, Failures: 0, Errors: 0, Skipped: 0, Time elapsed: 0.138 sec
14-Jul-2021 21:03:31 Running org.openmrs.module.reporting.cohort.definition.evaluator.OptionalParameterCohortDefinitionEvaluatorTest
14-Jul-2021 21:03:31 Tests run: 1, Failures: 0, Errors: 0, Skipped: 0, Time elapsed: 0.118 sec
14-Jul-2021 21:03:31 Running org.openmrs.module.reporting.report.util.SqlUtilsTest
14-Jul-2021 21:03:31 Tests run: 3, Failures: 0, Errors: 0, Skipped: 0, Time elapsed: 0.001 sec
14-Jul-2021 21:03:31 Running org.openmrs.module.reporting.validator.InProgramCohortDefinitionValidatorTest
14-Jul-2021 21:03:31 Tests run: 3, Failures: 0, Errors: 0, Skipped: 0, Time elapsed: 0.03 sec
14-Jul-2021 21:03:31 Running org.openmrs.module.reporting.data.obs.evaluator.PatientToObsDataEvaluatorTest
14-Jul-2021 21:03:32 Tests run: 3, Failures: 0, Errors: 0, Skipped: 0, Time elapsed: 0.365 sec
14-Jul-2021 21:03:32 Running org.openmrs.module.reporting.definition.library.BaseDefinitionLibraryTest
14-Jul-2021 21:03:32 Tests run: 4, Failures: 0, Errors: 0, Skipped: 0, Time elapsed: 0.034 sec
14-Jul-2021 21:03:32 Running org.openmrs.module.reporting.data.person.evaluator.PersonAttributeDataEvaluatorTest
14-Jul-2021 21:03:32 Tests run: 1, Failures: 0, Errors: 0, Skipped: 0, Time elapsed: 0.123 sec
14-Jul-2021 21:03:32 Running org.openmrs.module.reporting.data.person.evaluator.PreferredNameDataEvaluatorTest
14-Jul-2021 21:03:32 Tests run: 3, Failures: 0, Errors: 0, Skipped: 0, Time elapsed: 0.385 sec
14-Jul-2021 21:03:32 Running org.openmrs.module.reporting.definition.library.implementerconfigured.ImplementerConfiguredCohortDefinitionLibraryTest
14-Jul-2021 21:03:33 Tests run: 3, Failures: 0, Errors: 0, Skipped: 0, Time elapsed: 0.217 sec
14-Jul-2021 21:03:33 Running org.openmrs.module.reporting.evaluation.parameter.ParameterUtilTest
14-Jul-2021 21:03:33 Tests run: 2, Failures: 0, Errors: 0, Skipped: 0, Time elapsed: 0.04 sec
14-Jul-2021 21:03:33 Running org.openmrs.module.reporting.data.encounter.library.BuiltInEncounterDataLibraryTest
14-Jul-2021 21:03:34 Tests run: 6, Failures: 0, Errors: 0, Skipped: 0, Time elapsed: 1.008 sec
14-Jul-2021 21:03:34 Running org.openmrs.module.reporting.cohort.definition.evaluator.ScriptedCohortDefinitionEvaluatorTest
14-Jul-2021 21:03:34 Tests run: 1, Failures: 0, Errors: 0, Skipped: 0, Time elapsed: 0.282 sec
14-Jul-2021 21:03:34 Running org.openmrs.module.reporting.data.converter.PersonNameConverterTest
14-Jul-2021 21:03:34 Tests run: 1, Failures: 0, Errors: 0, Skipped: 0, Time elapsed: 0.055 sec
14-Jul-2021 21:03:34 Running org.openmrs.module.reporting.definition.library.AllDefinitionLibrariesComponentTest
14-Jul-2021 21:03:34 Tests run: 2, Failures: 0, Errors: 0, Skipped: 0, Time elapsed: 0.071 sec
14-Jul-2021 21:03:34 Running org.openmrs.module.reporting.data.person.evaluator.VitalStatusDataEvaluatorTest
14-Jul-2021 21:03:34 Tests run: 1, Failures: 0, Errors: 0, Skipped: 0, Time elapsed: 0.262 sec
14-Jul-2021 21:03:34 Running org.openmrs.module.reporting.dataset.definition.evaluator.PatientDataSetEvaluatorTest
14-Jul-2021 21:03:36 Tests run: 8, Failures: 0, Errors: 0, Skipped: 0, Time elapsed: 1.28 sec
14-Jul-2021 21:03:36 Running org.openmrs.module.reporting.cohort.definition.evaluator.TextObsCohortDefinitionEvaluatorTest
14-Jul-2021 21:03:36 Tests run: 2, Failures: 0, Errors: 0, Skipped: 0, Time elapsed: 0.236 sec
14-Jul-2021 21:03:36 Running org.openmrs.module.reporting.data.encounter.evaluator.AuditInfoEncounterDataEvaluatorTest
14-Jul-2021 21:03:36 Tests run: 1, Failures: 0, Errors: 0, Skipped: 0, Time elapsed: 0.043 sec
14-Jul-2021 21:03:36 Running org.openmrs.module.reporting.data.patient.evaluator.LogicDataEvaluatorTest
14-Jul-2021 21:03:36 Tests run: 1, Failures: 0, Errors: 0, Skipped: 1, Time elapsed: 0 sec
14-Jul-2021 21:03:36 Running org.openmrs.module.reporting.data.visit.evaluator.PersonToVisitDataEvaluatorTest
14-Jul-2021 21:03:36 Tests run: 3, Failures: 0, Errors: 0, Skipped: 0, Time elapsed: 0.346 sec
14-Jul-2021 21:03:36 Running org.openmrs.module.reporting.cohort.definition.evaluator.DateObsCohortDefinitionEvaluatorTest
14-Jul-2021 21:03:36 Tests run: 3, Failures: 0, Errors: 0, Skipped: 0, Time elapsed: 0.354 sec
14-Jul-2021 21:03:36 Running org.openmrs.module.reporting.cohort.definition.evaluator.VisitCohortDefinitionEvaluatorTest
14-Jul-2021 21:03:37 Tests run: 13, Failures: 0, Errors: 0, Skipped: 0, Time elapsed: 0.319 sec
14-Jul-2021 21:03:37 Running org.openmrs.module.reporting.data.encounter.evaluator.AgeAtEncounterDataEvaluatorTest
14-Jul-2021 21:03:37 Tests run: 1, Failures: 0, Errors: 0, Skipped: 0, Time elapsed: 0.145 sec
14-Jul-2021 21:03:37 Running org.openmrs.module.reporting.indicator.CohortIndicatorDataSetEvaluatorTest
14-Jul-2021 21:03:37 Tests run: 1, Failures: 0, Errors: 0, Skipped: 0, Time elapsed: 0.283 sec
14-Jul-2021 21:03:37 Running org.openmrs.module.reporting.data.person.evaluator.ObsActiveListPersonDataEvaluatorTest
14-Jul-2021 21:03:37 Tests run: 1, Failures: 0, Errors: 0, Skipped: 0, Time elapsed: 0.196 sec
14-Jul-2021 21:03:37 Running org.openmrs.module.reporting.common.ExcelUtilTest
14-Jul-2021 21:03:38 Tests run: 5, Failures: 0, Errors: 0, Skipped: 0, Time elapsed: 0.626 sec
14-Jul-2021 21:03:38 Running org.openmrs.module.reporting.data.obs.evaluator.GroupMemberObsDataEvaluatorTest
14-Jul-2021 21:03:39 Tests run: 5, Failures: 0, Errors: 0, Skipped: 2, Time elapsed: 0.494 sec
14-Jul-2021 21:03:39 Running org.openmrs.module.reporting.query.visit.evaluator.BasicVisitQueryEvaluatorTest
14-Jul-2021 21:03:39 Tests run: 3, Failures: 0, Errors: 0, Skipped: 0, Time elapsed: 0.432 sec
14-Jul-2021 21:03:39 Running org.openmrs.module.reporting.common.ExcelBuilderTest
14-Jul-2021 21:03:43 Tests run: 3, Failures: 0, Errors: 0, Skipped: 0, Time elapsed: 3.621 sec
14-Jul-2021 21:03:43 Running org.openmrs.module.reporting.query.obs.evaluator.AllObsQueryEvaluatorTest
14-Jul-2021 21:03:43 Tests run: 5, Failures: 0, Errors: 0, Skipped: 0, Time elapsed: 0.653 sec
14-Jul-2021 21:03:43 Running org.openmrs.module.reporting.cohort.definition.evaluator.AllPatientsCohortDefinitionEvaluatorTest
14-Jul-2021 21:03:43 Tests run: 1, Failures: 0, Errors: 0, Skipped: 0, Time elapsed: 0.13 sec
14-Jul-2021 21:03:43 Running org.openmrs.module.reporting.data.encounter.evaluator.SimultaneousEncountersDataEvaluatorTest
14-Jul-2021 21:03:44 Tests run: 2, Failures: 0, Errors: 0, Skipped: 0, Time elapsed: 0.124 sec
14-Jul-2021 21:03:44 Running org.openmrs.module.reporting.validator.ProgramEnrollmentCohortDefinitionValidatorTest
14-Jul-2021 21:03:44 Tests run: 3, Failures: 0, Errors: 0, Skipped: 0, Time elapsed: 0.033 sec
14-Jul-2021 21:03:44 Running org.openmrs.module.reporting.evaluation.EvaluationContextTest
14-Jul-2021 21:03:44 Tests run: 4, Failures: 0, Errors: 0, Skipped: 0, Time elapsed: 0.047 sec
14-Jul-2021 21:03:44 Running org.openmrs.module.reporting.data.patient.evaluator.PreferredIdentifierDataEvaluatorTest
14-Jul-2021 21:03:44 Tests run: 2, Failures: 0, Errors: 0, Skipped: 0, Time elapsed: 0.247 sec
14-Jul-2021 21:03:44 Running org.openmrs.module.reporting.data.encounter.evaluator.EncounterVisitDataEvaluatorTest
14-Jul-2021 21:03:44 Tests run: 1, Failures: 0, Errors: 0, Skipped: 0, Time elapsed: 0.162 sec
14-Jul-2021 21:03:44 Running org.openmrs.module.reporting.query.obs.service.ObsQueryServiceImplTest
14-Jul-2021 21:03:44 Tests run: 2, Failures: 0, Errors: 0, Skipped: 1, Time elapsed: 0.279 sec
14-Jul-2021 21:03:44 Running org.openmrs.module.reporting.data.patient.library.BuiltInPatientDataLibraryTest
14-Jul-2021 21:03:44 Tests run: 4, Failures: 0, Errors: 0, Skipped: 0, Time elapsed: 0.181 sec
14-Jul-2021 21:03:44 Running org.openmrs.module.reporting.indicator.util.IndicatorUtilTest
14-Jul-2021 21:03:44 Tests run: 1, Failures: 0, Errors: 0, Skipped: 0, Time elapsed: 0.002 sec
14-Jul-2021 21:03:44 Running org.openmrs.module.reporting.cohort.definition.evaluator.EvaluatableCohortDefinitionEvaluatorTest
14-Jul-2021 21:03:45 Tests run: 1, Failures: 0, Errors: 0, Skipped: 0, Time elapsed: 0.043 sec
14-Jul-2021 21:03:45 Running org.openmrs.module.reporting.data.patient.evaluator.ConvertedPatientDataEvaluatorTest
14-Jul-2021 21:03:45 Tests run: 2, Failures: 0, Errors: 0, Skipped: 0, Time elapsed: 0.319 sec
14-Jul-2021 21:03:45 Running org.openmrs.module.reporting.cohort.definition.evaluator.CompositionCohortDefinitionEvaluatorTest
14-Jul-2021 21:03:45 Tests run: 4, Failures: 0, Errors: 0, Skipped: 0, Time elapsed: 0.486 sec
14-Jul-2021 21:03:45 Running org.openmrs.module.reporting.data.converter.MapConverterTest
14-Jul-2021 21:03:45 Tests run: 5, Failures: 0, Errors: 0, Skipped: 0, Time elapsed: 0.002 sec
14-Jul-2021 21:03:45 Running org.openmrs.module.reporting.data.patient.evaluator.EncountersForPatientDataEvaluatorTest
14-Jul-2021 21:03:45 Tests run: 1, Failures: 0, Errors: 0, Skipped: 0, Time elapsed: 0.166 sec
14-Jul-2021 21:03:45 Running org.openmrs.module.reporting.indicator.SqlIndicatorTest
14-Jul-2021 21:03:46 ERROR - EvaluationProfiler.log(111) |2021-07-14 21:03:46,476| 1345        2021-07-14 21:03:46.476        >        ERROR        EVALUATING_DEFINITION                        SqlIndicator[sql=SELECT distinct(.222) as res, 33 as res2 from patient]: Failed to evaluate sql because:
14-Jul-2021 21:03:46 Unable to evaluate to a single value. Exactly one column must be defined.
14-Jul-2021 21:03:46 org.openmrs.module.reporting.evaluation.EvaluationException: Failed to evaluate sql because:
14-Jul-2021 21:03:46 Unable to evaluate to a single value. Exactly one column must be defined.
14-Jul-2021 21:03:46         at org.openmrs.module.reporting.indicator.evaluator.SqlIndicatorEvaluator.evaluateSql(SqlIndicatorEvaluator.java:57)
14-Jul-2021 21:03:46         at org.openmrs.module.reporting.indicator.evaluator.SqlIndicatorEvaluator.evaluate(SqlIndicatorEvaluator.java:41)
14-Jul-2021 21:03:46         at org.openmrs.module.reporting.indicator.evaluator.SqlIndicatorEvaluator.evaluate(SqlIndicatorEvaluator.java:28)
14-Jul-2021 21:03:46         at org.openmrs.module.reporting.definition.service.BaseDefinitionService.executeEvaluator(BaseDefinitionService.java:369)
14-Jul-2021 21:03:46         at org.openmrs.module.reporting.definition.service.BaseDefinitionService.evaluateBypassingExclusionOfTestPatients(BaseDefinitionService.java:264)
14-Jul-2021 21:03:46         at org.openmrs.module.reporting.definition.service.BaseDefinitionService.evaluate(BaseDefinitionService.java:229)
14-Jul-2021 21:03:46         at org.openmrs.module.reporting.indicator.service.IndicatorServiceImpl.evaluate(IndicatorServiceImpl.java:41)
14-Jul-2021 21:03:46         at sun.reflect.NativeMethodAccessorImpl.invoke0(Native Method)
14-Jul-2021 21:03:46         at sun.reflect.NativeMethodAccessorImpl.invoke(NativeMethodAccessorImpl.java:62)
14-Jul-2021 21:03:46         at sun.reflect.DelegatingMethodAccessorImpl.invoke(DelegatingMethodAccessorImpl.java:43)
14-Jul-2021 21:03:46         at java.lang.reflect.Method.invoke(Method.java:498)
14-Jul-2021 21:03:46         at org.springframework.aop.support.AopUtils.invokeJoinpointUsingReflection(AopUtils.java:317)
14-Jul-2021 21:03:46         at org.springframework.aop.framework.ReflectiveMethodInvocation.invokeJoinpoint(ReflectiveMethodInvocation.java:190)
14-Jul-2021 21:03:46         at org.springframework.aop.framework.ReflectiveMethodInvocation.proceed(ReflectiveMethodInvocation.java:157)
14-Jul-2021 21:03:46         at org.openmrs.aop.LoggingAdvice.invoke(LoggingAdvice.java:121)
14-Jul-2021 21:03:46         at org.springframework.aop.framework.ReflectiveMethodInvocation.proceed(ReflectiveMethodInvocation.java:179)
14-Jul-2021 21:03:46         at org.springframework.aop.framework.adapter.MethodBeforeAdviceInterceptor.invoke(MethodBeforeAdviceInterceptor.java:52)
14-Jul-2021 21:03:46         at org.springframework.aop.framework.ReflectiveMethodInvocation.proceed(ReflectiveMethodInvocation.java:179)
14-Jul-2021 21:03:46         at org.springframework.aop.framework.adapter.MethodBeforeAdviceInterceptor.invoke(MethodBeforeAdviceInterceptor.java:52)
14-Jul-2021 21:03:46         at org.springframework.aop.framework.ReflectiveMethodInvocation.proceed(ReflectiveMethodInvocation.java:179)
14-Jul-2021 21:03:46         at org.springframework.aop.framework.JdkDynamicAopProxy.invoke(JdkDynamicAopProxy.java:207)
14-Jul-2021 21:03:46         at com.sun.proxy.$Proxy42.evaluate(Unknown Source)
14-Jul-2021 21:03:46         at sun.reflect.NativeMethodAccessorImpl.invoke0(Native Method)
14-Jul-2021 21:03:46         at sun.reflect.NativeMethodAccessorImpl.invoke(NativeMethodAccessorImpl.java:62)
14-Jul-2021 21:03:46         at sun.reflect.DelegatingMethodAccessorImpl.invoke(DelegatingMethodAccessorImpl.java:43)
14-Jul-2021 21:03:46         at java.lang.reflect.Method.invoke(Method.java:498)
14-Jul-2021 21:03:46         at org.springframework.aop.support.AopUtils.invokeJoinpointUsingReflection(AopUtils.java:317)
14-Jul-2021 21:03:46         at org.springframework.aop.framework.JdkDynamicAopProxy.invoke(JdkDynamicAopProxy.java:201)
14-Jul-2021 21:03:46         at com.sun.proxy.$Proxy152.evaluate(Unknown Source)
14-Jul-2021 21:03:46         at org.openmrs.module.reporting.indicator.SqlIndicatorTest.assertIndicatorValue(SqlIndicatorTest.java:94)
14-Jul-2021 21:03:46         at org.openmrs.module.reporting.indicator.SqlIndicatorTest.assertIndicatorValue(SqlIndicatorTest.java:103)
14-Jul-2021 21:03:46         at org.openmrs.module.reporting.indicator.SqlIndicatorTest.assertIndicatorValue(SqlIndicatorTest.java:114)
14-Jul-2021 21:03:46         at org.openmrs.module.reporting.indicator.SqlIndicatorTest.assertIndicatorValue(SqlIndicatorTest.java:107)
14-Jul-2021 21:03:46         at org.openmrs.module.reporting.indicator.SqlIndicatorTest.sqlIndicator_shouldNotAllowQueriesThatReturnMoreThanOneColumn(SqlIndicatorTest.java:85)
14-Jul-2021 21:03:46         at sun.reflect.NativeMethodAccessorImpl.invoke0(Native Method)
14-Jul-2021 21:03:46         at sun.reflect.NativeMethodAccessorImpl.invoke(NativeMethodAccessorImpl.java:62)
14-Jul-2021 21:03:46         at sun.reflect.DelegatingMethodAccessorImpl.invoke(DelegatingMethodAccessorImpl.java:43)
14-Jul-2021 21:03:46         at java.lang.reflect.Method.invoke(Method.java:498)
14-Jul-2021 21:03:46         at org.junit.runners.model.FrameworkMethod$1.runReflectiveCall(FrameworkMethod.java:47)
14-Jul-2021 21:03:46         at org.junit.internal.runners.model.ReflectiveCallable.run(ReflectiveCallable.java:12)
14-Jul-2021 21:03:46         at org.junit.runners.model.FrameworkMethod.invokeExplosively(FrameworkMethod.java:44)
14-Jul-2021 21:03:46         at org.junit.internal.runners.statements.InvokeMethod.evaluate(InvokeMethod.java:17)
14-Jul-2021 21:03:46         at org.junit.internal.runners.statements.ExpectException.evaluate(ExpectException.java:19)
14-Jul-2021 21:03:46         at org.junit.internal.runners.statements.RunBefores.evaluate(RunBefores.java:26)
14-Jul-2021 21:03:46         at org.springframework.test.context.junit4.statements.RunBeforeTestMethodCallbacks.evaluate(RunBeforeTestMethodCallbacks.java:73)
14-Jul-2021 21:03:46         at org.junit.internal.runners.statements.RunAfters.evaluate(RunAfters.java:27)
14-Jul-2021 21:03:46         at org.springframework.test.context.junit4.statements.RunAfterTestMethodCallbacks.evaluate(RunAfterTestMethodCallbacks.java:82)
14-Jul-2021 21:03:46         at org.springframework.test.context.junit4.statements.SpringRepeat.evaluate(SpringRepeat.java:73)
14-Jul-2021 21:03:46         at org.junit.runners.ParentRunner.runLeaf(ParentRunner.java:271)
14-Jul-2021 21:03:46         at org.springframework.test.context.junit4.SpringJUnit4ClassRunner.runChild(SpringJUnit4ClassRunner.java:217)
14-Jul-2021 21:03:46         at org.springframework.test.context.junit4.SpringJUnit4ClassRunner.runChild(SpringJUnit4ClassRunner.java:83)
14-Jul-2021 21:03:46         at org.junit.runners.ParentRunner$3.run(ParentRunner.java:238)
14-Jul-2021 21:03:46         at org.junit.runners.ParentRunner$1.schedule(ParentRunner.java:63)
14-Jul-2021 21:03:46         at org.junit.runners.ParentRunner.runChildren(ParentRunner.java:236)
14-Jul-2021 21:03:46         at org.junit.runners.ParentRunner.access$000(ParentRunner.java:53)
14-Jul-2021 21:03:46         at org.junit.runners.ParentRunner$2.evaluate(ParentRunner.java:229)
14-Jul-2021 21:03:46         at org.springframework.test.context.junit4.statements.RunBeforeTestClassCallbacks.evaluate(RunBeforeTestClassCallbacks.java:61)
14-Jul-2021 21:03:46         at org.junit.internal.runners.statements.RunAfters.evaluate(RunAfters.java:27)
14-Jul-2021 21:03:46         at org.springframework.test.context.junit4.statements.RunAfterTestClassCallbacks.evaluate(RunAfterTestClassCallbacks.java:68)
14-Jul-2021 21:03:46         at org.junit.runners.ParentRunner.run(ParentRunner.java:309)
14-Jul-2021 21:03:46         at org.springframework.test.context.junit4.SpringJUnit4ClassRunner.run(SpringJUnit4ClassRunner.java:163)
14-Jul-2021 21:03:46         at org.apache.maven.surefire.junit4.JUnit4TestSet.execute(JUnit4TestSet.java:59)
14-Jul-2021 21:03:46         at org.apache.maven.surefire.suite.AbstractDirectoryTestSuite.executeTestSet(AbstractDirectoryTestSuite.java:115)
14-Jul-2021 21:03:46         at org.apache.maven.surefire.suite.AbstractDirectoryTestSuite.execute(AbstractDirectoryTestSuite.java:102)
14-Jul-2021 21:03:46         at org.apache.maven.surefire.Surefire.run(Surefire.java:180)
14-Jul-2021 21:03:46         at sun.reflect.NativeMethodAccessorImpl.invoke0(Native Method)
14-Jul-2021 21:03:46         at sun.reflect.NativeMethodAccessorImpl.invoke(NativeMethodAccessorImpl.java:62)
14-Jul-2021 21:03:46         at sun.reflect.DelegatingMethodAccessorImpl.invoke(DelegatingMethodAccessorImpl.java:43)
14-Jul-2021 21:03:46         at java.lang.reflect.Method.invoke(Method.java:498)
14-Jul-2021 21:03:46         at org.apache.maven.surefire.booter.SurefireBooter.runSuitesInProcess(SurefireBooter.java:350)
14-Jul-2021 21:03:46         at org.apache.maven.surefire.booter.SurefireBooter.main(SurefireBooter.java:1021)
14-Jul-2021 21:03:46 Caused by: java.lang.IllegalArgumentException: Unable to evaluate to a single value. Exactly one column must be defined.
14-Jul-2021 21:03:46         at org.openmrs.module.reporting.evaluation.service.EvaluationServiceImpl.evaluateToObject(EvaluationServiceImpl.java:90)
14-Jul-2021 21:03:46         at sun.reflect.NativeMethodAccessorImpl.invoke0(Native Method)
14-Jul-2021 21:03:46         at sun.reflect.NativeMethodAccessorImpl.invoke(NativeMethodAccessorImpl.java:62)
14-Jul-2021 21:03:46         at sun.reflect.DelegatingMethodAccessorImpl.invoke(DelegatingMethodAccessorImpl.java:43)
14-Jul-2021 21:03:46         at java.lang.reflect.Method.invoke(Method.java:498)
14-Jul-2021 21:03:46         at org.springframework.aop.support.AopUtils.invokeJoinpointUsingReflection(AopUtils.java:317)
14-Jul-2021 21:03:46         at org.springframework.aop.framework.ReflectiveMethodInvocation.invokeJoinpoint(ReflectiveMethodInvocation.java:190)
14-Jul-2021 21:03:46         at org.springframework.aop.framework.ReflectiveMethodInvocation.proceed(ReflectiveMethodInvocation.java:157)
14-Jul-2021 21:03:46         at org.springframework.transaction.interceptor.TransactionInterceptor$1.proceedWithInvocation(TransactionInterceptor.java:99)
14-Jul-2021 21:03:46         at org.springframework.transaction.interceptor.TransactionAspectSupport.invokeWithinTransaction(TransactionAspectSupport.java:281)
14-Jul-2021 21:03:46         at org.springframework.transaction.interceptor.TransactionInterceptor.invoke(TransactionInterceptor.java:96)
14-Jul-2021 21:03:46         at org.springframework.aop.framework.ReflectiveMethodInvocation.proceed(ReflectiveMethodInvocation.java:179)
14-Jul-2021 21:03:46         at org.openmrs.aop.LoggingAdvice.invoke(LoggingAdvice.java:121)
14-Jul-2021 21:03:46         at org.springframework.aop.framework.ReflectiveMethodInvocation.proceed(ReflectiveMethodInvocation.java:179)
14-Jul-2021 21:03:46         at org.springframework.aop.framework.adapter.MethodBeforeAdviceInterceptor.invoke(MethodBeforeAdviceInterceptor.java:52)
14-Jul-2021 21:03:46         at org.springframework.aop.framework.ReflectiveMethodInvocation.proceed(ReflectiveMethodInvocation.java:179)
14-Jul-2021 21:03:46         at org.springframework.aop.framework.adapter.MethodBeforeAdviceInterceptor.invoke(MethodBeforeAdviceInterceptor.java:52)
14-Jul-2021 21:03:46         at org.springframework.aop.framework.ReflectiveMethodInvocation.proceed(ReflectiveMethodInvocation.java:179)
14-Jul-2021 21:03:46         at org.springframework.aop.framework.JdkDynamicAopProxy.invoke(JdkDynamicAopProxy.java:207)
14-Jul-2021 21:03:46         at com.sun.proxy.$Proxy29.evaluateToObject(Unknown Source)
14-Jul-2021 21:03:46         at sun.reflect.NativeMethodAccessorImpl.invoke0(Native Method)
14-Jul-2021 21:03:46         at sun.reflect.NativeMethodAccessorImpl.invoke(NativeMethodAccessorImpl.java:62)
14-Jul-2021 21:03:46         at sun.reflect.DelegatingMethodAccessorImpl.invoke(DelegatingMethodAccessorImpl.java:43)
14-Jul-2021 21:03:46         at java.lang.reflect.Method.invoke(Method.java:498)
14-Jul-2021 21:03:46         at org.springframework.aop.support.AopUtils.invokeJoinpointUsingReflection(AopUtils.java:317)
14-Jul-2021 21:03:46         at org.springframework.aop.framework.ReflectiveMethodInvocation.invokeJoinpoint(ReflectiveMethodInvocation.java:190)
14-Jul-2021 21:03:46         at org.springframework.aop.framework.ReflectiveMethodInvocation.proceed(ReflectiveMethodInvocation.java:157)
14-Jul-2021 21:03:46         at org.springframework.transaction.interceptor.TransactionInterceptor$1.proceedWithInvocation(TransactionInterceptor.java:99)
14-Jul-2021 21:03:46         at org.springframework.transaction.interceptor.TransactionAspectSupport.invokeWithinTransaction(TransactionAspectSupport.java:281)
14-Jul-2021 21:03:46         at org.springframework.transaction.interceptor.TransactionInterceptor.invoke(TransactionInterceptor.java:96)
14-Jul-2021 21:03:46         at org.springframework.aop.framework.ReflectiveMethodInvocation.proceed(ReflectiveMethodInvocation.java:179)
14-Jul-2021 21:03:46         at org.springframework.aop.framework.JdkDynamicAopProxy.invoke(JdkDynamicAopProxy.java:207)
14-Jul-2021 21:03:46         at com.sun.proxy.$Proxy138.evaluateToObject(Unknown Source)
14-Jul-2021 21:03:46         at org.openmrs.module.reporting.indicator.evaluator.SqlIndicatorEvaluator.evaluateSql(SqlIndicatorEvaluator.java:54)
14-Jul-2021 21:03:46         ... 70 more
14-Jul-2021 21:03:46 ERROR - EvaluationProfiler.log(111) |2021-07-14 21:03:46,796| 1353        2021-07-14 21:03:46.796        >        ERROR        EVALUATING_DEFINITION                        SqlIndicator[sql=SELECT person_id from person]: Failed to evaluate sql because:
14-Jul-2021 21:03:46 Unable to evaluate to a single value. Exactly one row must be returned by query.
14-Jul-2021 21:03:46 org.openmrs.module.reporting.evaluation.EvaluationException: Failed to evaluate sql because:
14-Jul-2021 21:03:46 Unable to evaluate to a single value. Exactly one row must be returned by query.
14-Jul-2021 21:03:46         at org.openmrs.module.reporting.indicator.evaluator.SqlIndicatorEvaluator.evaluateSql(SqlIndicatorEvaluator.java:57)
14-Jul-2021 21:03:46         at org.openmrs.module.reporting.indicator.evaluator.SqlIndicatorEvaluator.evaluate(SqlIndicatorEvaluator.java:41)
14-Jul-2021 21:03:46         at org.openmrs.module.reporting.indicator.evaluator.SqlIndicatorEvaluator.evaluate(SqlIndicatorEvaluator.java:28)
14-Jul-2021 21:03:46         at org.openmrs.module.reporting.definition.service.BaseDefinitionService.executeEvaluator(BaseDefinitionService.java:369)
14-Jul-2021 21:03:46         at org.openmrs.module.reporting.definition.service.BaseDefinitionService.evaluateBypassingExclusionOfTestPatients(BaseDefinitionService.java:264)
14-Jul-2021 21:03:46         at org.openmrs.module.reporting.definition.service.BaseDefinitionService.evaluate(BaseDefinitionService.java:229)
14-Jul-2021 21:03:46         at org.openmrs.module.reporting.indicator.service.IndicatorServiceImpl.evaluate(IndicatorServiceImpl.java:41)
14-Jul-2021 21:03:46         at sun.reflect.GeneratedMethodAccessor1188.invoke(Unknown Source)
14-Jul-2021 21:03:46         at sun.reflect.DelegatingMethodAccessorImpl.invoke(DelegatingMethodAccessorImpl.java:43)
14-Jul-2021 21:03:46         at java.lang.reflect.Method.invoke(Method.java:498)
14-Jul-2021 21:03:46         at org.springframework.aop.support.AopUtils.invokeJoinpointUsingReflection(AopUtils.java:317)
14-Jul-2021 21:03:46         at org.springframework.aop.framework.ReflectiveMethodInvocation.invokeJoinpoint(ReflectiveMethodInvocation.java:190)
14-Jul-2021 21:03:46         at org.springframework.aop.framework.ReflectiveMethodInvocation.proceed(ReflectiveMethodInvocation.java:157)
14-Jul-2021 21:03:46         at org.openmrs.aop.LoggingAdvice.invoke(LoggingAdvice.java:121)
14-Jul-2021 21:03:46         at org.springframework.aop.framework.ReflectiveMethodInvocation.proceed(ReflectiveMethodInvocation.java:179)
14-Jul-2021 21:03:46         at org.springframework.aop.framework.adapter.MethodBeforeAdviceInterceptor.invoke(MethodBeforeAdviceInterceptor.java:52)
14-Jul-2021 21:03:46         at org.springframework.aop.framework.ReflectiveMethodInvocation.proceed(ReflectiveMethodInvocation.java:179)
14-Jul-2021 21:03:46         at org.springframework.aop.framework.adapter.MethodBeforeAdviceInterceptor.invoke(MethodBeforeAdviceInterceptor.java:52)
14-Jul-2021 21:03:46         at org.springframework.aop.framework.ReflectiveMethodInvocation.proceed(ReflectiveMethodInvocation.java:179)
14-Jul-2021 21:03:46         at org.springframework.aop.framework.JdkDynamicAopProxy.invoke(JdkDynamicAopProxy.java:207)
14-Jul-2021 21:03:46         at com.sun.proxy.$Proxy42.evaluate(Unknown Source)
14-Jul-2021 21:03:46         at sun.reflect.GeneratedMethodAccessor1188.invoke(Unknown Source)
14-Jul-2021 21:03:46         at sun.reflect.DelegatingMethodAccessorImpl.invoke(DelegatingMethodAccessorImpl.java:43)
14-Jul-2021 21:03:46         at java.lang.reflect.Method.invoke(Method.java:498)
14-Jul-2021 21:03:46         at org.springframework.aop.support.AopUtils.invokeJoinpointUsingReflection(AopUtils.java:317)
14-Jul-2021 21:03:46         at org.springframework.aop.framework.JdkDynamicAopProxy.invoke(JdkDynamicAopProxy.java:201)
14-Jul-2021 21:03:46         at com.sun.proxy.$Proxy152.evaluate(Unknown Source)
14-Jul-2021 21:03:46         at org.openmrs.module.reporting.indicator.SqlIndicatorTest.assertIndicatorValue(SqlIndicatorTest.java:94)
14-Jul-2021 21:03:46         at org.openmrs.module.reporting.indicator.SqlIndicatorTest.assertIndicatorValue(SqlIndicatorTest.java:103)
14-Jul-2021 21:03:46         at org.openmrs.module.reporting.indicator.SqlIndicatorTest.assertIndicatorValue(SqlIndicatorTest.java:114)
14-Jul-2021 21:03:46         at org.openmrs.module.reporting.indicator.SqlIndicatorTest.assertIndicatorValue(SqlIndicatorTest.java:107)
14-Jul-2021 21:03:46         at org.openmrs.module.reporting.indicator.SqlIndicatorTest.sqlIndicator_shouldNotAllowQueriesThatReturnMoreThanOneRow(SqlIndicatorTest.java:90)
14-Jul-2021 21:03:46         at sun.reflect.NativeMethodAccessorImpl.invoke0(Native Method)
14-Jul-2021 21:03:46         at sun.reflect.NativeMethodAccessorImpl.invoke(NativeMethodAccessorImpl.java:62)
14-Jul-2021 21:03:46         at sun.reflect.DelegatingMethodAccessorImpl.invoke(DelegatingMethodAccessorImpl.java:43)
14-Jul-2021 21:03:46         at java.lang.reflect.Method.invoke(Method.java:498)
14-Jul-2021 21:03:46         at org.junit.runners.model.FrameworkMethod$1.runReflectiveCall(FrameworkMethod.java:47)
14-Jul-2021 21:03:46         at org.junit.internal.runners.model.ReflectiveCallable.run(ReflectiveCallable.java:12)
14-Jul-2021 21:03:46         at org.junit.runners.model.FrameworkMethod.invokeExplosively(FrameworkMethod.java:44)
14-Jul-2021 21:03:46         at org.junit.internal.runners.statements.InvokeMethod.evaluate(InvokeMethod.java:17)
14-Jul-2021 21:03:46         at org.junit.internal.runners.statements.ExpectException.evaluate(ExpectException.java:19)
14-Jul-2021 21:03:46         at org.junit.internal.runners.statements.RunBefores.evaluate(RunBefores.java:26)
14-Jul-2021 21:03:46         at org.springframework.test.context.junit4.statements.RunBeforeTestMethodCallbacks.evaluate(RunBeforeTestMethodCallbacks.java:73)
14-Jul-2021 21:03:46         at org.junit.internal.runners.statements.RunAfters.evaluate(RunAfters.java:27)
14-Jul-2021 21:03:46         at org.springframework.test.context.junit4.statements.RunAfterTestMethodCallbacks.evaluate(RunAfterTestMethodCallbacks.java:82)
14-Jul-2021 21:03:46         at org.springframework.test.context.junit4.statements.SpringRepeat.evaluate(SpringRepeat.java:73)
14-Jul-2021 21:03:46         at org.junit.runners.ParentRunner.runLeaf(ParentRunner.java:271)
14-Jul-2021 21:03:46         at org.springframework.test.context.junit4.SpringJUnit4ClassRunner.runChild(SpringJUnit4ClassRunner.java:217)
14-Jul-2021 21:03:46         at org.springframework.test.context.junit4.SpringJUnit4ClassRunner.runChild(SpringJUnit4ClassRunner.java:83)
14-Jul-2021 21:03:46         at org.junit.runners.ParentRunner$3.run(ParentRunner.java:238)
14-Jul-2021 21:03:46         at org.junit.runners.ParentRunner$1.schedule(ParentRunner.java:63)
14-Jul-2021 21:03:46         at org.junit.runners.ParentRunner.runChildren(ParentRunner.java:236)
14-Jul-2021 21:03:46         at org.junit.runners.ParentRunner.access$000(ParentRunner.java:53)
14-Jul-2021 21:03:46         at org.junit.runners.ParentRunner$2.evaluate(ParentRunner.java:229)
14-Jul-2021 21:03:46         at org.springframework.test.context.junit4.statements.RunBeforeTestClassCallbacks.evaluate(RunBeforeTestClassCallbacks.java:61)
14-Jul-2021 21:03:46         at org.junit.internal.runners.statements.RunAfters.evaluate(RunAfters.java:27)
14-Jul-2021 21:03:46         at org.springframework.test.context.junit4.statements.RunAfterTestClassCallbacks.evaluate(RunAfterTestClassCallbacks.java:68)
14-Jul-2021 21:03:46         at org.junit.runners.ParentRunner.run(ParentRunner.java:309)
14-Jul-2021 21:03:46         at org.springframework.test.context.junit4.SpringJUnit4ClassRunner.run(SpringJUnit4ClassRunner.java:163)
14-Jul-2021 21:03:46         at org.apache.maven.surefire.junit4.JUnit4TestSet.execute(JUnit4TestSet.java:59)
14-Jul-2021 21:03:46         at org.apache.maven.surefire.suite.AbstractDirectoryTestSuite.executeTestSet(AbstractDirectoryTestSuite.java:115)
14-Jul-2021 21:03:46         at org.apache.maven.surefire.suite.AbstractDirectoryTestSuite.execute(AbstractDirectoryTestSuite.java:102)
14-Jul-2021 21:03:46         at org.apache.maven.surefire.Surefire.run(Surefire.java:180)
14-Jul-2021 21:03:46         at sun.reflect.NativeMethodAccessorImpl.invoke0(Native Method)
14-Jul-2021 21:03:46         at sun.reflect.NativeMethodAccessorImpl.invoke(NativeMethodAccessorImpl.java:62)
14-Jul-2021 21:03:46         at sun.reflect.DelegatingMethodAccessorImpl.invoke(DelegatingMethodAccessorImpl.java:43)
14-Jul-2021 21:03:46         at java.lang.reflect.Method.invoke(Method.java:498)
14-Jul-2021 21:03:46         at org.apache.maven.surefire.booter.SurefireBooter.runSuitesInProcess(SurefireBooter.java:350)
14-Jul-2021 21:03:46         at org.apache.maven.surefire.booter.SurefireBooter.main(SurefireBooter.java:1021)
14-Jul-2021 21:03:46 Caused by: java.lang.IllegalArgumentException: Unable to evaluate to a single value. Exactly one row must be returned by query.
14-Jul-2021 21:03:46         at org.openmrs.module.reporting.evaluation.service.EvaluationServiceImpl.evaluateToObject(EvaluationServiceImpl.java:86)
14-Jul-2021 21:03:46         at sun.reflect.GeneratedMethodAccessor1191.invoke(Unknown Source)
14-Jul-2021 21:03:46         at sun.reflect.DelegatingMethodAccessorImpl.invoke(DelegatingMethodAccessorImpl.java:43)
14-Jul-2021 21:03:46         at java.lang.reflect.Method.invoke(Method.java:498)
14-Jul-2021 21:03:46         at org.springframework.aop.support.AopUtils.invokeJoinpointUsingReflection(AopUtils.java:317)
14-Jul-2021 21:03:46         at org.springframework.aop.framework.ReflectiveMethodInvocation.invokeJoinpoint(ReflectiveMethodInvocation.java:190)
14-Jul-2021 21:03:46         at org.springframework.aop.framework.ReflectiveMethodInvocation.proceed(ReflectiveMethodInvocation.java:157)
14-Jul-2021 21:03:46         at org.springframework.transaction.interceptor.TransactionInterceptor$1.proceedWithInvocation(TransactionInterceptor.java:99)
14-Jul-2021 21:03:46         at org.springframework.transaction.interceptor.TransactionAspectSupport.invokeWithinTransaction(TransactionAspectSupport.java:281)
14-Jul-2021 21:03:46         at org.springframework.transaction.interceptor.TransactionInterceptor.invoke(TransactionInterceptor.java:96)
14-Jul-2021 21:03:46         at org.springframework.aop.framework.ReflectiveMethodInvocation.proceed(ReflectiveMethodInvocation.java:179)
14-Jul-2021 21:03:46         at org.openmrs.aop.LoggingAdvice.invoke(LoggingAdvice.java:121)
14-Jul-2021 21:03:46         at org.springframework.aop.framework.ReflectiveMethodInvocation.proceed(ReflectiveMethodInvocation.java:179)
14-Jul-2021 21:03:46         at org.springframework.aop.framework.adapter.MethodBeforeAdviceInterceptor.invoke(MethodBeforeAdviceInterceptor.java:52)
14-Jul-2021 21:03:46         at org.springframework.aop.framework.ReflectiveMethodInvocation.proceed(ReflectiveMethodInvocation.java:179)
14-Jul-2021 21:03:46         at org.springframework.aop.framework.adapter.MethodBeforeAdviceInterceptor.invoke(MethodBeforeAdviceInterceptor.java:52)
14-Jul-2021 21:03:46         at org.springframework.aop.framework.ReflectiveMethodInvocation.proceed(ReflectiveMethodInvocation.java:179)
14-Jul-2021 21:03:46         at org.springframework.aop.framework.JdkDynamicAopProxy.invoke(JdkDynamicAopProxy.java:207)
14-Jul-2021 21:03:46         at com.sun.proxy.$Proxy29.evaluateToObject(Unknown Source)
14-Jul-2021 21:03:46         at sun.reflect.GeneratedMethodAccessor1191.invoke(Unknown Source)
14-Jul-2021 21:03:46         at sun.reflect.DelegatingMethodAccessorImpl.invoke(DelegatingMethodAccessorImpl.java:43)
14-Jul-2021 21:03:46         at java.lang.reflect.Method.invoke(Method.java:498)
14-Jul-2021 21:03:46         at org.springframework.aop.support.AopUtils.invokeJoinpointUsingReflection(AopUtils.java:317)
14-Jul-2021 21:03:46         at org.springframework.aop.framework.ReflectiveMethodInvocation.invokeJoinpoint(ReflectiveMethodInvocation.java:190)
14-Jul-2021 21:03:46         at org.springframework.aop.framework.ReflectiveMethodInvocation.proceed(ReflectiveMethodInvocation.java:157)
14-Jul-2021 21:03:46         at org.springframework.transaction.interceptor.TransactionInterceptor$1.proceedWithInvocation(TransactionInterceptor.java:99)
14-Jul-2021 21:03:46         at org.springframework.transaction.interceptor.TransactionAspectSupport.invokeWithinTransaction(TransactionAspectSupport.java:281)
14-Jul-2021 21:03:46         at org.springframework.transaction.interceptor.TransactionInterceptor.invoke(TransactionInterceptor.java:96)
14-Jul-2021 21:03:46         at org.springframework.aop.framework.ReflectiveMethodInvocation.proceed(ReflectiveMethodInvocation.java:179)
14-Jul-2021 21:03:46         at org.springframework.aop.framework.JdkDynamicAopProxy.invoke(JdkDynamicAopProxy.java:207)
14-Jul-2021 21:03:46         at com.sun.proxy.$Proxy138.evaluateToObject(Unknown Source)
14-Jul-2021 21:03:46         at org.openmrs.module.reporting.indicator.evaluator.SqlIndicatorEvaluator.evaluateSql(SqlIndicatorEvaluator.java:54)
14-Jul-2021 21:03:46         ... 68 more
14-Jul-2021 21:03:46 Tests run: 8, Failures: 0, Errors: 0, Skipped: 0, Time elapsed: 0.955 sec
14-Jul-2021 21:03:46 Running org.openmrs.module.reporting.report.renderer.ExcelTemplateRendererTest
14-Jul-2021 21:03:47 Tests run: 2, Failures: 0, Errors: 0, Skipped: 0, Time elapsed: 0.384 sec
14-Jul-2021 21:03:47 Running org.openmrs.module.reporting.cohort.CohortsTest
14-Jul-2021 21:03:47 Tests run: 3, Failures: 0, Errors: 0, Skipped: 0, Time elapsed: 0.029 sec
14-Jul-2021 21:03:47 Running org.openmrs.module.reporting.data.converter.StringConverterTest
14-Jul-2021 21:03:47 Tests run: 1, Failures: 0, Errors: 0, Skipped: 0, Time elapsed: 0.002 sec
14-Jul-2021 21:03:47 Running org.openmrs.module.reporting.dataset.definition.evaluator.RepeatPerTimePeriodDataSetEvaluatorTest
14-Jul-2021 21:03:47 Tests run: 4, Failures: 0, Errors: 0, Skipped: 0, Time elapsed: 0.118 sec
14-Jul-2021 21:03:47 Running org.openmrs.module.reporting.data.JoinDataDefinitionTest
14-Jul-2021 21:03:47 Tests run: 2, Failures: 0, Errors: 0, Skipped: 0, Time elapsed: 0.001 sec
14-Jul-2021 21:03:47 Running org.openmrs.module.reporting.query.obs.evaluator.BasicObsQueryEvaluatorTest
14-Jul-2021 21:03:47 Tests run: 1, Failures: 0, Errors: 0, Skipped: 0, Time elapsed: 0.188 sec
14-Jul-2021 21:03:47 Running org.openmrs.module.reporting.query.person.evaluator.PatientPersonQueryEvaluatorTest
14-Jul-2021 21:03:47 Tests run: 1, Failures: 0, Errors: 0, Skipped: 0, Time elapsed: 0.127 sec
14-Jul-2021 21:03:47 Running org.openmrs.module.reporting.config.ReportLoaderTest
14-Jul-2021 21:03:47 Tests run: 4, Failures: 0, Errors: 0, Skipped: 0, Time elapsed: 0.047 sec
14-Jul-2021 21:03:47 Running org.openmrs.module.reporting.data.patient.evaluator.ScriptedCompositionPatientDataEvaluatorTest
14-Jul-2021 21:03:48 Tests run: 2, Failures: 0, Errors: 0, Skipped: 0, Time elapsed: 0.469 sec
14-Jul-2021 21:03:48 Running org.openmrs.module.reporting.definition.library.implementerconfigured.ImplementerConfiguredEncounterDataDefinitionLibraryTest
14-Jul-2021 21:03:48 Tests run: 2, Failures: 0, Errors: 0, Skipped: 0, Time elapsed: 0.033 sec
14-Jul-2021 21:03:48 Running org.openmrs.module.reporting.data.encounter.evaluator.PersonToEncounterDataEvaluatorTest
14-Jul-2021 21:03:48 Tests run: 3, Failures: 0, Errors: 0, Skipped: 0, Time elapsed: 0.439 sec
14-Jul-2021 21:03:48 Running org.openmrs.module.reporting.data.visit.evaluator.PatientToVisitDataEvaluatorTest
14-Jul-2021 21:03:49 {1=102, 4=12345K}
14-Jul-2021 21:03:49 Tests run: 3, Failures: 0, Errors: 0, Skipped: 0, Time elapsed: 0.491 sec
14-Jul-2021 21:03:49 Running org.openmrs.module.reporting.validator.CompositionCohortDefinitionValidatorTest
14-Jul-2021 21:03:49 Tests run: 5, Failures: 0, Errors: 0, Skipped: 0, Time elapsed: 0.043 sec
14-Jul-2021 21:03:49 Running org.openmrs.module.reporting.cohort.definition.evaluator.InProgramCohortDefinitionEvaluatorTest
14-Jul-2021 21:03:50 Tests run: 5, Failures: 0, Errors: 0, Skipped: 0, Time elapsed: 0.869 sec
14-Jul-2021 21:03:50 Running org.openmrs.module.reporting.calculation.PatientDataCalculationBehaviorTest
14-Jul-2021 21:03:50 Tests run: 3, Failures: 0, Errors: 0, Skipped: 0, Time elapsed: 0.438 sec
14-Jul-2021 21:03:50 Running org.openmrs.module.reporting.dataset.definition.evaluator.CohortIndicatorDataSetEvaluatorTest
14-Jul-2021 21:03:50 Tests run: 1, Failures: 0, Errors: 0, Skipped: 0, Time elapsed: 0.14 sec
14-Jul-2021 21:03:50 Running org.openmrs.module.reporting.query.encounter.evaluator.AuditEncounterQueryEvaluatorTest
14-Jul-2021 21:03:51 Tests run: 5, Failures: 0, Errors: 0, Skipped: 0, Time elapsed: 0.762 sec
14-Jul-2021 21:03:51 Running org.openmrs.module.reporting.definition.service.DefinitionServiceTest
14-Jul-2021 21:03:51 Tests run: 1, Failures: 0, Errors: 0, Skipped: 0, Time elapsed: 0.074 sec
14-Jul-2021 21:03:51 Running org.openmrs.module.reporting.indicator.aggregation.AggregationTest
14-Jul-2021 21:03:51 Tests run: 12, Failures: 0, Errors: 0, Skipped: 0, Time elapsed: 0.011 sec
14-Jul-2021 21:03:51 Running org.openmrs.module.reporting.data.person.evaluator.ConvertedPersonDataEvaluatorTest
14-Jul-2021 21:03:51 Tests run: 1, Failures: 0, Errors: 0, Skipped: 0, Time elapsed: 0.124 sec
14-Jul-2021 21:03:51 Running org.openmrs.module.reporting.query.encounter.evaluator.SqlEncounterQueryEvaluatorTest
14-Jul-2021 21:03:52 Tests run: 3, Failures: 0, Errors: 0, Skipped: 0, Time elapsed: 0.33 sec
14-Jul-2021 21:03:52 Running org.openmrs.module.reporting.report.renderer.CsvReportRendererTest
14-Jul-2021 21:03:52 Tests run: 1, Failures: 0, Errors: 0, Skipped: 0, Time elapsed: 0.017 sec
14-Jul-2021 21:03:52 Running org.openmrs.module.reporting.dataset.definition.evaluator.LogicDataSetEvaluatorTest
14-Jul-2021 21:03:52 Tests run: 1, Failures: 0, Errors: 0, Skipped: 1, Time elapsed: 0.001 sec
14-Jul-2021 21:03:52 Running org.openmrs.module.reporting.dataset.definition.evaluator.VisitDataSetEvaluatorTest
14-Jul-2021 21:03:52 VISIT ID        EMR ID        BIRTHDATE          
14-Jul-2021 21:03:52 --------        ------        -----------        
14-Jul-2021 21:03:52 1               2             08/Apr/1975        
14-Jul-2021 21:03:52 2               2             08/Apr/1975        
14-Jul-2021 21:03:52 3               2             08/Apr/1975        
14-Jul-2021 21:03:52 4               6             27/May/2007        
14-Jul-2021 21:03:52 5               6             27/May/2007        
14-Jul-2021 21:03:52 Tests run: 1, Failures: 0, Errors: 0, Skipped: 0, Time elapsed: 0.131 sec
14-Jul-2021 21:03:52 Running org.openmrs.module.reporting.data.person.evaluator.PersonIdDataEvaluatorTest
14-Jul-2021 21:03:52 Tests run: 1, Failures: 0, Errors: 0, Skipped: 0, Time elapsed: 0.121 sec
14-Jul-2021 21:03:52 Running org.openmrs.module.reporting.cohort.definition.evaluator.BirthAndDeathCohortDefinitionEvaluatorTest
14-Jul-2021 21:03:53 Tests run: 8, Failures: 0, Errors: 0, Skipped: 0, Time elapsed: 1.205 sec
14-Jul-2021 21:03:53 Running org.openmrs.module.reporting.data.encounter.evaluator.SqlEncounterDataEvaluatorTest
14-Jul-2021 21:03:53 Tests run: 1, Failures: 0, Errors: 0, Skipped: 0, Time elapsed: 0.155 sec
14-Jul-2021 21:03:53 Running org.openmrs.module.reporting.data.converter.PersonAddressConverterTest
14-Jul-2021 21:03:53 Tests run: 1, Failures: 0, Errors: 0, Skipped: 0, Time elapsed: 0.014 sec
14-Jul-2021 21:03:53 Running org.openmrs.module.reporting.data.converter.AttributeValueConverterTest
14-Jul-2021 21:03:54 Tests run: 2, Failures: 0, Errors: 0, Skipped: 0, Time elapsed: 0.35 sec
14-Jul-2021 21:03:54 Running org.openmrs.module.reporting.common.DelimitedKeyComparatorTest
14-Jul-2021 21:03:54 Tests run: 1, Failures: 0, Errors: 0, Skipped: 0, Time elapsed: 0.001 sec
14-Jul-2021 21:03:54 Running org.openmrs.module.reporting.data.obs.evaluator.ConvertedObsDataEvaluatorTest
14-Jul-2021 21:03:54 Tests run: 1, Failures: 0, Errors: 0, Skipped: 0, Time elapsed: 0.125 sec
14-Jul-2021 21:03:54 Running org.openmrs.module.reporting.query.person.evaluator.SqlPersonQueryEvaluatorTest
14-Jul-2021 21:03:54 Tests run: 2, Failures: 0, Errors: 0, Skipped: 0, Time elapsed: 0.255 sec
14-Jul-2021 21:03:54 Running org.openmrs.module.reporting.query.person.evaluator.AllPersonQueryEvaluatorTest
14-Jul-2021 21:03:55 Tests run: 6, Failures: 0, Errors: 0, Skipped: 0, Time elapsed: 0.677 sec
14-Jul-2021 21:03:55 Running org.openmrs.module.reporting.dataset.definition.evaluator.SqlFileDataSetEvaluatorTest
14-Jul-2021 21:03:55 Tests run: 2, Failures: 0, Errors: 0, Skipped: 0, Time elapsed: 0.531 sec
14-Jul-2021 21:03:55 Running org.openmrs.module.reporting.data.person.evaluator.AgeAtDateOfOtherDataEvaluatorTest
14-Jul-2021 21:03:56 Tests run: 1, Failures: 0, Errors: 0, Skipped: 0, Time elapsed: 0.504 sec
14-Jul-2021 21:03:56 Running org.openmrs.module.reporting.indicator.PeriodIndicatorReportTest
14-Jul-2021 21:03:56 Tests run: 2, Failures: 0, Errors: 0, Skipped: 0, Time elapsed: 0.263 sec
14-Jul-2021 21:03:56 Running org.openmrs.module.reporting.report.renderer.DelimitedTextReportRendererTest
14-Jul-2021 21:03:56 Tests run: 11, Failures: 0, Errors: 0, Skipped: 0, Time elapsed: 0.335 sec
14-Jul-2021 21:03:56 Running org.openmrs.module.reporting.data.patient.evaluator.PatientObjectDataEvaluatorTest
14-Jul-2021 21:03:56 Tests run: 1, Failures: 0, Errors: 0, Skipped: 0, Time elapsed: 0.157 sec
14-Jul-2021 21:03:56 Running org.openmrs.module.reporting.data.patient.evaluator.TestPatientCalculation
14-Jul-2021 21:03:56 Tests run: 1, Failures: 0, Errors: 0, Skipped: 1, Time elapsed: 0.001 sec
14-Jul-2021 21:03:56 Running org.openmrs.module.reporting.validator.SqlCohortDefinitionValidatorTest
14-Jul-2021 21:03:56 Tests run: 3, Failures: 0, Errors: 0, Skipped: 0, Time elapsed: 0.024 sec
14-Jul-2021 21:03:56 Running org.openmrs.module.reporting.cohort.definition.evaluator.PatientStateCohortDefinitionEvaluatorTest
14-Jul-2021 21:03:57 Tests run: 7, Failures: 0, Errors: 0, Skipped: 0, Time elapsed: 0.946 sec
14-Jul-2021 21:03:57 Running org.openmrs.module.reporting.data.converter.NullValueConverterTest
14-Jul-2021 21:03:57 Tests run: 1, Failures: 0, Errors: 0, Skipped: 0, Time elapsed: 0.002 sec
14-Jul-2021 21:03:57 Running org.openmrs.module.reporting.query.encounter.evaluator.ConditionalParameterEncounterQueryEvaluatorTest
14-Jul-2021 21:03:58 Tests run: 1, Failures: 0, Errors: 0, Skipped: 0, Time elapsed: 0.132 sec
14-Jul-2021 21:03:58 Running org.openmrs.module.reporting.report.service.TestReportProcessor
14-Jul-2021 21:03:58 Tests run: 1, Failures: 0, Errors: 0, Skipped: 1, Time elapsed: 0.001 sec
14-Jul-2021 21:03:58 Running org.openmrs.module.reporting.common.FractionTest
14-Jul-2021 21:03:58 Tests run: 7, Failures: 0, Errors: 0, Skipped: 0, Time elapsed: 0.002 sec
14-Jul-2021 21:03:58 Running org.openmrs.module.reporting.report.renderer.ReportDesignRendererTest
14-Jul-2021 21:03:58 Tests run: 2, Failures: 0, Errors: 0, Skipped: 0, Time elapsed: 0.055 sec
14-Jul-2021 21:03:58 Running org.openmrs.module.reporting.data.patient.evaluator.ProgramEnrollmentsForPatientDataEvaluatorTest
14-Jul-2021 21:03:59 Tests run: 8, Failures: 0, Errors: 0, Skipped: 0, Time elapsed: 0.962 sec
14-Jul-2021 21:03:59 Running org.openmrs.module.reporting.data.visit.evaluator.OrderForVisitDataEvaluatorTest
14-Jul-2021 21:03:59 Tests run: 2, Failures: 0, Errors: 0, Skipped: 0, Time elapsed: 0.071 sec
14-Jul-2021 21:03:59 Running org.openmrs.module.reporting.report.util.SqlScriptParserTest
14-Jul-2021 21:03:59 Tests run: 4, Failures: 0, Errors: 0, Skipped: 0, Time elapsed: 0.005 sec
14-Jul-2021 21:03:59 Running org.openmrs.module.reporting.definition.library.implementerconfigured.ImplementerConfiguredDataSetDefinitionLibraryTest
14-Jul-2021 21:03:59 Tests run: 3, Failures: 0, Errors: 0, Skipped: 0, Time elapsed: 0.21 sec
14-Jul-2021 21:03:59 Running org.openmrs.module.reporting.cohort.definition.evaluator.PresenceOrAbsenceCohortDefinitionEvaluatorTest
14-Jul-2021 21:03:59 Tests run: 3, Failures: 0, Errors: 0, Skipped: 0, Time elapsed: 0.385 sec
14-Jul-2021 21:03:59 Running org.openmrs.module.reporting.report.definition.service.ReportDefinitionServiceImplTest
14-Jul-2021 21:03:59 Tests run: 2, Failures: 0, Errors: 0, Skipped: 0, Time elapsed: 0.113 sec
14-Jul-2021 21:03:59 Running org.openmrs.module.reporting.data.converter.ObsValueTextAsCodedConverterTest
14-Jul-2021 21:03:59 Tests run: 3, Failures: 0, Errors: 0, Skipped: 0, Time elapsed: 0.027 sec
14-Jul-2021 21:03:59 Running org.openmrs.module.reporting.cohort.definition.service.BaseCohortDefinitionServiceTest
14-Jul-2021 21:03:59 Tests run: 1, Failures: 0, Errors: 0, Skipped: 0, Time elapsed: 0.121 sec
14-Jul-2021 21:03:59 Running org.openmrs.module.reporting.cohort.definition.evaluator.InStateCohortDefinitionEvaluatorTest
14-Jul-2021 21:04:00 Cohort: Cohort id=null size=2
14-Jul-2021 21:04:01 Tests run: 7, Failures: 0, Errors: 0, Skipped: 0, Time elapsed: 1.112 sec
14-Jul-2021 21:04:01 Running org.openmrs.module.reporting.data.patient.evaluator.DefinitionLibraryPatientDataEvaluatorTest
14-Jul-2021 21:04:01 Tests run: 3, Failures: 0, Errors: 0, Skipped: 0, Time elapsed: 0.339 sec
14-Jul-2021 21:04:01 Running org.openmrs.module.reporting.cohort.definition.evaluator.DefinitionLibraryCohortDefinitionEvaluatorTest
14-Jul-2021 21:04:01 Tests run: 3, Failures: 0, Errors: 0, Skipped: 0, Time elapsed: 0.361 sec
14-Jul-2021 21:04:01 Running org.openmrs.module.reporting.dataset.definition.evaluator.CohortsWithVaryingParametersDataSetEvaluatorTest
14-Jul-2021 21:04:01 Tests run: 1, Failures: 0, Errors: 0, Skipped: 0, Time elapsed: 0.172 sec
14-Jul-2021 21:04:01 Running org.openmrs.module.reporting.dataset.definition.evaluator.ObsDataSetEvaluatorTest
14-Jul-2021 21:04:02 Tests run: 1, Failures: 0, Errors: 0, Skipped: 0, Time elapsed: 0.134 sec
14-Jul-2021 21:04:02 Running org.openmrs.module.reporting.data.patient.evaluator.SqlPatientDataEvaluatorTest
14-Jul-2021 21:04:02 Tests run: 1, Failures: 0, Errors: 0, Skipped: 0, Time elapsed: 0.115 sec
14-Jul-2021 21:04:02 Running org.openmrs.module.reporting.data.converter.PrivilegedDataConverterTest
14-Jul-2021 21:04:03 SLF4J: Class path contains multiple SLF4J bindings.
14-Jul-2021 21:04:03 SLF4J: Found binding in [jar:file:/home/bamboo-agent/.m2/repository/org/slf4j/slf4j-log4j12/1.6.0/slf4j-log4j12-1.6.0.jar!/org/slf4j/impl/StaticLoggerBinder.class]
14-Jul-2021 21:04:03 SLF4J: Found binding in [jar:file:/home/bamboo-agent/.m2/repository/org/slf4j/slf4j-log4j12/1.6.0/slf4j-log4j12-1.6.0.jar!/org/slf4j/impl/StaticLoggerBinder.class]
14-Jul-2021 21:04:03 SLF4J: See http://www.slf4j.org/codes.html#multiple_bindings for an explanation.
14-Jul-2021 21:04:04 Tests run: 2, Failures: 0, Errors: 0, Skipped: 0, Time elapsed: 2.246 sec
14-Jul-2021 21:04:04 Running org.openmrs.module.reporting.data.patient.evaluator.PatientCalculationDataEvaluatorTest
14-Jul-2021 21:04:04 ERROR - EvaluationProfiler.log(111) |2021-07-14 21:04:04,659| 1777        2021-07-14 21:04:04.659        >        ERROR        EVALUATING_DEFINITION                        PatientCalculationDataDefinition[Example]: Failed to evaluate No PatientCalculation found on this PatientCalculationDataDefinition
14-Jul-2021 21:04:04 org.openmrs.module.reporting.evaluation.EvaluationException: Failed to evaluate No PatientCalculation found on this PatientCalculationDataDefinition
14-Jul-2021 21:04:04         at org.openmrs.module.reporting.data.patient.evaluator.PatientCalculationDataEvaluator.evaluate(PatientCalculationDataEvaluator.java:50)
14-Jul-2021 21:04:04         at org.openmrs.module.reporting.data.patient.evaluator.PatientCalculationDataEvaluator.evaluate(PatientCalculationDataEvaluator.java:34)
14-Jul-2021 21:04:04         at org.openmrs.module.reporting.definition.service.BaseDefinitionService.executeEvaluator(BaseDefinitionService.java:369)
14-Jul-2021 21:04:04         at org.openmrs.module.reporting.data.patient.service.PatientDataServiceImpl.executeEvaluator(PatientDataServiceImpl.java:66)
14-Jul-2021 21:04:04         at org.openmrs.module.reporting.data.patient.service.PatientDataServiceImpl.executeEvaluator(PatientDataServiceImpl.java:34)
14-Jul-2021 21:04:04         at org.openmrs.module.reporting.definition.service.BaseDefinitionService.evaluateBypassingExclusionOfTestPatients(BaseDefinitionService.java:264)
14-Jul-2021 21:04:04         at org.openmrs.module.reporting.definition.service.BaseDefinitionService.evaluate(BaseDefinitionService.java:229)
14-Jul-2021 21:04:04         at org.openmrs.module.reporting.data.patient.service.PatientDataServiceImpl.evaluate(PatientDataServiceImpl.java:48)
14-Jul-2021 21:04:04         at sun.reflect.GeneratedMethodAccessor831.invoke(Unknown Source)
14-Jul-2021 21:04:04         at sun.reflect.DelegatingMethodAccessorImpl.invoke(DelegatingMethodAccessorImpl.java:43)
14-Jul-2021 21:04:04         at java.lang.reflect.Method.invoke(Method.java:498)
14-Jul-2021 21:04:04         at org.springframework.aop.support.AopUtils.invokeJoinpointUsingReflection(AopUtils.java:317)
14-Jul-2021 21:04:04         at org.springframework.aop.framework.ReflectiveMethodInvocation.invokeJoinpoint(ReflectiveMethodInvocation.java:190)
14-Jul-2021 21:04:04         at org.springframework.aop.framework.ReflectiveMethodInvocation.proceed(ReflectiveMethodInvocation.java:157)
14-Jul-2021 21:04:04         at org.openmrs.aop.LoggingAdvice.invoke(LoggingAdvice.java:121)
14-Jul-2021 21:04:04         at org.springframework.aop.framework.ReflectiveMethodInvocation.proceed(ReflectiveMethodInvocation.java:179)
14-Jul-2021 21:04:04         at org.springframework.aop.framework.adapter.MethodBeforeAdviceInterceptor.invoke(MethodBeforeAdviceInterceptor.java:52)
14-Jul-2021 21:04:04         at org.springframework.aop.framework.ReflectiveMethodInvocation.proceed(ReflectiveMethodInvocation.java:179)
14-Jul-2021 21:04:04         at org.springframework.aop.framework.adapter.MethodBeforeAdviceInterceptor.invoke(MethodBeforeAdviceInterceptor.java:52)
14-Jul-2021 21:04:04         at org.springframework.aop.framework.ReflectiveMethodInvocation.proceed(ReflectiveMethodInvocation.java:179)
14-Jul-2021 21:04:04         at org.springframework.aop.framework.JdkDynamicAopProxy.invoke(JdkDynamicAopProxy.java:207)
14-Jul-2021 21:04:04         at com.sun.proxy.$Proxy32.evaluate(Unknown Source)
14-Jul-2021 21:04:04         at sun.reflect.GeneratedMethodAccessor831.invoke(Unknown Source)
14-Jul-2021 21:04:04         at sun.reflect.DelegatingMethodAccessorImpl.invoke(DelegatingMethodAccessorImpl.java:43)
14-Jul-2021 21:04:04         at java.lang.reflect.Method.invoke(Method.java:498)
14-Jul-2021 21:04:04         at org.springframework.aop.support.AopUtils.invokeJoinpointUsingReflection(AopUtils.java:317)
14-Jul-2021 21:04:04         at org.springframework.aop.framework.JdkDynamicAopProxy.invoke(JdkDynamicAopProxy.java:201)
14-Jul-2021 21:04:04         at com.sun.proxy.$Proxy143.evaluate(Unknown Source)
14-Jul-2021 21:04:04         at org.openmrs.module.reporting.data.patient.evaluator.PatientCalculationDataEvaluatorTest.evaluate_shouldThrowAnErrorIfNoCalculationRegistrationExistsOnTheDefinition(PatientCalculationDataEvaluatorTest.java:90)
14-Jul-2021 21:04:04         at sun.reflect.NativeMethodAccessorImpl.invoke0(Native Method)
14-Jul-2021 21:04:04         at sun.reflect.NativeMethodAccessorImpl.invoke(NativeMethodAccessorImpl.java:62)
14-Jul-2021 21:04:04         at sun.reflect.DelegatingMethodAccessorImpl.invoke(DelegatingMethodAccessorImpl.java:43)
14-Jul-2021 21:04:04         at java.lang.reflect.Method.invoke(Method.java:498)
14-Jul-2021 21:04:04         at org.junit.runners.model.FrameworkMethod$1.runReflectiveCall(FrameworkMethod.java:47)
14-Jul-2021 21:04:04         at org.junit.internal.runners.model.ReflectiveCallable.run(ReflectiveCallable.java:12)
14-Jul-2021 21:04:04         at org.junit.runners.model.FrameworkMethod.invokeExplosively(FrameworkMethod.java:44)
14-Jul-2021 21:04:04         at org.junit.internal.runners.statements.InvokeMethod.evaluate(InvokeMethod.java:17)
14-Jul-2021 21:04:04         at org.junit.internal.runners.statements.ExpectException.evaluate(ExpectException.java:19)
14-Jul-2021 21:04:04         at org.junit.internal.runners.statements.RunBefores.evaluate(RunBefores.java:26)
14-Jul-2021 21:04:04         at org.springframework.test.context.junit4.statements.RunBeforeTestMethodCallbacks.evaluate(RunBeforeTestMethodCallbacks.java:73)
14-Jul-2021 21:04:04         at org.junit.internal.runners.statements.RunAfters.evaluate(RunAfters.java:27)
14-Jul-2021 21:04:04         at org.springframework.test.context.junit4.statements.RunAfterTestMethodCallbacks.evaluate(RunAfterTestMethodCallbacks.java:82)
14-Jul-2021 21:04:04         at org.springframework.test.context.junit4.statements.SpringRepeat.evaluate(SpringRepeat.java:73)
14-Jul-2021 21:04:04         at org.junit.runners.ParentRunner.runLeaf(ParentRunner.java:271)
14-Jul-2021 21:04:04         at org.springframework.test.context.junit4.SpringJUnit4ClassRunner.runChild(SpringJUnit4ClassRunner.java:217)
14-Jul-2021 21:04:04         at org.springframework.test.context.junit4.SpringJUnit4ClassRunner.runChild(SpringJUnit4ClassRunner.java:83)
14-Jul-2021 21:04:04         at org.junit.runners.ParentRunner$3.run(ParentRunner.java:238)
14-Jul-2021 21:04:04         at org.junit.runners.ParentRunner$1.schedule(ParentRunner.java:63)
14-Jul-2021 21:04:04         at org.junit.runners.ParentRunner.runChildren(ParentRunner.java:236)
14-Jul-2021 21:04:04         at org.junit.runners.ParentRunner.access$000(ParentRunner.java:53)
14-Jul-2021 21:04:04         at org.junit.runners.ParentRunner$2.evaluate(ParentRunner.java:229)
14-Jul-2021 21:04:04         at org.springframework.test.context.junit4.statements.RunBeforeTestClassCallbacks.evaluate(RunBeforeTestClassCallbacks.java:61)
14-Jul-2021 21:04:04         at org.junit.internal.runners.statements.RunAfters.evaluate(RunAfters.java:27)
14-Jul-2021 21:04:04         at org.springframework.test.context.junit4.statements.RunAfterTestClassCallbacks.evaluate(RunAfterTestClassCallbacks.java:68)
14-Jul-2021 21:04:04         at org.junit.runners.ParentRunner.run(ParentRunner.java:309)
14-Jul-2021 21:04:04         at org.springframework.test.context.junit4.SpringJUnit4ClassRunner.run(SpringJUnit4ClassRunner.java:163)
14-Jul-2021 21:04:04         at org.apache.maven.surefire.junit4.JUnit4TestSet.execute(JUnit4TestSet.java:59)
14-Jul-2021 21:04:04         at org.apache.maven.surefire.suite.AbstractDirectoryTestSuite.executeTestSet(AbstractDirectoryTestSuite.java:115)
14-Jul-2021 21:04:04         at org.apache.maven.surefire.suite.AbstractDirectoryTestSuite.execute(AbstractDirectoryTestSuite.java:102)
14-Jul-2021 21:04:04         at org.apache.maven.surefire.Surefire.run(Surefire.java:180)
14-Jul-2021 21:04:04         at sun.reflect.NativeMethodAccessorImpl.invoke0(Native Method)
14-Jul-2021 21:04:04         at sun.reflect.NativeMethodAccessorImpl.invoke(NativeMethodAccessorImpl.java:62)
14-Jul-2021 21:04:04         at sun.reflect.DelegatingMethodAccessorImpl.invoke(DelegatingMethodAccessorImpl.java:43)
14-Jul-2021 21:04:04         at java.lang.reflect.Method.invoke(Method.java:498)
14-Jul-2021 21:04:04         at org.apache.maven.surefire.booter.SurefireBooter.runSuitesInProcess(SurefireBooter.java:350)
14-Jul-2021 21:04:04         at org.apache.maven.surefire.booter.SurefireBooter.main(SurefireBooter.java:1021)
14-Jul-2021 21:04:04 Tests run: 2, Failures: 0, Errors: 0, Skipped: 0, Time elapsed: 0.527 sec
14-Jul-2021 21:04:04 Running org.openmrs.module.reporting.data.converter.DateConverterTest
14-Jul-2021 21:04:05 Tests run: 1, Failures: 0, Errors: 0, Skipped: 0, Time elapsed: 0.113 sec
14-Jul-2021 21:04:05 Running org.openmrs.module.reporting.dataset.definition.evaluator.EncounterAndObsDataSetEvaluatorTest
14-Jul-2021 21:04:05 Tests run: 1, Failures: 0, Errors: 0, Skipped: 0, Time elapsed: 0.351 sec
14-Jul-2021 21:04:05 Running org.openmrs.module.reporting.data.encounter.evaluator.PatientToEncounterDataEvaluatorTest
14-Jul-2021 21:04:05 Tests run: 3, Failures: 0, Errors: 0, Skipped: 0, Time elapsed: 0.425 sec
14-Jul-2021 21:04:05 Running org.openmrs.module.reporting.data.patient.evaluator.PatientIdDataEvaluatorTest
14-Jul-2021 21:04:05 Tests run: 1, Failures: 0, Errors: 0, Skipped: 0, Time elapsed: 0.116 sec
14-Jul-2021 21:04:05 Running org.openmrs.module.reporting.data.person.evaluator.RelationshipsForPersonDataEvaluatorTest
14-Jul-2021 21:04:06 Tests run: 3, Failures: 0, Errors: 0, Skipped: 0, Time elapsed: 0.369 sec
14-Jul-2021 21:04:06 Running org.openmrs.module.reporting.data.patient.evaluator.PersonToPatientDataEvaluatorTest
14-Jul-2021 21:04:06 Tests run: 1, Failures: 0, Errors: 0, Skipped: 0, Time elapsed: 0.11 sec
14-Jul-2021 21:04:06 Running org.openmrs.module.reporting.data.patient.service.PatientDataServiceImplTest
14-Jul-2021 21:04:07 Tests run: 6, Failures: 0, Errors: 0, Skipped: 0, Time elapsed: 1.169 sec
14-Jul-2021 21:04:07
14-Jul-2021 21:04:07 Results :
14-Jul-2021 21:04:07
14-Jul-2021 21:04:07 Tests run: 732, Failures: 0, Errors: 0, Skipped: 13
14-Jul-2021 21:04:07
14-Jul-2021 21:04:11 [INFO]
14-Jul-2021 21:04:11 [INFO] --- maven-jar-plugin:2.4:jar (default-jar) @ reporting-api-tests ---
14-Jul-2021 21:04:11 [WARNING] JAR will be empty - no content was marked for inclusion!
14-Jul-2021 21:04:11 [INFO] Building jar: /home/bamboo-agent/bamboo-agent/xml-data/build-dir/REP-REP-T2DOT0/api-tests/target/reporting-api-tests-1.24.0-SNAPSHOT.jar
14-Jul-2021 21:04:11 [INFO]
14-Jul-2021 21:04:11 [INFO] --- maven-jar-plugin:2.4:test-jar (default) @ reporting-api-tests ---
14-Jul-2021 21:04:11 [INFO] Building jar: /home/bamboo-agent/bamboo-agent/xml-data/build-dir/REP-REP-T2DOT0/api-tests/target/reporting-api-tests-1.24.0-SNAPSHOT-tests.jar
14-Jul-2021 21:04:13 [INFO]                                                                         
14-Jul-2021 21:04:13 [INFO] ------------------------------------------------------------------------
14-Jul-2021 21:04:13 [INFO] Building reporting Module api 1.10 1.24.0-SNAPSHOT
14-Jul-2021 21:04:13 [INFO] ------------------------------------------------------------------------
14-Jul-2021 21:04:13 [INFO] Downloading: http://mavenrepo.openmrs.org/nexus/content/repositories/public/org/openmrs/api/openmrs-api/1.10.6/openmrs-api-1.10.6.pom
14-Jul-2021 21:04:14 [INFO] Downloaded: http://mavenrepo.openmrs.org/nexus/content/repositories/public/org/openmrs/api/openmrs-api/1.10.6/openmrs-api-1.10.6.pom (11 KB at 15.0 KB/sec)
14-Jul-2021 21:04:14 [INFO] Downloading: http://mavenrepo.openmrs.org/nexus/content/repositories/public/org/openmrs/openmrs/1.10.6/openmrs-1.10.6.pom
14-Jul-2021 21:04:14 [INFO] Downloaded: http://mavenrepo.openmrs.org/nexus/content/repositories/public/org/openmrs/openmrs/1.10.6/openmrs-1.10.6.pom (35 KB at 94.5 KB/sec)
14-Jul-2021 21:04:14 [INFO] Downloading: http://mavenrepo.openmrs.org/nexus/content/repositories/public/org/openmrs/test/openmrs-test/1.10.6/openmrs-test-1.10.6.pom
14-Jul-2021 21:04:15 [INFO] Downloaded: http://mavenrepo.openmrs.org/nexus/content/repositories/public/org/openmrs/test/openmrs-test/1.10.6/openmrs-test-1.10.6.pom (3 KB at 9.7 KB/sec)
14-Jul-2021 21:04:15 [INFO] Downloading: http://mavenrepo.openmrs.org/nexus/content/repositories/public/org/openmrs/web/openmrs-web/1.10.6/openmrs-web-1.10.6.pom
14-Jul-2021 21:04:15 [INFO] Downloaded: http://mavenrepo.openmrs.org/nexus/content/repositories/public/org/openmrs/web/openmrs-web/1.10.6/openmrs-web-1.10.6.pom (6 KB at 23.7 KB/sec)
14-Jul-2021 21:04:16 [INFO] Downloading: http://mavenrepo.openmrs.org/nexus/content/repositories/public/org/openmrs/api/openmrs-api/1.10.6/openmrs-api-1.10.6.jar
14-Jul-2021 21:04:16 [INFO] Downloading: http://mavenrepo.openmrs.org/nexus/content/repositories/public/org/openmrs/api/openmrs-api/1.10.6/openmrs-api-1.10.6-tests.jar
14-Jul-2021 21:04:16 [INFO] Downloading: http://mavenrepo.openmrs.org/nexus/content/repositories/public/org/openmrs/web/openmrs-web/1.10.6/openmrs-web-1.10.6.jar
14-Jul-2021 21:04:16 [INFO] Downloading: http://mavenrepo.openmrs.org/nexus/content/repositories/public/org/openmrs/web/openmrs-web/1.10.6/openmrs-web-1.10.6-tests.jar
14-Jul-2021 21:04:17 [INFO] Downloaded: http://mavenrepo.openmrs.org/nexus/content/repositories/public/org/openmrs/web/openmrs-web/1.10.6/openmrs-web-1.10.6-tests.jar (158 KB at 173.9 KB/sec)
14-Jul-2021 21:04:18 [INFO] Downloaded: http://mavenrepo.openmrs.org/nexus/content/repositories/public/org/openmrs/web/openmrs-web/1.10.6/openmrs-web-1.10.6.jar (827 KB at 380.8 KB/sec)
14-Jul-2021 21:04:25 [INFO] Downloaded: http://mavenrepo.openmrs.org/nexus/content/repositories/public/org/openmrs/api/openmrs-api/1.10.6/openmrs-api-1.10.6.jar (1833 KB at 198.6 KB/sec)
14-Jul-2021 21:04:37 [INFO] Downloaded: http://mavenrepo.openmrs.org/nexus/content/repositories/public/org/openmrs/api/openmrs-api/1.10.6/openmrs-api-1.10.6-tests.jar (2743 KB at 133.4 KB/sec)
14-Jul-2021 21:04:37 [INFO]
14-Jul-2021 21:04:37 [INFO] --- maven-clean-plugin:2.5:clean (default-clean) @ reporting-api-1.10 ---
14-Jul-2021 21:04:37 [INFO]
14-Jul-2021 21:04:37 [INFO] --- maven-resources-plugin:2.6:resources (default-resources) @ reporting-api-1.10 ---
14-Jul-2021 21:04:37 [INFO] Using 'UTF-8' encoding to copy filtered resources.
14-Jul-2021 21:04:37 [INFO] skip non existing resourceDirectory /home/bamboo-agent/bamboo-agent/xml-data/build-dir/REP-REP-T2DOT0/api-1.10/src/main/resources
14-Jul-2021 21:04:37 [INFO]
14-Jul-2021 21:04:37 [INFO] --- maven-compiler-plugin:3.1:compile (default-compile) @ reporting-api-1.10 ---
14-Jul-2021 21:04:37 [INFO] Changes detected - recompiling the module!
14-Jul-2021 21:04:37 [INFO] Compiling 3 source files to /home/bamboo-agent/bamboo-agent/xml-data/build-dir/REP-REP-T2DOT0/api-1.10/target/classes
14-Jul-2021 21:04:38 [INFO]
14-Jul-2021 21:04:38 [INFO] --- build-helper-maven-plugin:1.7:parse-version (default) @ reporting-api-1.10 ---
14-Jul-2021 21:04:38 [INFO]
14-Jul-2021 21:04:38 [INFO] --- maven-resources-plugin:2.6:testResources (default-testResources) @ reporting-api-1.10 ---
14-Jul-2021 21:04:38 [INFO] Using 'UTF-8' encoding to copy filtered resources.
14-Jul-2021 21:04:38 [INFO] Copying 1 resource
14-Jul-2021 21:04:38 [INFO] Copying 0 resource
14-Jul-2021 21:04:38 [INFO]
14-Jul-2021 21:04:38 [INFO] --- maven-compiler-plugin:3.1:testCompile (default-testCompile) @ reporting-api-1.10 ---
14-Jul-2021 21:04:38 [INFO] Changes detected - recompiling the module!
14-Jul-2021 21:04:38 [INFO] Compiling 2 source files to /home/bamboo-agent/bamboo-agent/xml-data/build-dir/REP-REP-T2DOT0/api-1.10/target/test-classes
14-Jul-2021 21:04:38 [WARNING] /home/bamboo-agent/bamboo-agent/xml-data/build-dir/REP-REP-T2DOT0/api-1.10/src/test/java/org/openmrs/module/reporting/cohort/definition/evaluator/DrugOrderCohortDefinitionEvaluatorTest.java: /home/bamboo-agent/bamboo-agent/xml-data/build-dir/REP-REP-T2DOT0/api-1.10/src/test/java/org/openmrs/module/reporting/cohort/definition/evaluator/DrugOrderCohortDefinitionEvaluatorTest.java uses or overrides a deprecated API.
14-Jul-2021 21:04:38 [WARNING] /home/bamboo-agent/bamboo-agent/xml-data/build-dir/REP-REP-T2DOT0/api-1.10/src/test/java/org/openmrs/module/reporting/cohort/definition/evaluator/DrugOrderCohortDefinitionEvaluatorTest.java: Recompile with -Xlint:deprecation for details.
14-Jul-2021 21:04:38 [WARNING] /home/bamboo-agent/bamboo-agent/xml-data/build-dir/REP-REP-T2DOT0/api-1.10/src/test/java/org/openmrs/module/reporting/cohort/definition/evaluator/DrugOrderCohortDefinitionEvaluatorTest.java: /home/bamboo-agent/bamboo-agent/xml-data/build-dir/REP-REP-T2DOT0/api-1.10/src/test/java/org/openmrs/module/reporting/cohort/definition/evaluator/DrugOrderCohortDefinitionEvaluatorTest.java uses unchecked or unsafe operations.
14-Jul-2021 21:04:38 [WARNING] /home/bamboo-agent/bamboo-agent/xml-data/build-dir/REP-REP-T2DOT0/api-1.10/src/test/java/org/openmrs/module/reporting/cohort/definition/evaluator/DrugOrderCohortDefinitionEvaluatorTest.java: Recompile with -Xlint:unchecked for details.
14-Jul-2021 21:04:38 [INFO]
14-Jul-2021 21:04:38 [INFO] --- maven-surefire-plugin:2.5:test (default-test) @ reporting-api-1.10 ---
14-Jul-2021 21:04:38 [INFO] Surefire report directory: /home/bamboo-agent/bamboo-agent/xml-data/build-dir/REP-REP-T2DOT0/api-1.10/target/surefire-reports
14-Jul-2021 21:04:38 OpenJDK 64-Bit Server VM warning: ignoring option MaxPermSize=512m; support was removed in 8.0
14-Jul-2021 21:04:39
14-Jul-2021 21:04:39 -------------------------------------------------------
14-Jul-2021 21:04:39 T E S T S
14-Jul-2021 21:04:39 -------------------------------------------------------
14-Jul-2021 21:04:39 Running org.openmrs.module.reporting.cohort.definition.evaluator.DrugOrderCohortDefinitionEvaluatorTest
14-Jul-2021 21:04:40 log4j:WARN No appenders could be found for logger (org.springframework.test.context.junit4.SpringJUnit4ClassRunner).
14-Jul-2021 21:04:40 log4j:WARN Please initialize the log4j system properly.
14-Jul-2021 21:05:02 Tests run: 18, Failures: 0, Errors: 0, Skipped: 0, Time elapsed: 22.832 sec
14-Jul-2021 21:05:02 Running org.openmrs.module.reporting.cohort.definition.library.BuiltInCohortDefinitionLibrary1_10Test
14-Jul-2021 21:05:02 Tests run: 1, Failures: 0, Errors: 0, Skipped: 0, Time elapsed: 0.046 sec
14-Jul-2021 21:05:02
14-Jul-2021 21:05:02 Results :
14-Jul-2021 21:05:02
14-Jul-2021 21:05:02 Tests run: 19, Failures: 0, Errors: 0, Skipped: 0
14-Jul-2021 21:05:02
14-Jul-2021 21:05:02 [INFO]
14-Jul-2021 21:05:02 [INFO] --- maven-jar-plugin:2.4:jar (default-jar) @ reporting-api-1.10 ---
14-Jul-2021 21:05:02 [INFO] Building jar: /home/bamboo-agent/bamboo-agent/xml-data/build-dir/REP-REP-T2DOT0/api-1.10/target/reporting-api-1.10-1.24.0-SNAPSHOT.jar
14-Jul-2021 21:05:02 [INFO]
14-Jul-2021 21:05:02 [INFO] --- maven-jar-plugin:2.4:test-jar (default) @ reporting-api-1.10 ---
14-Jul-2021 21:05:02 [INFO] Building jar: /home/bamboo-agent/bamboo-agent/xml-data/build-dir/REP-REP-T2DOT0/api-1.10/target/reporting-api-1.10-1.24.0-SNAPSHOT-tests.jar
14-Jul-2021 21:05:02 [INFO]                                                                         
14-Jul-2021 21:05:02 [INFO] ------------------------------------------------------------------------
14-Jul-2021 21:05:02 [INFO] Building reporting Module api 2.2 1.24.0-SNAPSHOT
14-Jul-2021 21:05:02 [INFO] ------------------------------------------------------------------------
14-Jul-2021 21:05:06 [INFO]
14-Jul-2021 21:05:06 [INFO] --- maven-clean-plugin:2.5:clean (default-clean) @ reporting-api-2.2 ---
14-Jul-2021 21:05:06 [INFO]
14-Jul-2021 21:05:06 [INFO] --- maven-resources-plugin:2.6:resources (default-resources) @ reporting-api-2.2 ---
14-Jul-2021 21:05:06 [INFO] Using 'UTF-8' encoding to copy filtered resources.
14-Jul-2021 21:05:06 [INFO] skip non existing resourceDirectory /home/bamboo-agent/bamboo-agent/xml-data/build-dir/REP-REP-T2DOT0/api-2.2/src/main/resources
14-Jul-2021 21:05:06 [INFO]
14-Jul-2021 21:05:06 [INFO] --- maven-compiler-plugin:3.1:compile (default-compile) @ reporting-api-2.2 ---
14-Jul-2021 21:05:06 [INFO] Changes detected - recompiling the module!
14-Jul-2021 21:05:06 [INFO] Compiling 3 source files to /home/bamboo-agent/bamboo-agent/xml-data/build-dir/REP-REP-T2DOT0/api-2.2/target/classes
14-Jul-2021 21:05:07 [INFO]
14-Jul-2021 21:05:07 [INFO] --- build-helper-maven-plugin:1.7:parse-version (default) @ reporting-api-2.2 ---
14-Jul-2021 21:05:07 [INFO]
14-Jul-2021 21:05:07 [INFO] --- maven-resources-plugin:2.6:testResources (default-testResources) @ reporting-api-2.2 ---
14-Jul-2021 21:05:07 [INFO] Using 'UTF-8' encoding to copy filtered resources.
14-Jul-2021 21:05:08 [INFO] Copying 1 resource
14-Jul-2021 21:05:08 [INFO] Copying 0 resource
14-Jul-2021 21:05:08 [INFO]
14-Jul-2021 21:05:08 [INFO] --- maven-compiler-plugin:3.1:testCompile (default-testCompile) @ reporting-api-2.2 ---
14-Jul-2021 21:05:08 [INFO] Changes detected - recompiling the module!
14-Jul-2021 21:05:08 [INFO] Compiling 2 source files to /home/bamboo-agent/bamboo-agent/xml-data/build-dir/REP-REP-T2DOT0/api-2.2/target/test-classes
14-Jul-2021 21:05:08 [INFO]
14-Jul-2021 21:05:08 [INFO] --- maven-surefire-plugin:2.5:test (default-test) @ reporting-api-2.2 ---
14-Jul-2021 21:05:08 [INFO] Surefire report directory: /home/bamboo-agent/bamboo-agent/xml-data/build-dir/REP-REP-T2DOT0/api-2.2/target/surefire-reports
14-Jul-2021 21:05:08 OpenJDK 64-Bit Server VM warning: ignoring option MaxPermSize=512m; support was removed in 8.0
14-Jul-2021 21:05:09
14-Jul-2021 21:05:09 -------------------------------------------------------
14-Jul-2021 21:05:09 T E S T S
14-Jul-2021 21:05:09 -------------------------------------------------------
14-Jul-2021 21:05:09 Running org.openmrs.module.reporting.cohort.definition.evaluator.ConditionCohortDefinitionEvaluatorTest
14-Jul-2021 21:05:09 log4j:WARN No appenders could be found for logger (org.springframework.test.context.junit4.SpringJUnit4ClassRunner).
14-Jul-2021 21:05:09 log4j:WARN Please initialize the log4j system properly.
14-Jul-2021 21:05:29 Tests run: 12, Failures: 0, Errors: 0, Skipped: 0, Time elapsed: 20.725 sec
14-Jul-2021 21:05:29 Running org.openmrs.module.reporting.cohort.definition.library.BuiltInCohortDefinitionLibrary2_2Test
14-Jul-2021 21:05:29 Tests run: 1, Failures: 0, Errors: 0, Skipped: 0, Time elapsed: 0.006 sec
14-Jul-2021 21:05:29
14-Jul-2021 21:05:29 Results :
14-Jul-2021 21:05:29
14-Jul-2021 21:05:29 Tests run: 13, Failures: 0, Errors: 0, Skipped: 0
14-Jul-2021 21:05:29
14-Jul-2021 21:05:30 [INFO]
14-Jul-2021 21:05:30 [INFO] --- maven-jar-plugin:2.4:jar (default-jar) @ reporting-api-2.2 ---
14-Jul-2021 21:05:30 [INFO] Building jar: /home/bamboo-agent/bamboo-agent/xml-data/build-dir/REP-REP-T2DOT0/api-2.2/target/reporting-api-2.2-1.24.0-SNAPSHOT.jar
14-Jul-2021 21:05:30 [INFO]
14-Jul-2021 21:05:30 [INFO] --- maven-jar-plugin:2.4:test-jar (default) @ reporting-api-2.2 ---
14-Jul-2021 21:05:30 [INFO] Building jar: /home/bamboo-agent/bamboo-agent/xml-data/build-dir/REP-REP-T2DOT0/api-2.2/target/reporting-api-2.2-1.24.0-SNAPSHOT-tests.jar
14-Jul-2021 21:05:30 [INFO]                                                                         
14-Jul-2021 21:05:30 [INFO] ------------------------------------------------------------------------
14-Jul-2021 21:05:30 [INFO] Building reporting Module api 2.4 1.24.0-SNAPSHOT
14-Jul-2021 21:05:30 [INFO] ------------------------------------------------------------------------
14-Jul-2021 21:05:34 [INFO]
14-Jul-2021 21:05:34 [INFO] --- maven-clean-plugin:2.5:clean (default-clean) @ reporting-api-2.4 ---
14-Jul-2021 21:05:34 [INFO]
14-Jul-2021 21:05:34 [INFO] --- maven-resources-plugin:2.6:resources (default-resources) @ reporting-api-2.4 ---
14-Jul-2021 21:05:34 [INFO] Using 'UTF-8' encoding to copy filtered resources.
14-Jul-2021 21:05:34 [INFO] skip non existing resourceDirectory /home/bamboo-agent/bamboo-agent/xml-data/build-dir/REP-REP-T2DOT0/api-2.4/src/main/resources
14-Jul-2021 21:05:34 [INFO]
14-Jul-2021 21:05:34 [INFO] --- maven-compiler-plugin:3.1:compile (default-compile) @ reporting-api-2.4 ---
14-Jul-2021 21:05:34 [INFO] Changes detected - recompiling the module!
14-Jul-2021 21:05:34 [INFO] Compiling 4 source files to /home/bamboo-agent/bamboo-agent/xml-data/build-dir/REP-REP-T2DOT0/api-2.4/target/classes
14-Jul-2021 21:05:41 [INFO]
14-Jul-2021 21:05:41 [INFO] --- build-helper-maven-plugin:1.7:parse-version (default) @ reporting-api-2.4 ---
14-Jul-2021 21:05:41 [INFO]
14-Jul-2021 21:05:41 [INFO] --- maven-resources-plugin:2.6:testResources (default-testResources) @ reporting-api-2.4 ---
14-Jul-2021 21:05:41 [INFO] Using 'UTF-8' encoding to copy filtered resources.
14-Jul-2021 21:05:41 [INFO] skip non existing resourceDirectory /home/bamboo-agent/bamboo-agent/xml-data/build-dir/REP-REP-T2DOT0/api-2.4/src/test/resources
14-Jul-2021 21:05:41 [INFO] skip non existing resourceDirectory /home/bamboo-agent/bamboo-agent/xml-data/build-dir/REP-REP-T2DOT0/api-2.4/src/test/resources
14-Jul-2021 21:05:41 [INFO]
14-Jul-2021 21:05:41 [INFO] --- maven-compiler-plugin:3.1:testCompile (default-testCompile) @ reporting-api-2.4 ---
14-Jul-2021 21:05:41 [INFO] No sources to compile
14-Jul-2021 21:05:41 [INFO]
14-Jul-2021 21:05:41 [INFO] --- maven-surefire-plugin:2.5:test (default-test) @ reporting-api-2.4 ---
14-Jul-2021 21:05:41 [INFO] No tests to run.
14-Jul-2021 21:05:41 [INFO]
14-Jul-2021 21:05:41 [INFO] --- maven-jar-plugin:2.4:jar (default-jar) @ reporting-api-2.4 ---
14-Jul-2021 21:05:41 [INFO] Building jar: /home/bamboo-agent/bamboo-agent/xml-data/build-dir/REP-REP-T2DOT0/api-2.4/target/reporting-api-2.4-1.24.0-SNAPSHOT.jar
14-Jul-2021 21:05:41 [INFO]
14-Jul-2021 21:05:41 [INFO] --- maven-jar-plugin:2.4:test-jar (default) @ reporting-api-2.4 ---
14-Jul-2021 21:05:41 [WARNING] JAR will be empty - no content was marked for inclusion!
14-Jul-2021 21:05:41 [INFO] Building jar: /home/bamboo-agent/bamboo-agent/xml-data/build-dir/REP-REP-T2DOT0/api-2.4/target/reporting-api-2.4-1.24.0-SNAPSHOT-tests.jar
14-Jul-2021 21:05:41 [INFO]                                                                         
14-Jul-2021 21:05:41 [INFO] ------------------------------------------------------------------------
14-Jul-2021 21:05:41 [INFO] Building Reporting OMOD 1.24.0-SNAPSHOT
14-Jul-2021 21:05:41 [INFO] ------------------------------------------------------------------------
14-Jul-2021 21:05:41 [INFO] Downloading: http://mavenrepo.openmrs.org/nexus/content/repositories/public/org/openmrs/module/legacyui-omod/0.2/legacyui-omod-0.2.pom
14-Jul-2021 21:05:41 [INFO] Downloaded: http://mavenrepo.openmrs.org/nexus/content/repositories/public/org/openmrs/module/legacyui-omod/0.2/legacyui-omod-0.2.pom (7 KB at 24.6 KB/sec)
14-Jul-2021 21:05:41 [INFO] Downloading: http://mavenrepo.openmrs.org/nexus/content/repositories/public/org/openmrs/module/legacyui/0.2/legacyui-0.2.pom
14-Jul-2021 21:05:42 [INFO] Downloaded: http://mavenrepo.openmrs.org/nexus/content/repositories/public/org/openmrs/module/legacyui/0.2/legacyui-0.2.pom (6 KB at 20.0 KB/sec)
14-Jul-2021 21:05:42 [INFO] Downloading: http://mavenrepo.openmrs.org/nexus/content/repositories/public/org/openmrs/module/legacyui-api/0.2/legacyui-api-0.2.pom
14-Jul-2021 21:05:42 [INFO] Downloaded: http://mavenrepo.openmrs.org/nexus/content/repositories/public/org/openmrs/module/legacyui-api/0.2/legacyui-api-0.2.pom (2 KB at 6.0 KB/sec)
14-Jul-2021 21:05:42 [INFO] Downloading: http://mavenrepo.openmrs.org/nexus/content/repositories/public/org/openmrs/module/legacyui-omod/0.2/legacyui-omod-0.2.jar
14-Jul-2021 21:05:42 [INFO] Downloading: http://mavenrepo.openmrs.org/nexus/content/repositories/public/org/openmrs/module/legacyui-api/0.2/legacyui-api-0.2.jar
14-Jul-2021 21:05:43 [INFO] Downloaded: http://mavenrepo.openmrs.org/nexus/content/repositories/public/org/openmrs/module/legacyui-api/0.2/legacyui-api-0.2.jar (4 KB at 5.8 KB/sec)
14-Jul-2021 21:06:05 [INFO] Downloaded: http://mavenrepo.openmrs.org/nexus/content/repositories/public/org/openmrs/module/legacyui-omod/0.2/legacyui-omod-0.2.jar (3841 KB at 166.4 KB/sec)
14-Jul-2021 21:06:05 [INFO]
14-Jul-2021 21:06:05 [INFO] --- maven-clean-plugin:2.5:clean (default-clean) @ reporting-omod ---
14-Jul-2021 21:06:05 [INFO]
14-Jul-2021 21:06:05 [INFO] --- maven-openmrs-plugin:1.0.1:initialize-module (init) @ reporting-omod ---
14-Jul-2021 21:06:06 [INFO]
14-Jul-2021 21:06:06 [INFO] --- maven-dependency-plugin:2.8:unpack-dependencies (Expand resources) @ reporting-omod ---
14-Jul-2021 21:06:08 [INFO] Unpacking /home/bamboo-agent/bamboo-agent/xml-data/build-dir/REP-REP-T2DOT0/api/target/reporting-api-1.24.0-SNAPSHOT.jar to /home/bamboo-agent/bamboo-agent/xml-data/build-dir/REP-REP-T2DOT0/omod/target/classes with includes "**\/*.xml,**\/*.properties" and excludes ""
14-Jul-2021 21:06:08 [INFO]
14-Jul-2021 21:06:08 [INFO] --- maven-resources-plugin:2.6:resources (default-resources) @ reporting-omod ---
14-Jul-2021 21:06:08 [INFO] Using 'UTF-8' encoding to copy filtered resources.
14-Jul-2021 21:06:08 [INFO] Copying 0 resource
14-Jul-2021 21:06:08 [INFO] Copying 2 resources
14-Jul-2021 21:06:08 [INFO] Copying 224 resources to web/module
14-Jul-2021 21:06:09 [INFO] Copying 224 resources to web/module
14-Jul-2021 21:06:09 [INFO]
14-Jul-2021 21:06:09 [INFO] --- maven-compiler-plugin:3.1:compile (default-compile) @ reporting-omod ---
14-Jul-2021 21:06:10 [INFO] Changes detected - recompiling the module!
14-Jul-2021 21:06:10 [INFO] Compiling 113 source files to /home/bamboo-agent/bamboo-agent/xml-data/build-dir/REP-REP-T2DOT0/omod/target/classes
14-Jul-2021 21:06:12 [WARNING] /home/bamboo-agent/bamboo-agent/xml-data/build-dir/REP-REP-T2DOT0/omod/src/main/java/org/openmrs/module/reporting/web/reports/RunReportListController.java: Some input files use or override a deprecated API.
14-Jul-2021 21:06:12 [WARNING] /home/bamboo-agent/bamboo-agent/xml-data/build-dir/REP-REP-T2DOT0/omod/src/main/java/org/openmrs/module/reporting/web/reports/RunReportListController.java: Recompile with -Xlint:deprecation for details.
14-Jul-2021 21:06:12 [WARNING] /home/bamboo-agent/bamboo-agent/xml-data/build-dir/REP-REP-T2DOT0/omod/src/main/java/org/openmrs/module/reporting/web/controller/SqlDefinitionController.java: Some input files use unchecked or unsafe operations.
14-Jul-2021 21:06:12 [WARNING] /home/bamboo-agent/bamboo-agent/xml-data/build-dir/REP-REP-T2DOT0/omod/src/main/java/org/openmrs/module/reporting/web/controller/SqlDefinitionController.java: Recompile with -Xlint:unchecked for details.
14-Jul-2021 21:06:12 [INFO]
14-Jul-2021 21:06:12 [INFO] --- build-helper-maven-plugin:1.7:parse-version (default) @ reporting-omod ---
14-Jul-2021 21:06:12 [INFO]
14-Jul-2021 21:06:12 [INFO] --- maven-resources-plugin:2.6:testResources (default-testResources) @ reporting-omod ---
14-Jul-2021 21:06:12 [INFO] Using 'UTF-8' encoding to copy filtered resources.
14-Jul-2021 21:06:12 [INFO] skip non existing resourceDirectory /home/bamboo-agent/bamboo-agent/xml-data/build-dir/REP-REP-T2DOT0/omod/src/test/resources
14-Jul-2021 21:06:12 [INFO] skip non existing resourceDirectory /home/bamboo-agent/bamboo-agent/xml-data/build-dir/REP-REP-T2DOT0/omod/src/test/resources
14-Jul-2021 21:06:12 [INFO]
14-Jul-2021 21:06:12 [INFO] --- maven-compiler-plugin:3.1:testCompile (default-testCompile) @ reporting-omod ---
14-Jul-2021 21:06:12 [INFO] No sources to compile
14-Jul-2021 21:06:12 [INFO]
14-Jul-2021 21:06:12 [INFO] --- maven-surefire-plugin:2.5:test (default-test) @ reporting-omod ---
14-Jul-2021 21:06:12 [INFO] No tests to run.
14-Jul-2021 21:06:12 [INFO]
14-Jul-2021 21:06:12 [INFO] --- maven-jar-plugin:2.4:jar (default-jar) @ reporting-omod ---
14-Jul-2021 21:06:13 [INFO] Building jar: /home/bamboo-agent/bamboo-agent/xml-data/build-dir/REP-REP-T2DOT0/omod/target/reporting-1.24.0-SNAPSHOT.jar
14-Jul-2021 21:06:13 [INFO]
14-Jul-2021 21:06:13 [INFO] --- maven-openmrs-plugin:1.0.1:package-module (pack) @ reporting-omod ---
14-Jul-2021 21:06:13 [INFO] Packaging OpenMRS module
14-Jul-2021 21:06:14 [INFO] Building jar: /home/bamboo-agent/bamboo-agent/xml-data/build-dir/REP-REP-T2DOT0/omod/target/reporting-1.24.0-SNAPSHOT.omod
14-Jul-2021 21:06:15 [INFO]
14-Jul-2021 21:06:15 [INFO] --- maven-jar-plugin:2.4:test-jar (default) @ reporting-omod ---
14-Jul-2021 21:06:15 [WARNING] JAR will be empty - no content was marked for inclusion!
14-Jul-2021 21:06:15 [INFO] Building jar: /home/bamboo-agent/bamboo-agent/xml-data/build-dir/REP-REP-T2DOT0/omod/target/reporting-1.24.0-SNAPSHOT-tests.jar
14-Jul-2021 21:06:15 [INFO] ------------------------------------------------------------------------
14-Jul-2021 21:06:15 [INFO] Reactor Summary:
14-Jul-2021 21:06:15 [INFO]
14-Jul-2021 21:06:15 [INFO] Reporting .......................................... SUCCESS [  3.391 s]
14-Jul-2021 21:06:15 [INFO] Reporting API ...................................... SUCCESS [ 17.794 s]
14-Jul-2021 21:06:15 [INFO] reporting Module api 1.9 ........................... SUCCESS [  4.371 s]
14-Jul-2021 21:06:15 [INFO] reporting Module api 2.0 ........................... SUCCESS [  0.688 s]
14-Jul-2021 21:06:15 [INFO] reporting API Tests ................................ SUCCESS [03:00 min]
14-Jul-2021 21:06:15 [INFO] reporting Module api 1.10 .......................... SUCCESS [ 48.918 s]
14-Jul-2021 21:06:15 [INFO] reporting Module api 2.2 ........................... SUCCESS [ 27.505 s]
14-Jul-2021 21:06:15 [INFO] reporting Module api 2.4 ........................... SUCCESS [ 11.147 s]
14-Jul-2021 21:06:15 [INFO] Reporting OMOD ..................................... SUCCESS [ 33.987 s]
14-Jul-2021 21:06:15 [INFO] ------------------------------------------------------------------------
14-Jul-2021 21:06:15 [INFO] BUILD SUCCESS
14-Jul-2021 21:06:15 [INFO] ------------------------------------------------------------------------
14-Jul-2021 21:06:15 [INFO] Total time: 05:30 min
14-Jul-2021 21:06:15 [INFO] Finished at: 2021-07-14T21:06:15+00:00
14-Jul-2021 21:06:15 [INFO] Final Memory: 73M/344M
14-Jul-2021 21:06:15 [INFO] ------------------------------------------------------------------------
14-Jul-2021 21:06:15 Parsing test results under /home/bamboo-agent/bamboo-agent/xml-data/build-dir/REP-REP-T2DOT0...
14-Jul-2021 21:06:20 Finished task 'Maven 3.x' with result: Success
14-Jul-2021 21:06:20 Running post build plugin 'Docker Container Cleanup'
14-Jul-2021 21:06:20 Running post build plugin 'NCover Results Collector'
14-Jul-2021 21:06:20 Running post build plugin 'Clover Results Collector'
14-Jul-2021 21:06:20 Running post build plugin 'Sauce OnDemand Post Runner'
14-Jul-2021 21:06:20 Running post build plugin 'npm Cache Cleanup'
14-Jul-2021 21:06:20 Running post build plugin 'Artifact Copier'
14-Jul-2021 21:06:20 Finalising the build...
14-Jul-2021 21:06:20 Stopping timer.
14-Jul-2021 21:06:20 Build REP-REP-T2DOT0-865 completed.
14-Jul-2021 21:06:20 Running on server: post build plugin 'NCover Results Collector'
14-Jul-2021 21:06:20 Running on server: post build plugin 'Build Hanging Detection Configuration'
14-Jul-2021 21:06:20 Running on server: post build plugin 'Clover Delta Calculator'
14-Jul-2021 21:06:20 Running on server: post build plugin 'Maven Dependencies Postprocessor'
14-Jul-2021 21:06:20 All post build plugins have finished
14-Jul-2021 21:06:20 Generating build results summary...
14-Jul-2021 21:06:21 Saving build results to disk...
14-Jul-2021 21:06:21 Logging substituted variables...
14-Jul-2021 21:06:21 Indexing build results...
14-Jul-2021 21:06:21 Finished building REP-REP-T2DOT0-865.