More details of the release in https://wiki.openmrs.org/x/i4DTAw

Build: #884 was successful

Job: Test against 2.1 was successful

Build log

The build generated 2,037 lines of output.The output is too long and has been truncated to the last 1,000 lines. Download or view full build log

03-Dec-2021 18:00:00         at org.junit.runners.ParentRunner$1.schedule(ParentRunner.java:63)
03-Dec-2021 18:00:00         at org.junit.runners.ParentRunner.runChildren(ParentRunner.java:236)
03-Dec-2021 18:00:00         at org.junit.runners.ParentRunner.access$000(ParentRunner.java:53)
03-Dec-2021 18:00:00         at org.junit.runners.ParentRunner$2.evaluate(ParentRunner.java:229)
03-Dec-2021 18:00:00         at org.springframework.test.context.junit4.statements.RunBeforeTestClassCallbacks.evaluate(RunBeforeTestClassCallbacks.java:61)
03-Dec-2021 18:00:00         at org.junit.internal.runners.statements.RunAfters.evaluate(RunAfters.java:27)
03-Dec-2021 18:00:00         at org.springframework.test.context.junit4.statements.RunAfterTestClassCallbacks.evaluate(RunAfterTestClassCallbacks.java:68)
03-Dec-2021 18:00:00         at org.junit.runners.ParentRunner.run(ParentRunner.java:309)
03-Dec-2021 18:00:00         at org.springframework.test.context.junit4.SpringJUnit4ClassRunner.run(SpringJUnit4ClassRunner.java:163)
03-Dec-2021 18:00:00         at org.apache.maven.surefire.junit4.JUnit4TestSet.execute(JUnit4TestSet.java:59)
03-Dec-2021 18:00:00         at org.apache.maven.surefire.suite.AbstractDirectoryTestSuite.executeTestSet(AbstractDirectoryTestSuite.java:115)
03-Dec-2021 18:00:00         at org.apache.maven.surefire.suite.AbstractDirectoryTestSuite.execute(AbstractDirectoryTestSuite.java:102)
03-Dec-2021 18:00:00         at org.apache.maven.surefire.Surefire.run(Surefire.java:180)
03-Dec-2021 18:00:00         at sun.reflect.NativeMethodAccessorImpl.invoke0(Native Method)
03-Dec-2021 18:00:00         at sun.reflect.NativeMethodAccessorImpl.invoke(NativeMethodAccessorImpl.java:62)
03-Dec-2021 18:00:00         at sun.reflect.DelegatingMethodAccessorImpl.invoke(DelegatingMethodAccessorImpl.java:43)
03-Dec-2021 18:00:00         at java.lang.reflect.Method.invoke(Method.java:498)
03-Dec-2021 18:00:00         at org.apache.maven.surefire.booter.SurefireBooter.runSuitesInProcess(SurefireBooter.java:350)
03-Dec-2021 18:00:00         at org.apache.maven.surefire.booter.SurefireBooter.main(SurefireBooter.java:1021)
03-Dec-2021 18:00:00 Caused by: org.hibernate.exception.GenericJDBCException: error executing work
03-Dec-2021 18:00:00         at org.hibernate.exception.internal.StandardSQLExceptionConverter.convert(StandardSQLExceptionConverter.java:54)
03-Dec-2021 18:00:00         at org.hibernate.engine.jdbc.spi.SqlExceptionHelper.convert(SqlExceptionHelper.java:126)
03-Dec-2021 18:00:00         at org.hibernate.engine.jdbc.spi.SqlExceptionHelper.convert(SqlExceptionHelper.java:112)
03-Dec-2021 18:00:00         at org.hibernate.engine.jdbc.internal.JdbcCoordinatorImpl.coordinateWork(JdbcCoordinatorImpl.java:318)
03-Dec-2021 18:00:00         at org.hibernate.internal.SessionImpl.doWork(SessionImpl.java:2095)
03-Dec-2021 18:00:00         at org.hibernate.internal.SessionImpl.doWork(SessionImpl.java:2080)
03-Dec-2021 18:00:00         at org.openmrs.api.db.hibernate.DbSession.doWork(DbSession.java:1005)
03-Dec-2021 18:00:00         at org.openmrs.module.reporting.evaluation.querybuilder.SqlQueryBuilder.evaluateToList(SqlQueryBuilder.java:152)
03-Dec-2021 18:00:00         ... 106 more
03-Dec-2021 18:00:00 Caused by: org.h2.jdbc.JdbcSQLException: Method is only allowed for a query. Use execute or executeUpdate instead of executeQuery; SQL statement:
03-Dec-2021 18:00:00 update person set gender='F'  [90002-173]
03-Dec-2021 18:00:00         at org.h2.message.DbException.getJdbcSQLException(DbException.java:331)
03-Dec-2021 18:00:00         at org.h2.message.DbException.get(DbException.java:171)
03-Dec-2021 18:00:00         at org.h2.message.DbException.get(DbException.java:148)
03-Dec-2021 18:00:00         at org.h2.message.DbException.get(DbException.java:137)
03-Dec-2021 18:00:00         at org.h2.command.Prepared.query(Prepared.java:211)
03-Dec-2021 18:00:00         at org.h2.command.CommandContainer.query(CommandContainer.java:91)
03-Dec-2021 18:00:00         at org.h2.command.Command.executeQuery(Command.java:195)
03-Dec-2021 18:00:00         at org.h2.jdbc.JdbcPreparedStatement.executeQuery(JdbcPreparedStatement.java:106)
03-Dec-2021 18:00:00         at com.mchange.v2.c3p0.impl.NewProxyPreparedStatement.executeQuery(NewProxyPreparedStatement.java:116)
03-Dec-2021 18:00:00         at org.openmrs.module.reporting.evaluation.querybuilder.SqlQueryBuilder$2.execute(SqlQueryBuilder.java:159)
03-Dec-2021 18:00:00         at org.hibernate.jdbc.WorkExecutor.executeWork(WorkExecutor.java:54)
03-Dec-2021 18:00:00         at org.hibernate.internal.SessionImpl$2.accept(SessionImpl.java:2076)
03-Dec-2021 18:00:00         at org.hibernate.internal.SessionImpl$2.accept(SessionImpl.java:2073)
03-Dec-2021 18:00:00         at org.hibernate.engine.jdbc.internal.JdbcCoordinatorImpl.coordinateWork(JdbcCoordinatorImpl.java:313)
03-Dec-2021 18:00:00         ... 110 more
03-Dec-2021 18:00:00 Tests run: 13, Failures: 0, Errors: 0, Skipped: 0, Time elapsed: 1.78 sec
03-Dec-2021 18:00:00 Running org.openmrs.module.reporting.evaluation.service.EvaluationServiceTest
03-Dec-2021 18:00:02 Tests run: 6, Failures: 0, Errors: 0, Skipped: 0, Time elapsed: 1.75 sec
03-Dec-2021 18:00:02 Running org.openmrs.module.reporting.data.obs.evaluator.EncounterToObsDataEvaluatorTest
03-Dec-2021 18:00:02 Tests run: 3, Failures: 0, Errors: 0, Skipped: 0, Time elapsed: 0.382 sec
03-Dec-2021 18:00:02 Running org.openmrs.module.reporting.query.encounter.evaluator.MappedParametersEncounterQueryEvaluatorTest
03-Dec-2021 18:00:02 Tests run: 1, Failures: 0, Errors: 0, Skipped: 0, Time elapsed: 0.19 sec
03-Dec-2021 18:00:02 Running org.openmrs.module.reporting.validator.InStateCohortDefinitionValidatorTest
03-Dec-2021 18:00:02 Tests run: 3, Failures: 0, Errors: 0, Skipped: 0, Time elapsed: 0.067 sec
03-Dec-2021 18:00:02 Running org.openmrs.module.reporting.common.ReflectionUtilTest
03-Dec-2021 18:00:02 Tests run: 6, Failures: 0, Errors: 0, Skipped: 0, Time elapsed: 0.004 sec
03-Dec-2021 18:00:02 Running org.openmrs.module.reporting.template.HandlebarsHelpersTest
03-Dec-2021 18:00:03 Tests run: 3, Failures: 0, Errors: 0, Skipped: 0, Time elapsed: 0.561 sec
03-Dec-2021 18:00:03 Running org.openmrs.module.reporting.data.visit.evaluator.VisitIdDataEvaluatorTest
03-Dec-2021 18:00:03 Tests run: 2, Failures: 0, Errors: 0, Skipped: 0, Time elapsed: 0.439 sec
03-Dec-2021 18:00:03 Running org.openmrs.module.reporting.cohort.definition.evaluator.ConditionalParameterCohortDefinitionEvaluatorTest
03-Dec-2021 18:00:03 Tests run: 1, Failures: 0, Errors: 0, Skipped: 0, Time elapsed: 0.168 sec
03-Dec-2021 18:00:03 Running org.openmrs.module.reporting.data.patient.evaluator.CurrentPatientStateDataEvaluatorTest
03-Dec-2021 18:00:04 Tests run: 1, Failures: 0, Errors: 0, Skipped: 0, Time elapsed: 0.186 sec
03-Dec-2021 18:00:04 Running org.openmrs.module.reporting.data.encounter.evaluator.ObsOnSameDateEncounterDataEvaluatorTest
03-Dec-2021 18:00:04 Tests run: 3, Failures: 0, Errors: 0, Skipped: 0, Time elapsed: 0.533 sec
03-Dec-2021 18:00:04 Running org.openmrs.module.reporting.cohort.query.service.CohortQueryServiceTest
03-Dec-2021 18:00:04 Tests run: 1, Failures: 0, Errors: 0, Skipped: 0, Time elapsed: 0.133 sec
03-Dec-2021 18:00:04 Running org.openmrs.module.reporting.data.person.evaluator.ObsForPersonDataEvaluatorTest
03-Dec-2021 18:00:05 Tests run: 3, Failures: 0, Errors: 0, Skipped: 0, Time elapsed: 0.446 sec
03-Dec-2021 18:00:05 Running org.openmrs.module.reporting.validator.StaticCohortDefinitionValidatorTest
03-Dec-2021 18:00:05 Tests run: 1, Failures: 0, Errors: 0, Skipped: 0, Time elapsed: 0.02 sec
03-Dec-2021 18:00:05 Running org.openmrs.module.reporting.dataset.definition.evaluator.EncounterDataSetEvaluatorTest
03-Dec-2021 18:00:05 ENCOUNTER ID        EMR ID        BIRTHDATE           ENCOUNTER DATE        Age At Start        Age At End        
03-Dec-2021 18:00:05 ------------        ------        ------------        --------------        ------------        ----------        
03-Dec-2021 18:00:05 3                   7             ~25/Aug/1976        01/Aug/2008           33                  34                
03-Dec-2021 18:00:05 4                   7             ~25/Aug/1976        15/Aug/2008           33                  34                
03-Dec-2021 18:00:05 5                   7             ~25/Aug/1976        19/Aug/2008           33                  34                
03-Dec-2021 18:00:05 6                   20            08/Feb/1925         19/Aug/2009           80                  80                
03-Dec-2021 18:00:05 7                   21            ~08/Jun/1959        19/Aug/2009           50                  51                
03-Dec-2021 18:00:05 8                   21            ~08/Jun/1959        19/Sep/2009           50                  51                
03-Dec-2021 18:00:05 9                   22            08/Jul/1997         19/Sep/2009           12                  13                
03-Dec-2021 18:00:05 10                  22            08/Jul/1997         19/Oct/2009           12                  13                
03-Dec-2021 18:00:05 11                  23            08/Nov/2000         19/Aug/2009           9                   10                
03-Dec-2021 18:00:05 12                  24            08/Dec/2006         19/Sep/2009           3                   4                 
03-Dec-2021 18:00:05 Tests run: 1, Failures: 0, Errors: 0, Skipped: 0, Time elapsed: 0.271 sec
03-Dec-2021 18:00:05 Running org.openmrs.module.reporting.data.person.evaluator.BirthdateDataEvaluatorTest
03-Dec-2021 18:00:05 Tests run: 1, Failures: 0, Errors: 0, Skipped: 0, Time elapsed: 0.116 sec
03-Dec-2021 18:00:05 Running org.openmrs.module.reporting.cohort.definition.evaluator.EncounterCohortDefinitionEvaluatorTest
03-Dec-2021 18:00:06 Tests run: 9, Failures: 0, Errors: 0, Skipped: 2, Time elapsed: 1.105 sec
03-Dec-2021 18:00:06 Running org.openmrs.module.reporting.data.person.evaluator.PreferredAddressDataEvaluatorTest
03-Dec-2021 18:00:06 Tests run: 1, Failures: 0, Errors: 0, Skipped: 0, Time elapsed: 0.158 sec
03-Dec-2021 18:00:06 Running org.openmrs.module.reporting.cohort.definition.evaluator.GenderCohortDefinitionEvaluatorTest
03-Dec-2021 18:00:07 Tests run: 5, Failures: 0, Errors: 0, Skipped: 0, Time elapsed: 0.534 sec
03-Dec-2021 18:00:07 Running org.openmrs.module.reporting.data.converter.BirthdateConverterTest
03-Dec-2021 18:00:07 Tests run: 1, Failures: 0, Errors: 0, Skipped: 0, Time elapsed: 0.016 sec
03-Dec-2021 18:00:07 Running org.openmrs.module.reporting.data.patient.evaluator.ProgramStatesForPatientDataEvaluatorTest
03-Dec-2021 18:00:08 Tests run: 9, Failures: 0, Errors: 0, Skipped: 0, Time elapsed: 1.198 sec
03-Dec-2021 18:00:08 Running org.openmrs.module.reporting.data.visit.library.BuiltInVisitDataLibraryTest
03-Dec-2021 18:00:08 Tests run: 1, Failures: 0, Errors: 0, Skipped: 0, Time elapsed: 0.042 sec
03-Dec-2021 18:00:08 Running org.openmrs.module.reporting.cohort.definition.evaluator.AgeCohortDefinitionEvaluatorTest
03-Dec-2021 18:00:09 Tests run: 5, Failures: 0, Errors: 0, Skipped: 0, Time elapsed: 0.315 sec
03-Dec-2021 18:00:09 Running org.openmrs.module.reporting.data.encounter.evaluator.EncounterLocationDataEvaluatorTest
03-Dec-2021 18:00:09 Tests run: 3, Failures: 0, Errors: 0, Skipped: 0, Time elapsed: 0.392 sec
03-Dec-2021 18:00:09 Running org.openmrs.module.reporting.data.obs.evaluator.PersonToObsEvaluatorTest
03-Dec-2021 18:00:09 Tests run: 3, Failures: 0, Errors: 0, Skipped: 0, Time elapsed: 0.398 sec
03-Dec-2021 18:00:09 Running org.openmrs.module.reporting.common.DateRangeTest
03-Dec-2021 18:00:09 Tests run: 9, Failures: 0, Errors: 0, Skipped: 0, Time elapsed: 0.011 sec
03-Dec-2021 18:00:09 Running org.openmrs.module.reporting.cohort.definition.evaluator.NumericObsCohortDefinitionEvaluatorTest
03-Dec-2021 18:00:11 Tests run: 11, Failures: 0, Errors: 0, Skipped: 0, Time elapsed: 1.483 sec
03-Dec-2021 18:00:11 Running org.openmrs.module.reporting.indicator.QueryCountIndicatorEvaluatorTest
03-Dec-2021 18:00:11 Tests run: 3, Failures: 0, Errors: 0, Skipped: 0, Time elapsed: 0.363 sec
03-Dec-2021 18:00:11 Running org.openmrs.module.reporting.data.encounter.evaluator.ObsForEncounterEvaluatorTest
03-Dec-2021 18:00:12 Tests run: 7, Failures: 0, Errors: 0, Skipped: 0, Time elapsed: 1.241 sec
03-Dec-2021 18:00:12 Running org.openmrs.module.reporting.common.DateUtilTest
03-Dec-2021 18:00:13 Tests run: 15, Failures: 0, Errors: 0, Skipped: 0, Time elapsed: 0.127 sec
03-Dec-2021 18:00:13 Running org.openmrs.module.reporting.data.patient.evaluator.DrugOrdersForPatientDataEvaluatorTest
03-Dec-2021 18:00:15 Tests run: 8, Failures: 0, Errors: 0, Skipped: 0, Time elapsed: 2.007 sec
03-Dec-2021 18:00:15 Running org.openmrs.module.reporting.query.encounter.evaluator.MappedParametersObsQueryEvaluatorTest
03-Dec-2021 18:00:15 Tests run: 1, Failures: 0, Errors: 0, Skipped: 0, Time elapsed: 0.884 sec
03-Dec-2021 18:00:15 Running org.openmrs.module.reporting.serializer.ReportingSerializerTest
03-Dec-2021 18:00:16 Tests run: 6, Failures: 0, Errors: 0, Skipped: 0, Time elapsed: 0.177 sec
03-Dec-2021 18:00:16 Running org.openmrs.module.reporting.dataset.definition.evaluator.CohortCrossTabDataSetEvaluatorTest
03-Dec-2021 18:00:16 Tests run: 1, Failures: 0, Errors: 0, Skipped: 0, Time elapsed: 0.17 sec
03-Dec-2021 18:00:16 Running org.openmrs.module.reporting.query.person.service.PersonQueryServiceImplTest
03-Dec-2021 18:00:16 Tests run: 2, Failures: 0, Errors: 0, Skipped: 0, Time elapsed: 0.372 sec
03-Dec-2021 18:00:16 Running org.openmrs.module.reporting.dataset.definition.evaluator.MySqlDataSetEvaluatorTest
03-Dec-2021 18:00:16 Tests run: 1, Failures: 0, Errors: 0, Skipped: 1, Time elapsed: 0.001 sec
03-Dec-2021 18:00:16 Running org.openmrs.module.reporting.report.renderer.TextTemplateRendererTest
03-Dec-2021 18:00:19 Tests run: 3, Failures: 0, Errors: 0, Skipped: 0, Time elapsed: 2.586 sec
03-Dec-2021 18:00:19 Running org.openmrs.module.reporting.validator.InverseCohortDefinitionValidatorTest
03-Dec-2021 18:00:19 Tests run: 2, Failures: 0, Errors: 0, Skipped: 0, Time elapsed: 0.022 sec
03-Dec-2021 18:00:19 Running org.openmrs.module.reporting.validator.PatientStateCohortDefinitionValidatorTest
03-Dec-2021 18:00:19 Tests run: 3, Failures: 0, Errors: 0, Skipped: 0, Time elapsed: 0.034 sec
03-Dec-2021 18:00:19 Running org.openmrs.module.reporting.report.service.db.PropertiesTypeTest
03-Dec-2021 18:00:19 Tests run: 1, Failures: 0, Errors: 0, Skipped: 0, Time elapsed: 0.001 sec
03-Dec-2021 18:00:19 Running org.openmrs.module.reporting.query.encounter.evaluator.ObsForEncounterQueryEvaluatorTest
03-Dec-2021 18:00:20 Tests run: 8, Failures: 0, Errors: 0, Skipped: 0, Time elapsed: 0.994 sec
03-Dec-2021 18:00:20 Running org.openmrs.module.reporting.data.encounter.service.EncounterDataServiceImplTest
03-Dec-2021 18:00:20 Tests run: 2, Failures: 0, Errors: 0, Skipped: 0, Time elapsed: 0.254 sec
03-Dec-2021 18:00:20 Running org.openmrs.module.reporting.cohort.definition.evaluator.MappedParametersCohortDefinitionEvaluatorTest
03-Dec-2021 18:00:20 Tests run: 1, Failures: 0, Errors: 0, Skipped: 0, Time elapsed: 0.143 sec
03-Dec-2021 18:00:20 Running org.openmrs.module.reporting.data.encounter.evaluator.ConvertedEncounterDataEvaluatorTest
03-Dec-2021 18:00:20 Tests run: 1, Failures: 0, Errors: 0, Skipped: 0, Time elapsed: 0.143 sec
03-Dec-2021 18:00:20 Running org.openmrs.module.reporting.data.patient.evaluator.PatientIdentifierDataEvaluatorTest
03-Dec-2021 18:00:21 Tests run: 4, Failures: 0, Errors: 0, Skipped: 0, Time elapsed: 0.598 sec
03-Dec-2021 18:00:21 Running org.openmrs.module.reporting.data.converter.ListConverterTest
03-Dec-2021 18:00:21 Tests run: 6, Failures: 0, Errors: 0, Skipped: 0, Time elapsed: 0.003 sec
03-Dec-2021 18:00:21 Running org.openmrs.module.reporting.data.converter.ObsFromObsGroupConverterTest
03-Dec-2021 18:00:21 Tests run: 2, Failures: 0, Errors: 0, Skipped: 0, Time elapsed: 0.026 sec
03-Dec-2021 18:00:21 Running org.openmrs.module.reporting.common.AgeTest
03-Dec-2021 18:00:21 Tests run: 5, Failures: 0, Errors: 0, Skipped: 0, Time elapsed: 0.003 sec
03-Dec-2021 18:00:21 Running org.openmrs.module.reporting.evaluation.CachingCohortDefinitionTest
03-Dec-2021 18:00:21 Tests run: 1, Failures: 0, Errors: 0, Skipped: 0, Time elapsed: 0.13 sec
03-Dec-2021 18:00:21 Running org.openmrs.module.reporting.config.ReportLoaderIntegrationTest
03-Dec-2021 18:00:22 Tests run: 4, Failures: 0, Errors: 0, Skipped: 0, Time elapsed: 1.191 sec
03-Dec-2021 18:00:22 Running org.openmrs.module.reporting.common.TestUtil
03-Dec-2021 18:00:22 Tests run: 1, Failures: 0, Errors: 0, Skipped: 1, Time elapsed: 0.001 sec
03-Dec-2021 18:00:22 Running org.openmrs.module.reporting.query.encounter.evaluator.CompositionEncounterQueryEvaluatorTest
03-Dec-2021 18:00:23 Tests run: 4, Failures: 0, Errors: 0, Skipped: 0, Time elapsed: 0.612 sec
03-Dec-2021 18:00:23 Running org.openmrs.module.reporting.definition.library.implementerconfigured.ImplementerConfiguredVisitDataDefinitionLibraryTest
03-Dec-2021 18:00:23 Tests run: 2, Failures: 0, Errors: 0, Skipped: 0, Time elapsed: 0.048 sec
03-Dec-2021 18:00:23 Running org.openmrs.module.reporting.common.ObjectUtilTest
03-Dec-2021 18:00:24 Tests run: 23, Failures: 0, Errors: 0, Skipped: 0, Time elapsed: 0.685 sec
03-Dec-2021 18:00:24 Running org.openmrs.module.reporting.data.person.evaluator.AgeDataEvaluatorTest
03-Dec-2021 18:00:24 Tests run: 2, Failures: 0, Errors: 0, Skipped: 0, Time elapsed: 0.361 sec
03-Dec-2021 18:00:24 Running org.openmrs.module.reporting.evaluation.querybuilder.HqlQueryBuilderTest
03-Dec-2021 18:00:29 Tests run: 39, Failures: 0, Errors: 0, Skipped: 0, Time elapsed: 5.205 sec
03-Dec-2021 18:00:29 Running org.openmrs.module.reporting.data.visit.evaluator.ObsForVisitDataEvaluatorTest
03-Dec-2021 18:00:30 Tests run: 2, Failures: 0, Errors: 0, Skipped: 0, Time elapsed: 0.412 sec
03-Dec-2021 18:00:30 Running org.openmrs.module.reporting.query.encounter.evaluator.MostRecentEncounterForPatientQueryEvaluatorTest
03-Dec-2021 18:00:30 Tests run: 1, Failures: 0, Errors: 0, Skipped: 0, Time elapsed: 0.145 sec
03-Dec-2021 18:00:30 Running org.openmrs.module.reporting.cohort.definition.evaluator.OptionalParameterCohortDefinitionEvaluatorTest
03-Dec-2021 18:00:30 Tests run: 1, Failures: 0, Errors: 0, Skipped: 0, Time elapsed: 0.12 sec
03-Dec-2021 18:00:30 Running org.openmrs.module.reporting.report.util.SqlUtilsTest
03-Dec-2021 18:00:30 Tests run: 3, Failures: 0, Errors: 0, Skipped: 0, Time elapsed: 0.001 sec
03-Dec-2021 18:00:30 Running org.openmrs.module.reporting.validator.InProgramCohortDefinitionValidatorTest
03-Dec-2021 18:00:30 Tests run: 3, Failures: 0, Errors: 0, Skipped: 0, Time elapsed: 0.024 sec
03-Dec-2021 18:00:30 Running org.openmrs.module.reporting.data.obs.evaluator.PatientToObsDataEvaluatorTest
03-Dec-2021 18:00:30 Tests run: 3, Failures: 0, Errors: 0, Skipped: 0, Time elapsed: 0.36 sec
03-Dec-2021 18:00:30 Running org.openmrs.module.reporting.definition.library.BaseDefinitionLibraryTest
03-Dec-2021 18:00:30 Tests run: 4, Failures: 0, Errors: 0, Skipped: 0, Time elapsed: 0.038 sec
03-Dec-2021 18:00:30 Running org.openmrs.module.reporting.data.person.evaluator.PersonAttributeDataEvaluatorTest
03-Dec-2021 18:00:30 Tests run: 1, Failures: 0, Errors: 0, Skipped: 0, Time elapsed: 0.125 sec
03-Dec-2021 18:00:30 Running org.openmrs.module.reporting.data.person.evaluator.PreferredNameDataEvaluatorTest
03-Dec-2021 18:00:31 Tests run: 3, Failures: 0, Errors: 0, Skipped: 0, Time elapsed: 0.383 sec
03-Dec-2021 18:00:31 Running org.openmrs.module.reporting.definition.library.implementerconfigured.ImplementerConfiguredCohortDefinitionLibraryTest
03-Dec-2021 18:00:31 Tests run: 3, Failures: 0, Errors: 0, Skipped: 0, Time elapsed: 0.152 sec
03-Dec-2021 18:00:31 Running org.openmrs.module.reporting.evaluation.parameter.ParameterUtilTest
03-Dec-2021 18:00:31 Tests run: 2, Failures: 0, Errors: 0, Skipped: 0, Time elapsed: 0.018 sec
03-Dec-2021 18:00:31 Running org.openmrs.module.reporting.data.encounter.library.BuiltInEncounterDataLibraryTest
03-Dec-2021 18:00:31 Tests run: 6, Failures: 0, Errors: 0, Skipped: 0, Time elapsed: 0.137 sec
03-Dec-2021 18:00:31 Running org.openmrs.module.reporting.cohort.definition.evaluator.ScriptedCohortDefinitionEvaluatorTest
03-Dec-2021 18:00:32 Tests run: 1, Failures: 0, Errors: 0, Skipped: 0, Time elapsed: 0.38 sec
03-Dec-2021 18:00:32 Running org.openmrs.module.reporting.data.converter.PersonNameConverterTest
03-Dec-2021 18:00:32 Tests run: 1, Failures: 0, Errors: 0, Skipped: 0, Time elapsed: 0.018 sec
03-Dec-2021 18:00:32 Running org.openmrs.module.reporting.definition.library.AllDefinitionLibrariesComponentTest
03-Dec-2021 18:00:32 Tests run: 2, Failures: 0, Errors: 0, Skipped: 0, Time elapsed: 0.022 sec
03-Dec-2021 18:00:32 Running org.openmrs.module.reporting.data.person.evaluator.VitalStatusDataEvaluatorTest
03-Dec-2021 18:00:32 Tests run: 1, Failures: 0, Errors: 0, Skipped: 0, Time elapsed: 0.19 sec
03-Dec-2021 18:00:32 Running org.openmrs.module.reporting.dataset.definition.evaluator.PatientDataSetEvaluatorTest
03-Dec-2021 18:00:33 Tests run: 8, Failures: 0, Errors: 0, Skipped: 0, Time elapsed: 1.457 sec
03-Dec-2021 18:00:33 Running org.openmrs.module.reporting.cohort.definition.evaluator.TextObsCohortDefinitionEvaluatorTest
03-Dec-2021 18:00:34 Tests run: 2, Failures: 0, Errors: 0, Skipped: 0, Time elapsed: 0.347 sec
03-Dec-2021 18:00:34 Running org.openmrs.module.reporting.data.encounter.evaluator.AuditInfoEncounterDataEvaluatorTest
03-Dec-2021 18:00:34 Tests run: 1, Failures: 0, Errors: 0, Skipped: 0, Time elapsed: 0.042 sec
03-Dec-2021 18:00:34 Running org.openmrs.module.reporting.data.patient.evaluator.LogicDataEvaluatorTest
03-Dec-2021 18:00:34 Tests run: 1, Failures: 0, Errors: 0, Skipped: 1, Time elapsed: 0.001 sec
03-Dec-2021 18:00:34 Running org.openmrs.module.reporting.data.visit.evaluator.PersonToVisitDataEvaluatorTest
03-Dec-2021 18:00:34 Tests run: 3, Failures: 0, Errors: 0, Skipped: 0, Time elapsed: 0.448 sec
03-Dec-2021 18:00:34 Running org.openmrs.module.reporting.cohort.definition.evaluator.DateObsCohortDefinitionEvaluatorTest
03-Dec-2021 18:00:35 Tests run: 3, Failures: 0, Errors: 0, Skipped: 0, Time elapsed: 0.46 sec
03-Dec-2021 18:00:35 Running org.openmrs.module.reporting.cohort.definition.evaluator.VisitCohortDefinitionEvaluatorTest
03-Dec-2021 18:00:35 Tests run: 13, Failures: 0, Errors: 0, Skipped: 0, Time elapsed: 0.375 sec
03-Dec-2021 18:00:35 Running org.openmrs.module.reporting.data.encounter.evaluator.AgeAtEncounterDataEvaluatorTest
03-Dec-2021 18:00:35 Tests run: 1, Failures: 0, Errors: 0, Skipped: 0, Time elapsed: 0.174 sec
03-Dec-2021 18:00:35 Running org.openmrs.module.reporting.indicator.CohortIndicatorDataSetEvaluatorTest
03-Dec-2021 18:00:35 Tests run: 1, Failures: 0, Errors: 0, Skipped: 0, Time elapsed: 0.163 sec
03-Dec-2021 18:00:35 Running org.openmrs.module.reporting.data.person.evaluator.ObsActiveListPersonDataEvaluatorTest
03-Dec-2021 18:00:35 Tests run: 1, Failures: 0, Errors: 0, Skipped: 0, Time elapsed: 0.181 sec
03-Dec-2021 18:00:35 Running org.openmrs.module.reporting.common.ExcelUtilTest
03-Dec-2021 18:00:36 Tests run: 5, Failures: 0, Errors: 0, Skipped: 0, Time elapsed: 0.386 sec
03-Dec-2021 18:00:36 Running org.openmrs.module.reporting.data.obs.evaluator.GroupMemberObsDataEvaluatorTest
03-Dec-2021 18:00:36 Tests run: 5, Failures: 0, Errors: 0, Skipped: 2, Time elapsed: 0.518 sec
03-Dec-2021 18:00:36 Running org.openmrs.module.reporting.query.visit.evaluator.BasicVisitQueryEvaluatorTest
03-Dec-2021 18:00:37 Tests run: 3, Failures: 0, Errors: 0, Skipped: 0, Time elapsed: 0.559 sec
03-Dec-2021 18:00:37 Running org.openmrs.module.reporting.common.ExcelBuilderTest
03-Dec-2021 18:00:40 Tests run: 3, Failures: 0, Errors: 0, Skipped: 0, Time elapsed: 3.457 sec
03-Dec-2021 18:00:40 Running org.openmrs.module.reporting.query.obs.evaluator.AllObsQueryEvaluatorTest
03-Dec-2021 18:00:41 Tests run: 5, Failures: 0, Errors: 0, Skipped: 0, Time elapsed: 0.668 sec
03-Dec-2021 18:00:41 Running org.openmrs.module.reporting.cohort.definition.evaluator.AllPatientsCohortDefinitionEvaluatorTest
03-Dec-2021 18:00:41 Tests run: 1, Failures: 0, Errors: 0, Skipped: 0, Time elapsed: 0.213 sec
03-Dec-2021 18:00:41 Running org.openmrs.module.reporting.data.encounter.evaluator.SimultaneousEncountersDataEvaluatorTest
03-Dec-2021 18:00:41 Tests run: 2, Failures: 0, Errors: 0, Skipped: 0, Time elapsed: 0.113 sec
03-Dec-2021 18:00:41 Running org.openmrs.module.reporting.validator.ProgramEnrollmentCohortDefinitionValidatorTest
03-Dec-2021 18:00:41 Tests run: 3, Failures: 0, Errors: 0, Skipped: 0, Time elapsed: 0.025 sec
03-Dec-2021 18:00:41 Running org.openmrs.module.reporting.evaluation.EvaluationContextTest
03-Dec-2021 18:00:41 Tests run: 4, Failures: 0, Errors: 0, Skipped: 0, Time elapsed: 0.049 sec
03-Dec-2021 18:00:41 Running org.openmrs.module.reporting.data.patient.evaluator.PreferredIdentifierDataEvaluatorTest
03-Dec-2021 18:00:42 Tests run: 2, Failures: 0, Errors: 0, Skipped: 0, Time elapsed: 0.267 sec
03-Dec-2021 18:00:42 Running org.openmrs.module.reporting.data.encounter.evaluator.EncounterVisitDataEvaluatorTest
03-Dec-2021 18:00:42 Tests run: 1, Failures: 0, Errors: 0, Skipped: 0, Time elapsed: 0.157 sec
03-Dec-2021 18:00:42 Running org.openmrs.module.reporting.query.obs.service.ObsQueryServiceImplTest
03-Dec-2021 18:00:42 Tests run: 2, Failures: 0, Errors: 0, Skipped: 1, Time elapsed: 0.116 sec
03-Dec-2021 18:00:42 Running org.openmrs.module.reporting.data.patient.library.BuiltInPatientDataLibraryTest
03-Dec-2021 18:00:42 Tests run: 4, Failures: 0, Errors: 0, Skipped: 0, Time elapsed: 0.078 sec
03-Dec-2021 18:00:42 Running org.openmrs.module.reporting.indicator.util.IndicatorUtilTest
03-Dec-2021 18:00:42 Tests run: 1, Failures: 0, Errors: 0, Skipped: 0, Time elapsed: 0.001 sec
03-Dec-2021 18:00:42 Running org.openmrs.module.reporting.cohort.definition.evaluator.EvaluatableCohortDefinitionEvaluatorTest
03-Dec-2021 18:00:42 Tests run: 1, Failures: 0, Errors: 0, Skipped: 0, Time elapsed: 0.017 sec
03-Dec-2021 18:00:42 Running org.openmrs.module.reporting.data.patient.evaluator.ConvertedPatientDataEvaluatorTest
03-Dec-2021 18:00:42 Tests run: 2, Failures: 0, Errors: 0, Skipped: 0, Time elapsed: 0.296 sec
03-Dec-2021 18:00:42 Running org.openmrs.module.reporting.cohort.definition.evaluator.CompositionCohortDefinitionEvaluatorTest
03-Dec-2021 18:00:43 Tests run: 4, Failures: 0, Errors: 0, Skipped: 0, Time elapsed: 0.525 sec
03-Dec-2021 18:00:43 Running org.openmrs.module.reporting.data.converter.MapConverterTest
03-Dec-2021 18:00:43 Tests run: 5, Failures: 0, Errors: 0, Skipped: 0, Time elapsed: 0.004 sec
03-Dec-2021 18:00:43 Running org.openmrs.module.reporting.data.patient.evaluator.EncountersForPatientDataEvaluatorTest
03-Dec-2021 18:00:43 Tests run: 1, Failures: 0, Errors: 0, Skipped: 0, Time elapsed: 0.169 sec
03-Dec-2021 18:00:43 Running org.openmrs.module.reporting.indicator.SqlIndicatorTest
03-Dec-2021 18:00:44 ERROR - EvaluationProfiler.log(111) |2021-12-03 18:00:44,083| 1345        2021-12-03 18:00:44.83        >        ERROR        EVALUATING_DEFINITION                        SqlIndicator[sql=SELECT distinct(.222) as res, 33 as res2 from patient]: Failed to evaluate sql because:
03-Dec-2021 18:00:44 Unable to evaluate to a single value. Exactly one column must be defined.
03-Dec-2021 18:00:44 org.openmrs.module.reporting.evaluation.EvaluationException: Failed to evaluate sql because:
03-Dec-2021 18:00:44 Unable to evaluate to a single value. Exactly one column must be defined.
03-Dec-2021 18:00:44         at org.openmrs.module.reporting.indicator.evaluator.SqlIndicatorEvaluator.evaluateSql(SqlIndicatorEvaluator.java:57)
03-Dec-2021 18:00:44         at org.openmrs.module.reporting.indicator.evaluator.SqlIndicatorEvaluator.evaluate(SqlIndicatorEvaluator.java:41)
03-Dec-2021 18:00:44         at org.openmrs.module.reporting.indicator.evaluator.SqlIndicatorEvaluator.evaluate(SqlIndicatorEvaluator.java:28)
03-Dec-2021 18:00:44         at org.openmrs.module.reporting.definition.service.BaseDefinitionService.executeEvaluator(BaseDefinitionService.java:369)
03-Dec-2021 18:00:44         at org.openmrs.module.reporting.definition.service.BaseDefinitionService.evaluateBypassingExclusionOfTestPatients(BaseDefinitionService.java:264)
03-Dec-2021 18:00:44         at org.openmrs.module.reporting.definition.service.BaseDefinitionService.evaluate(BaseDefinitionService.java:229)
03-Dec-2021 18:00:44         at org.openmrs.module.reporting.indicator.service.IndicatorServiceImpl.evaluate(IndicatorServiceImpl.java:41)
03-Dec-2021 18:00:44         at sun.reflect.NativeMethodAccessorImpl.invoke0(Native Method)
03-Dec-2021 18:00:44         at sun.reflect.NativeMethodAccessorImpl.invoke(NativeMethodAccessorImpl.java:62)
03-Dec-2021 18:00:44         at sun.reflect.DelegatingMethodAccessorImpl.invoke(DelegatingMethodAccessorImpl.java:43)
03-Dec-2021 18:00:44         at java.lang.reflect.Method.invoke(Method.java:498)
03-Dec-2021 18:00:44         at org.springframework.aop.support.AopUtils.invokeJoinpointUsingReflection(AopUtils.java:317)
03-Dec-2021 18:00:44         at org.springframework.aop.framework.ReflectiveMethodInvocation.invokeJoinpoint(ReflectiveMethodInvocation.java:190)
03-Dec-2021 18:00:44         at org.springframework.aop.framework.ReflectiveMethodInvocation.proceed(ReflectiveMethodInvocation.java:157)
03-Dec-2021 18:00:44         at org.springframework.cache.interceptor.CacheInterceptor$1.invoke(CacheInterceptor.java:52)
03-Dec-2021 18:00:44         at org.springframework.cache.interceptor.CacheAspectSupport.execute(CacheAspectSupport.java:303)
03-Dec-2021 18:00:44         at org.springframework.cache.interceptor.CacheInterceptor.invoke(CacheInterceptor.java:61)
03-Dec-2021 18:00:44         at org.springframework.aop.framework.ReflectiveMethodInvocation.proceed(ReflectiveMethodInvocation.java:179)
03-Dec-2021 18:00:44         at org.openmrs.aop.LoggingAdvice.invoke(LoggingAdvice.java:121)
03-Dec-2021 18:00:44         at org.springframework.aop.framework.ReflectiveMethodInvocation.proceed(ReflectiveMethodInvocation.java:179)
03-Dec-2021 18:00:44         at org.springframework.aop.framework.adapter.MethodBeforeAdviceInterceptor.invoke(MethodBeforeAdviceInterceptor.java:52)
03-Dec-2021 18:00:44         at org.springframework.aop.framework.ReflectiveMethodInvocation.proceed(ReflectiveMethodInvocation.java:179)
03-Dec-2021 18:00:44         at org.springframework.aop.framework.adapter.MethodBeforeAdviceInterceptor.invoke(MethodBeforeAdviceInterceptor.java:52)
03-Dec-2021 18:00:44         at org.springframework.aop.framework.ReflectiveMethodInvocation.proceed(ReflectiveMethodInvocation.java:179)
03-Dec-2021 18:00:44         at org.springframework.aop.framework.JdkDynamicAopProxy.invoke(JdkDynamicAopProxy.java:207)
03-Dec-2021 18:00:44         at com.sun.proxy.$Proxy47.evaluate(Unknown Source)
03-Dec-2021 18:00:44         at sun.reflect.NativeMethodAccessorImpl.invoke0(Native Method)
03-Dec-2021 18:00:44         at sun.reflect.NativeMethodAccessorImpl.invoke(NativeMethodAccessorImpl.java:62)
03-Dec-2021 18:00:44         at sun.reflect.DelegatingMethodAccessorImpl.invoke(DelegatingMethodAccessorImpl.java:43)
03-Dec-2021 18:00:44         at java.lang.reflect.Method.invoke(Method.java:498)
03-Dec-2021 18:00:44         at org.springframework.aop.support.AopUtils.invokeJoinpointUsingReflection(AopUtils.java:317)
03-Dec-2021 18:00:44         at org.springframework.aop.framework.JdkDynamicAopProxy.invoke(JdkDynamicAopProxy.java:201)
03-Dec-2021 18:00:44         at com.sun.proxy.$Proxy160.evaluate(Unknown Source)
03-Dec-2021 18:00:44         at org.openmrs.module.reporting.indicator.SqlIndicatorTest.assertIndicatorValue(SqlIndicatorTest.java:94)
03-Dec-2021 18:00:44         at org.openmrs.module.reporting.indicator.SqlIndicatorTest.assertIndicatorValue(SqlIndicatorTest.java:103)
03-Dec-2021 18:00:44         at org.openmrs.module.reporting.indicator.SqlIndicatorTest.assertIndicatorValue(SqlIndicatorTest.java:114)
03-Dec-2021 18:00:44         at org.openmrs.module.reporting.indicator.SqlIndicatorTest.assertIndicatorValue(SqlIndicatorTest.java:107)
03-Dec-2021 18:00:44         at org.openmrs.module.reporting.indicator.SqlIndicatorTest.sqlIndicator_shouldNotAllowQueriesThatReturnMoreThanOneColumn(SqlIndicatorTest.java:85)
03-Dec-2021 18:00:44         at sun.reflect.NativeMethodAccessorImpl.invoke0(Native Method)
03-Dec-2021 18:00:44         at sun.reflect.NativeMethodAccessorImpl.invoke(NativeMethodAccessorImpl.java:62)
03-Dec-2021 18:00:44         at sun.reflect.DelegatingMethodAccessorImpl.invoke(DelegatingMethodAccessorImpl.java:43)
03-Dec-2021 18:00:44         at java.lang.reflect.Method.invoke(Method.java:498)
03-Dec-2021 18:00:44         at org.junit.runners.model.FrameworkMethod$1.runReflectiveCall(FrameworkMethod.java:47)
03-Dec-2021 18:00:44         at org.junit.internal.runners.model.ReflectiveCallable.run(ReflectiveCallable.java:12)
03-Dec-2021 18:00:44         at org.junit.runners.model.FrameworkMethod.invokeExplosively(FrameworkMethod.java:44)
03-Dec-2021 18:00:44         at org.junit.internal.runners.statements.InvokeMethod.evaluate(InvokeMethod.java:17)
03-Dec-2021 18:00:44         at org.junit.internal.runners.statements.ExpectException.evaluate(ExpectException.java:19)
03-Dec-2021 18:00:44         at org.junit.internal.runners.statements.RunBefores.evaluate(RunBefores.java:26)
03-Dec-2021 18:00:44         at org.springframework.test.context.junit4.statements.RunBeforeTestMethodCallbacks.evaluate(RunBeforeTestMethodCallbacks.java:73)
03-Dec-2021 18:00:44         at org.junit.internal.runners.statements.RunAfters.evaluate(RunAfters.java:27)
03-Dec-2021 18:00:44         at org.springframework.test.context.junit4.statements.RunAfterTestMethodCallbacks.evaluate(RunAfterTestMethodCallbacks.java:82)
03-Dec-2021 18:00:44         at org.springframework.test.context.junit4.statements.SpringRepeat.evaluate(SpringRepeat.java:73)
03-Dec-2021 18:00:44         at org.junit.runners.ParentRunner.runLeaf(ParentRunner.java:271)
03-Dec-2021 18:00:44         at org.springframework.test.context.junit4.SpringJUnit4ClassRunner.runChild(SpringJUnit4ClassRunner.java:217)
03-Dec-2021 18:00:44         at org.springframework.test.context.junit4.SpringJUnit4ClassRunner.runChild(SpringJUnit4ClassRunner.java:83)
03-Dec-2021 18:00:44         at org.junit.runners.ParentRunner$3.run(ParentRunner.java:238)
03-Dec-2021 18:00:44         at org.junit.runners.ParentRunner$1.schedule(ParentRunner.java:63)
03-Dec-2021 18:00:44         at org.junit.runners.ParentRunner.runChildren(ParentRunner.java:236)
03-Dec-2021 18:00:44         at org.junit.runners.ParentRunner.access$000(ParentRunner.java:53)
03-Dec-2021 18:00:44         at org.junit.runners.ParentRunner$2.evaluate(ParentRunner.java:229)
03-Dec-2021 18:00:44         at org.springframework.test.context.junit4.statements.RunBeforeTestClassCallbacks.evaluate(RunBeforeTestClassCallbacks.java:61)
03-Dec-2021 18:00:44         at org.junit.internal.runners.statements.RunAfters.evaluate(RunAfters.java:27)
03-Dec-2021 18:00:44         at org.springframework.test.context.junit4.statements.RunAfterTestClassCallbacks.evaluate(RunAfterTestClassCallbacks.java:68)
03-Dec-2021 18:00:44         at org.junit.runners.ParentRunner.run(ParentRunner.java:309)
03-Dec-2021 18:00:44         at org.springframework.test.context.junit4.SpringJUnit4ClassRunner.run(SpringJUnit4ClassRunner.java:163)
03-Dec-2021 18:00:44         at org.apache.maven.surefire.junit4.JUnit4TestSet.execute(JUnit4TestSet.java:59)
03-Dec-2021 18:00:44         at org.apache.maven.surefire.suite.AbstractDirectoryTestSuite.executeTestSet(AbstractDirectoryTestSuite.java:115)
03-Dec-2021 18:00:44         at org.apache.maven.surefire.suite.AbstractDirectoryTestSuite.execute(AbstractDirectoryTestSuite.java:102)
03-Dec-2021 18:00:44         at org.apache.maven.surefire.Surefire.run(Surefire.java:180)
03-Dec-2021 18:00:44         at sun.reflect.NativeMethodAccessorImpl.invoke0(Native Method)
03-Dec-2021 18:00:44         at sun.reflect.NativeMethodAccessorImpl.invoke(NativeMethodAccessorImpl.java:62)
03-Dec-2021 18:00:44         at sun.reflect.DelegatingMethodAccessorImpl.invoke(DelegatingMethodAccessorImpl.java:43)
03-Dec-2021 18:00:44         at java.lang.reflect.Method.invoke(Method.java:498)
03-Dec-2021 18:00:44         at org.apache.maven.surefire.booter.SurefireBooter.runSuitesInProcess(SurefireBooter.java:350)
03-Dec-2021 18:00:44         at org.apache.maven.surefire.booter.SurefireBooter.main(SurefireBooter.java:1021)
03-Dec-2021 18:00:44 Caused by: java.lang.IllegalArgumentException: Unable to evaluate to a single value. Exactly one column must be defined.
03-Dec-2021 18:00:44         at org.openmrs.module.reporting.evaluation.service.EvaluationServiceImpl.evaluateToObject(EvaluationServiceImpl.java:90)
03-Dec-2021 18:00:44         at sun.reflect.NativeMethodAccessorImpl.invoke0(Native Method)
03-Dec-2021 18:00:44         at sun.reflect.NativeMethodAccessorImpl.invoke(NativeMethodAccessorImpl.java:62)
03-Dec-2021 18:00:44         at sun.reflect.DelegatingMethodAccessorImpl.invoke(DelegatingMethodAccessorImpl.java:43)
03-Dec-2021 18:00:44         at java.lang.reflect.Method.invoke(Method.java:498)
03-Dec-2021 18:00:44         at org.springframework.aop.support.AopUtils.invokeJoinpointUsingReflection(AopUtils.java:317)
03-Dec-2021 18:00:44         at org.springframework.aop.framework.ReflectiveMethodInvocation.invokeJoinpoint(ReflectiveMethodInvocation.java:190)
03-Dec-2021 18:00:44         at org.springframework.aop.framework.ReflectiveMethodInvocation.proceed(ReflectiveMethodInvocation.java:157)
03-Dec-2021 18:00:44         at org.springframework.transaction.interceptor.TransactionInterceptor$1.proceedWithInvocation(TransactionInterceptor.java:99)
03-Dec-2021 18:00:44         at org.springframework.transaction.interceptor.TransactionAspectSupport.invokeWithinTransaction(TransactionAspectSupport.java:281)
03-Dec-2021 18:00:44         at org.springframework.transaction.interceptor.TransactionInterceptor.invoke(TransactionInterceptor.java:96)
03-Dec-2021 18:00:44         at org.springframework.aop.framework.ReflectiveMethodInvocation.proceed(ReflectiveMethodInvocation.java:179)
03-Dec-2021 18:00:44         at org.springframework.cache.interceptor.CacheInterceptor$1.invoke(CacheInterceptor.java:52)
03-Dec-2021 18:00:44         at org.springframework.cache.interceptor.CacheAspectSupport.execute(CacheAspectSupport.java:303)
03-Dec-2021 18:00:44         at org.springframework.cache.interceptor.CacheInterceptor.invoke(CacheInterceptor.java:61)
03-Dec-2021 18:00:44         at org.springframework.aop.framework.ReflectiveMethodInvocation.proceed(ReflectiveMethodInvocation.java:179)
03-Dec-2021 18:00:44         at org.openmrs.aop.LoggingAdvice.invoke(LoggingAdvice.java:121)
03-Dec-2021 18:00:44         at org.springframework.aop.framework.ReflectiveMethodInvocation.proceed(ReflectiveMethodInvocation.java:179)
03-Dec-2021 18:00:44         at org.springframework.aop.framework.adapter.MethodBeforeAdviceInterceptor.invoke(MethodBeforeAdviceInterceptor.java:52)
03-Dec-2021 18:00:44         at org.springframework.aop.framework.ReflectiveMethodInvocation.proceed(ReflectiveMethodInvocation.java:179)
03-Dec-2021 18:00:44         at org.springframework.aop.framework.adapter.MethodBeforeAdviceInterceptor.invoke(MethodBeforeAdviceInterceptor.java:52)
03-Dec-2021 18:00:44         at org.springframework.aop.framework.ReflectiveMethodInvocation.proceed(ReflectiveMethodInvocation.java:179)
03-Dec-2021 18:00:44         at org.springframework.aop.framework.JdkDynamicAopProxy.invoke(JdkDynamicAopProxy.java:207)
03-Dec-2021 18:00:44         at com.sun.proxy.$Proxy34.evaluateToObject(Unknown Source)
03-Dec-2021 18:00:44         at sun.reflect.NativeMethodAccessorImpl.invoke0(Native Method)
03-Dec-2021 18:00:44         at sun.reflect.NativeMethodAccessorImpl.invoke(NativeMethodAccessorImpl.java:62)
03-Dec-2021 18:00:44         at sun.reflect.DelegatingMethodAccessorImpl.invoke(DelegatingMethodAccessorImpl.java:43)
03-Dec-2021 18:00:44         at java.lang.reflect.Method.invoke(Method.java:498)
03-Dec-2021 18:00:44         at org.springframework.aop.support.AopUtils.invokeJoinpointUsingReflection(AopUtils.java:317)
03-Dec-2021 18:00:44         at org.springframework.aop.framework.ReflectiveMethodInvocation.invokeJoinpoint(ReflectiveMethodInvocation.java:190)
03-Dec-2021 18:00:44         at org.springframework.aop.framework.ReflectiveMethodInvocation.proceed(ReflectiveMethodInvocation.java:157)
03-Dec-2021 18:00:44         at org.springframework.transaction.interceptor.TransactionInterceptor$1.proceedWithInvocation(TransactionInterceptor.java:99)
03-Dec-2021 18:00:44         at org.springframework.transaction.interceptor.TransactionAspectSupport.invokeWithinTransaction(TransactionAspectSupport.java:281)
03-Dec-2021 18:00:44         at org.springframework.transaction.interceptor.TransactionInterceptor.invoke(TransactionInterceptor.java:96)
03-Dec-2021 18:00:44         at org.springframework.aop.framework.ReflectiveMethodInvocation.proceed(ReflectiveMethodInvocation.java:179)
03-Dec-2021 18:00:44         at org.springframework.aop.framework.JdkDynamicAopProxy.invoke(JdkDynamicAopProxy.java:207)
03-Dec-2021 18:00:44         at com.sun.proxy.$Proxy143.evaluateToObject(Unknown Source)
03-Dec-2021 18:00:44         at org.openmrs.module.reporting.indicator.evaluator.SqlIndicatorEvaluator.evaluateSql(SqlIndicatorEvaluator.java:54)
03-Dec-2021 18:00:44         ... 74 more
03-Dec-2021 18:00:44 ERROR - EvaluationProfiler.log(111) |2021-12-03 18:00:44,488| 1353        2021-12-03 18:00:44.488        >        ERROR        EVALUATING_DEFINITION                        SqlIndicator[sql=SELECT person_id from person]: Failed to evaluate sql because:
03-Dec-2021 18:00:44 Unable to evaluate to a single value. Exactly one row must be returned by query.
03-Dec-2021 18:00:44 org.openmrs.module.reporting.evaluation.EvaluationException: Failed to evaluate sql because:
03-Dec-2021 18:00:44 Unable to evaluate to a single value. Exactly one row must be returned by query.
03-Dec-2021 18:00:44         at org.openmrs.module.reporting.indicator.evaluator.SqlIndicatorEvaluator.evaluateSql(SqlIndicatorEvaluator.java:57)
03-Dec-2021 18:00:44         at org.openmrs.module.reporting.indicator.evaluator.SqlIndicatorEvaluator.evaluate(SqlIndicatorEvaluator.java:41)
03-Dec-2021 18:00:44         at org.openmrs.module.reporting.indicator.evaluator.SqlIndicatorEvaluator.evaluate(SqlIndicatorEvaluator.java:28)
03-Dec-2021 18:00:44         at org.openmrs.module.reporting.definition.service.BaseDefinitionService.executeEvaluator(BaseDefinitionService.java:369)
03-Dec-2021 18:00:44         at org.openmrs.module.reporting.definition.service.BaseDefinitionService.evaluateBypassingExclusionOfTestPatients(BaseDefinitionService.java:264)
03-Dec-2021 18:00:44         at org.openmrs.module.reporting.definition.service.BaseDefinitionService.evaluate(BaseDefinitionService.java:229)
03-Dec-2021 18:00:44         at org.openmrs.module.reporting.indicator.service.IndicatorServiceImpl.evaluate(IndicatorServiceImpl.java:41)
03-Dec-2021 18:00:44         at sun.reflect.GeneratedMethodAccessor1211.invoke(Unknown Source)
03-Dec-2021 18:00:44         at sun.reflect.DelegatingMethodAccessorImpl.invoke(DelegatingMethodAccessorImpl.java:43)
03-Dec-2021 18:00:44         at java.lang.reflect.Method.invoke(Method.java:498)
03-Dec-2021 18:00:44         at org.springframework.aop.support.AopUtils.invokeJoinpointUsingReflection(AopUtils.java:317)
03-Dec-2021 18:00:44         at org.springframework.aop.framework.ReflectiveMethodInvocation.invokeJoinpoint(ReflectiveMethodInvocation.java:190)
03-Dec-2021 18:00:44         at org.springframework.aop.framework.ReflectiveMethodInvocation.proceed(ReflectiveMethodInvocation.java:157)
03-Dec-2021 18:00:44         at org.springframework.cache.interceptor.CacheInterceptor$1.invoke(CacheInterceptor.java:52)
03-Dec-2021 18:00:44         at org.springframework.cache.interceptor.CacheAspectSupport.execute(CacheAspectSupport.java:303)
03-Dec-2021 18:00:44         at org.springframework.cache.interceptor.CacheInterceptor.invoke(CacheInterceptor.java:61)
03-Dec-2021 18:00:44         at org.springframework.aop.framework.ReflectiveMethodInvocation.proceed(ReflectiveMethodInvocation.java:179)
03-Dec-2021 18:00:44         at org.openmrs.aop.LoggingAdvice.invoke(LoggingAdvice.java:121)
03-Dec-2021 18:00:44         at org.springframework.aop.framework.ReflectiveMethodInvocation.proceed(ReflectiveMethodInvocation.java:179)
03-Dec-2021 18:00:44         at org.springframework.aop.framework.adapter.MethodBeforeAdviceInterceptor.invoke(MethodBeforeAdviceInterceptor.java:52)
03-Dec-2021 18:00:44         at org.springframework.aop.framework.ReflectiveMethodInvocation.proceed(ReflectiveMethodInvocation.java:179)
03-Dec-2021 18:00:44         at org.springframework.aop.framework.adapter.MethodBeforeAdviceInterceptor.invoke(MethodBeforeAdviceInterceptor.java:52)
03-Dec-2021 18:00:44         at org.springframework.aop.framework.ReflectiveMethodInvocation.proceed(ReflectiveMethodInvocation.java:179)
03-Dec-2021 18:00:44         at org.springframework.aop.framework.JdkDynamicAopProxy.invoke(JdkDynamicAopProxy.java:207)
03-Dec-2021 18:00:44         at com.sun.proxy.$Proxy47.evaluate(Unknown Source)
03-Dec-2021 18:00:44         at sun.reflect.GeneratedMethodAccessor1211.invoke(Unknown Source)
03-Dec-2021 18:00:44         at sun.reflect.DelegatingMethodAccessorImpl.invoke(DelegatingMethodAccessorImpl.java:43)
03-Dec-2021 18:00:44         at java.lang.reflect.Method.invoke(Method.java:498)
03-Dec-2021 18:00:44         at org.springframework.aop.support.AopUtils.invokeJoinpointUsingReflection(AopUtils.java:317)
03-Dec-2021 18:00:44         at org.springframework.aop.framework.JdkDynamicAopProxy.invoke(JdkDynamicAopProxy.java:201)
03-Dec-2021 18:00:44         at com.sun.proxy.$Proxy160.evaluate(Unknown Source)
03-Dec-2021 18:00:44         at org.openmrs.module.reporting.indicator.SqlIndicatorTest.assertIndicatorValue(SqlIndicatorTest.java:94)
03-Dec-2021 18:00:44         at org.openmrs.module.reporting.indicator.SqlIndicatorTest.assertIndicatorValue(SqlIndicatorTest.java:103)
03-Dec-2021 18:00:44         at org.openmrs.module.reporting.indicator.SqlIndicatorTest.assertIndicatorValue(SqlIndicatorTest.java:114)
03-Dec-2021 18:00:44         at org.openmrs.module.reporting.indicator.SqlIndicatorTest.assertIndicatorValue(SqlIndicatorTest.java:107)
03-Dec-2021 18:00:44         at org.openmrs.module.reporting.indicator.SqlIndicatorTest.sqlIndicator_shouldNotAllowQueriesThatReturnMoreThanOneRow(SqlIndicatorTest.java:90)
03-Dec-2021 18:00:44         at sun.reflect.NativeMethodAccessorImpl.invoke0(Native Method)
03-Dec-2021 18:00:44         at sun.reflect.NativeMethodAccessorImpl.invoke(NativeMethodAccessorImpl.java:62)
03-Dec-2021 18:00:44         at sun.reflect.DelegatingMethodAccessorImpl.invoke(DelegatingMethodAccessorImpl.java:43)
03-Dec-2021 18:00:44         at java.lang.reflect.Method.invoke(Method.java:498)
03-Dec-2021 18:00:44         at org.junit.runners.model.FrameworkMethod$1.runReflectiveCall(FrameworkMethod.java:47)
03-Dec-2021 18:00:44         at org.junit.internal.runners.model.ReflectiveCallable.run(ReflectiveCallable.java:12)
03-Dec-2021 18:00:44         at org.junit.runners.model.FrameworkMethod.invokeExplosively(FrameworkMethod.java:44)
03-Dec-2021 18:00:44         at org.junit.internal.runners.statements.InvokeMethod.evaluate(InvokeMethod.java:17)
03-Dec-2021 18:00:44         at org.junit.internal.runners.statements.ExpectException.evaluate(ExpectException.java:19)
03-Dec-2021 18:00:44         at org.junit.internal.runners.statements.RunBefores.evaluate(RunBefores.java:26)
03-Dec-2021 18:00:44         at org.springframework.test.context.junit4.statements.RunBeforeTestMethodCallbacks.evaluate(RunBeforeTestMethodCallbacks.java:73)
03-Dec-2021 18:00:44         at org.junit.internal.runners.statements.RunAfters.evaluate(RunAfters.java:27)
03-Dec-2021 18:00:44         at org.springframework.test.context.junit4.statements.RunAfterTestMethodCallbacks.evaluate(RunAfterTestMethodCallbacks.java:82)
03-Dec-2021 18:00:44         at org.springframework.test.context.junit4.statements.SpringRepeat.evaluate(SpringRepeat.java:73)
03-Dec-2021 18:00:44         at org.junit.runners.ParentRunner.runLeaf(ParentRunner.java:271)
03-Dec-2021 18:00:44         at org.springframework.test.context.junit4.SpringJUnit4ClassRunner.runChild(SpringJUnit4ClassRunner.java:217)
03-Dec-2021 18:00:44         at org.springframework.test.context.junit4.SpringJUnit4ClassRunner.runChild(SpringJUnit4ClassRunner.java:83)
03-Dec-2021 18:00:44         at org.junit.runners.ParentRunner$3.run(ParentRunner.java:238)
03-Dec-2021 18:00:44         at org.junit.runners.ParentRunner$1.schedule(ParentRunner.java:63)
03-Dec-2021 18:00:44         at org.junit.runners.ParentRunner.runChildren(ParentRunner.java:236)
03-Dec-2021 18:00:44         at org.junit.runners.ParentRunner.access$000(ParentRunner.java:53)
03-Dec-2021 18:00:44         at org.junit.runners.ParentRunner$2.evaluate(ParentRunner.java:229)
03-Dec-2021 18:00:44         at org.springframework.test.context.junit4.statements.RunBeforeTestClassCallbacks.evaluate(RunBeforeTestClassCallbacks.java:61)
03-Dec-2021 18:00:44         at org.junit.internal.runners.statements.RunAfters.evaluate(RunAfters.java:27)
03-Dec-2021 18:00:44         at org.springframework.test.context.junit4.statements.RunAfterTestClassCallbacks.evaluate(RunAfterTestClassCallbacks.java:68)
03-Dec-2021 18:00:44         at org.junit.runners.ParentRunner.run(ParentRunner.java:309)
03-Dec-2021 18:00:44         at org.springframework.test.context.junit4.SpringJUnit4ClassRunner.run(SpringJUnit4ClassRunner.java:163)
03-Dec-2021 18:00:44         at org.apache.maven.surefire.junit4.JUnit4TestSet.execute(JUnit4TestSet.java:59)
03-Dec-2021 18:00:44         at org.apache.maven.surefire.suite.AbstractDirectoryTestSuite.executeTestSet(AbstractDirectoryTestSuite.java:115)
03-Dec-2021 18:00:44         at org.apache.maven.surefire.suite.AbstractDirectoryTestSuite.execute(AbstractDirectoryTestSuite.java:102)
03-Dec-2021 18:00:44         at org.apache.maven.surefire.Surefire.run(Surefire.java:180)
03-Dec-2021 18:00:44         at sun.reflect.NativeMethodAccessorImpl.invoke0(Native Method)
03-Dec-2021 18:00:44         at sun.reflect.NativeMethodAccessorImpl.invoke(NativeMethodAccessorImpl.java:62)
03-Dec-2021 18:00:44         at sun.reflect.DelegatingMethodAccessorImpl.invoke(DelegatingMethodAccessorImpl.java:43)
03-Dec-2021 18:00:44         at java.lang.reflect.Method.invoke(Method.java:498)
03-Dec-2021 18:00:44         at org.apache.maven.surefire.booter.SurefireBooter.runSuitesInProcess(SurefireBooter.java:350)
03-Dec-2021 18:00:44         at org.apache.maven.surefire.booter.SurefireBooter.main(SurefireBooter.java:1021)
03-Dec-2021 18:00:44 Caused by: java.lang.IllegalArgumentException: Unable to evaluate to a single value. Exactly one row must be returned by query.
03-Dec-2021 18:00:44         at org.openmrs.module.reporting.evaluation.service.EvaluationServiceImpl.evaluateToObject(EvaluationServiceImpl.java:86)
03-Dec-2021 18:00:44         at sun.reflect.GeneratedMethodAccessor1214.invoke(Unknown Source)
03-Dec-2021 18:00:44         at sun.reflect.DelegatingMethodAccessorImpl.invoke(DelegatingMethodAccessorImpl.java:43)
03-Dec-2021 18:00:44         at java.lang.reflect.Method.invoke(Method.java:498)
03-Dec-2021 18:00:44         at org.springframework.aop.support.AopUtils.invokeJoinpointUsingReflection(AopUtils.java:317)
03-Dec-2021 18:00:44         at org.springframework.aop.framework.ReflectiveMethodInvocation.invokeJoinpoint(ReflectiveMethodInvocation.java:190)
03-Dec-2021 18:00:44         at org.springframework.aop.framework.ReflectiveMethodInvocation.proceed(ReflectiveMethodInvocation.java:157)
03-Dec-2021 18:00:44         at org.springframework.transaction.interceptor.TransactionInterceptor$1.proceedWithInvocation(TransactionInterceptor.java:99)
03-Dec-2021 18:00:44         at org.springframework.transaction.interceptor.TransactionAspectSupport.invokeWithinTransaction(TransactionAspectSupport.java:281)
03-Dec-2021 18:00:44         at org.springframework.transaction.interceptor.TransactionInterceptor.invoke(TransactionInterceptor.java:96)
03-Dec-2021 18:00:44         at org.springframework.aop.framework.ReflectiveMethodInvocation.proceed(ReflectiveMethodInvocation.java:179)
03-Dec-2021 18:00:44         at org.springframework.cache.interceptor.CacheInterceptor$1.invoke(CacheInterceptor.java:52)
03-Dec-2021 18:00:44         at org.springframework.cache.interceptor.CacheAspectSupport.execute(CacheAspectSupport.java:303)
03-Dec-2021 18:00:44         at org.springframework.cache.interceptor.CacheInterceptor.invoke(CacheInterceptor.java:61)
03-Dec-2021 18:00:44         at org.springframework.aop.framework.ReflectiveMethodInvocation.proceed(ReflectiveMethodInvocation.java:179)
03-Dec-2021 18:00:44         at org.openmrs.aop.LoggingAdvice.invoke(LoggingAdvice.java:121)
03-Dec-2021 18:00:44         at org.springframework.aop.framework.ReflectiveMethodInvocation.proceed(ReflectiveMethodInvocation.java:179)
03-Dec-2021 18:00:44         at org.springframework.aop.framework.adapter.MethodBeforeAdviceInterceptor.invoke(MethodBeforeAdviceInterceptor.java:52)
03-Dec-2021 18:00:44         at org.springframework.aop.framework.ReflectiveMethodInvocation.proceed(ReflectiveMethodInvocation.java:179)
03-Dec-2021 18:00:44         at org.springframework.aop.framework.adapter.MethodBeforeAdviceInterceptor.invoke(MethodBeforeAdviceInterceptor.java:52)
03-Dec-2021 18:00:44         at org.springframework.aop.framework.ReflectiveMethodInvocation.proceed(ReflectiveMethodInvocation.java:179)
03-Dec-2021 18:00:44         at org.springframework.aop.framework.JdkDynamicAopProxy.invoke(JdkDynamicAopProxy.java:207)
03-Dec-2021 18:00:44         at com.sun.proxy.$Proxy34.evaluateToObject(Unknown Source)
03-Dec-2021 18:00:44         at sun.reflect.GeneratedMethodAccessor1214.invoke(Unknown Source)
03-Dec-2021 18:00:44         at sun.reflect.DelegatingMethodAccessorImpl.invoke(DelegatingMethodAccessorImpl.java:43)
03-Dec-2021 18:00:44         at java.lang.reflect.Method.invoke(Method.java:498)
03-Dec-2021 18:00:44         at org.springframework.aop.support.AopUtils.invokeJoinpointUsingReflection(AopUtils.java:317)
03-Dec-2021 18:00:44         at org.springframework.aop.framework.ReflectiveMethodInvocation.invokeJoinpoint(ReflectiveMethodInvocation.java:190)
03-Dec-2021 18:00:44         at org.springframework.aop.framework.ReflectiveMethodInvocation.proceed(ReflectiveMethodInvocation.java:157)
03-Dec-2021 18:00:44         at org.springframework.transaction.interceptor.TransactionInterceptor$1.proceedWithInvocation(TransactionInterceptor.java:99)
03-Dec-2021 18:00:44         at org.springframework.transaction.interceptor.TransactionAspectSupport.invokeWithinTransaction(TransactionAspectSupport.java:281)
03-Dec-2021 18:00:44         at org.springframework.transaction.interceptor.TransactionInterceptor.invoke(TransactionInterceptor.java:96)
03-Dec-2021 18:00:44         at org.springframework.aop.framework.ReflectiveMethodInvocation.proceed(ReflectiveMethodInvocation.java:179)
03-Dec-2021 18:00:44         at org.springframework.aop.framework.JdkDynamicAopProxy.invoke(JdkDynamicAopProxy.java:207)
03-Dec-2021 18:00:44         at com.sun.proxy.$Proxy143.evaluateToObject(Unknown Source)
03-Dec-2021 18:00:44         at org.openmrs.module.reporting.indicator.evaluator.SqlIndicatorEvaluator.evaluateSql(SqlIndicatorEvaluator.java:54)
03-Dec-2021 18:00:44         ... 72 more
03-Dec-2021 18:00:44 Tests run: 8, Failures: 0, Errors: 0, Skipped: 0, Time elapsed: 1.096 sec
03-Dec-2021 18:00:44 Running org.openmrs.module.reporting.report.renderer.ExcelTemplateRendererTest
03-Dec-2021 18:00:44 Tests run: 2, Failures: 0, Errors: 0, Skipped: 0, Time elapsed: 0.212 sec
03-Dec-2021 18:00:44 Running org.openmrs.module.reporting.cohort.CohortsTest
03-Dec-2021 18:00:44 Tests run: 3, Failures: 0, Errors: 0, Skipped: 0, Time elapsed: 0.027 sec
03-Dec-2021 18:00:44 Running org.openmrs.module.reporting.data.converter.StringConverterTest
03-Dec-2021 18:00:44 Tests run: 1, Failures: 0, Errors: 0, Skipped: 0, Time elapsed: 0.001 sec
03-Dec-2021 18:00:44 Running org.openmrs.module.reporting.dataset.definition.evaluator.RepeatPerTimePeriodDataSetEvaluatorTest
03-Dec-2021 18:00:45 Tests run: 4, Failures: 0, Errors: 0, Skipped: 0, Time elapsed: 0.155 sec
03-Dec-2021 18:00:45 Running org.openmrs.module.reporting.data.JoinDataDefinitionTest
03-Dec-2021 18:00:45 Tests run: 2, Failures: 0, Errors: 0, Skipped: 0, Time elapsed: 0.001 sec
03-Dec-2021 18:00:45 Running org.openmrs.module.reporting.query.obs.evaluator.BasicObsQueryEvaluatorTest
03-Dec-2021 18:00:45 Tests run: 1, Failures: 0, Errors: 0, Skipped: 0, Time elapsed: 0.225 sec
03-Dec-2021 18:00:45 Running org.openmrs.module.reporting.query.person.evaluator.PatientPersonQueryEvaluatorTest
03-Dec-2021 18:00:45 Tests run: 1, Failures: 0, Errors: 0, Skipped: 0, Time elapsed: 0.142 sec
03-Dec-2021 18:00:45 Running org.openmrs.module.reporting.config.ReportLoaderTest
03-Dec-2021 18:00:45 Tests run: 4, Failures: 0, Errors: 0, Skipped: 0, Time elapsed: 0.066 sec
03-Dec-2021 18:00:45 Running org.openmrs.module.reporting.data.patient.evaluator.ScriptedCompositionPatientDataEvaluatorTest
03-Dec-2021 18:00:46 Tests run: 2, Failures: 0, Errors: 0, Skipped: 0, Time elapsed: 1.084 sec
03-Dec-2021 18:00:46 Running org.openmrs.module.reporting.definition.library.implementerconfigured.ImplementerConfiguredEncounterDataDefinitionLibraryTest
03-Dec-2021 18:00:46 Tests run: 2, Failures: 0, Errors: 0, Skipped: 0, Time elapsed: 0.039 sec
03-Dec-2021 18:00:46 Running org.openmrs.module.reporting.data.encounter.evaluator.PersonToEncounterDataEvaluatorTest
03-Dec-2021 18:00:46 Tests run: 3, Failures: 0, Errors: 0, Skipped: 0, Time elapsed: 0.368 sec
03-Dec-2021 18:00:46 Running org.openmrs.module.reporting.data.visit.evaluator.PatientToVisitDataEvaluatorTest
03-Dec-2021 18:00:47 {1=102, 4=12345K}
03-Dec-2021 18:00:47 Tests run: 3, Failures: 0, Errors: 0, Skipped: 0, Time elapsed: 0.429 sec
03-Dec-2021 18:00:47 Running org.openmrs.module.reporting.validator.CompositionCohortDefinitionValidatorTest
03-Dec-2021 18:00:47 Tests run: 5, Failures: 0, Errors: 0, Skipped: 0, Time elapsed: 0.039 sec
03-Dec-2021 18:00:47 Running org.openmrs.module.reporting.cohort.definition.evaluator.InProgramCohortDefinitionEvaluatorTest
03-Dec-2021 18:00:48 Tests run: 5, Failures: 0, Errors: 0, Skipped: 0, Time elapsed: 0.75 sec
03-Dec-2021 18:00:48 Running org.openmrs.module.reporting.calculation.PatientDataCalculationBehaviorTest
03-Dec-2021 18:00:48 Tests run: 3, Failures: 0, Errors: 0, Skipped: 0, Time elapsed: 0.599 sec
03-Dec-2021 18:00:48 Running org.openmrs.module.reporting.dataset.definition.evaluator.CohortIndicatorDataSetEvaluatorTest
03-Dec-2021 18:00:48 Tests run: 1, Failures: 0, Errors: 0, Skipped: 0, Time elapsed: 0.15 sec
03-Dec-2021 18:00:48 Running org.openmrs.module.reporting.query.encounter.evaluator.AuditEncounterQueryEvaluatorTest
03-Dec-2021 18:00:49 Tests run: 5, Failures: 0, Errors: 0, Skipped: 0, Time elapsed: 0.705 sec
03-Dec-2021 18:00:49 Running org.openmrs.module.reporting.definition.service.DefinitionServiceTest
03-Dec-2021 18:00:49 Tests run: 1, Failures: 0, Errors: 0, Skipped: 0, Time elapsed: 0.106 sec
03-Dec-2021 18:00:49 Running org.openmrs.module.reporting.indicator.aggregation.AggregationTest
03-Dec-2021 18:00:49 Tests run: 12, Failures: 0, Errors: 0, Skipped: 0, Time elapsed: 0.009 sec
03-Dec-2021 18:00:49 Running org.openmrs.module.reporting.data.person.evaluator.ConvertedPersonDataEvaluatorTest
03-Dec-2021 18:00:49 Tests run: 1, Failures: 0, Errors: 0, Skipped: 0, Time elapsed: 0.152 sec
03-Dec-2021 18:00:49 Running org.openmrs.module.reporting.query.encounter.evaluator.SqlEncounterQueryEvaluatorTest
03-Dec-2021 18:00:50 Tests run: 3, Failures: 0, Errors: 0, Skipped: 0, Time elapsed: 0.319 sec
03-Dec-2021 18:00:50 Running org.openmrs.module.reporting.report.renderer.CsvReportRendererTest
03-Dec-2021 18:00:50 Tests run: 1, Failures: 0, Errors: 0, Skipped: 0, Time elapsed: 0.014 sec
03-Dec-2021 18:00:50 Running org.openmrs.module.reporting.dataset.definition.evaluator.LogicDataSetEvaluatorTest
03-Dec-2021 18:00:50 Tests run: 1, Failures: 0, Errors: 0, Skipped: 1, Time elapsed: 0.001 sec
03-Dec-2021 18:00:50 Running org.openmrs.module.reporting.dataset.definition.evaluator.VisitDataSetEvaluatorTest
03-Dec-2021 18:00:50 VISIT ID        EMR ID        BIRTHDATE          
03-Dec-2021 18:00:50 --------        ------        -----------        
03-Dec-2021 18:00:50 1               2             08/Apr/1975        
03-Dec-2021 18:00:50 2               2             08/Apr/1975        
03-Dec-2021 18:00:50 3               2             08/Apr/1975        
03-Dec-2021 18:00:50 4               6             27/May/2007        
03-Dec-2021 18:00:50 5               6             27/May/2007        
03-Dec-2021 18:00:50 Tests run: 1, Failures: 0, Errors: 0, Skipped: 0, Time elapsed: 0.133 sec
03-Dec-2021 18:00:50 Running org.openmrs.module.reporting.data.person.evaluator.PersonIdDataEvaluatorTest
03-Dec-2021 18:00:50 Tests run: 1, Failures: 0, Errors: 0, Skipped: 0, Time elapsed: 0.144 sec
03-Dec-2021 18:00:50 Running org.openmrs.module.reporting.cohort.definition.evaluator.BirthAndDeathCohortDefinitionEvaluatorTest
03-Dec-2021 18:00:51 Tests run: 8, Failures: 0, Errors: 0, Skipped: 0, Time elapsed: 1.189 sec
03-Dec-2021 18:00:51 Running org.openmrs.module.reporting.data.encounter.evaluator.SqlEncounterDataEvaluatorTest
03-Dec-2021 18:00:51 Tests run: 1, Failures: 0, Errors: 0, Skipped: 0, Time elapsed: 0.136 sec
03-Dec-2021 18:00:51 Running org.openmrs.module.reporting.data.converter.PersonAddressConverterTest
03-Dec-2021 18:00:51 Tests run: 1, Failures: 0, Errors: 0, Skipped: 0, Time elapsed: 0.015 sec
03-Dec-2021 18:00:51 Running org.openmrs.module.reporting.data.converter.AttributeValueConverterTest
03-Dec-2021 18:00:52 Tests run: 2, Failures: 0, Errors: 0, Skipped: 0, Time elapsed: 0.247 sec
03-Dec-2021 18:00:52 Running org.openmrs.module.reporting.common.DelimitedKeyComparatorTest
03-Dec-2021 18:00:52 Tests run: 1, Failures: 0, Errors: 0, Skipped: 0, Time elapsed: 0.001 sec
03-Dec-2021 18:00:52 Running org.openmrs.module.reporting.data.obs.evaluator.ConvertedObsDataEvaluatorTest
03-Dec-2021 18:00:52 Tests run: 1, Failures: 0, Errors: 0, Skipped: 0, Time elapsed: 0.127 sec
03-Dec-2021 18:00:52 Running org.openmrs.module.reporting.query.person.evaluator.SqlPersonQueryEvaluatorTest
03-Dec-2021 18:00:52 Tests run: 2, Failures: 0, Errors: 0, Skipped: 0, Time elapsed: 0.223 sec
03-Dec-2021 18:00:52 Running org.openmrs.module.reporting.query.person.evaluator.AllPersonQueryEvaluatorTest
03-Dec-2021 18:00:53 Tests run: 6, Failures: 0, Errors: 0, Skipped: 0, Time elapsed: 0.691 sec
03-Dec-2021 18:00:53 Running org.openmrs.module.reporting.dataset.definition.evaluator.SqlFileDataSetEvaluatorTest
03-Dec-2021 18:00:53 Tests run: 2, Failures: 0, Errors: 0, Skipped: 0, Time elapsed: 0.492 sec
03-Dec-2021 18:00:53 Running org.openmrs.module.reporting.data.person.evaluator.AgeAtDateOfOtherDataEvaluatorTest
03-Dec-2021 18:00:54 Tests run: 1, Failures: 0, Errors: 0, Skipped: 0, Time elapsed: 0.71 sec
03-Dec-2021 18:00:54 Running org.openmrs.module.reporting.indicator.PeriodIndicatorReportTest
03-Dec-2021 18:00:54 Tests run: 2, Failures: 0, Errors: 0, Skipped: 0, Time elapsed: 0.246 sec
03-Dec-2021 18:00:54 Running org.openmrs.module.reporting.report.renderer.DelimitedTextReportRendererTest
03-Dec-2021 18:00:54 Tests run: 11, Failures: 0, Errors: 0, Skipped: 0, Time elapsed: 0.374 sec
03-Dec-2021 18:00:54 Running org.openmrs.module.reporting.data.patient.evaluator.PatientObjectDataEvaluatorTest
03-Dec-2021 18:00:55 Tests run: 1, Failures: 0, Errors: 0, Skipped: 0, Time elapsed: 0.209 sec
03-Dec-2021 18:00:55 Running org.openmrs.module.reporting.data.patient.evaluator.TestPatientCalculation
03-Dec-2021 18:00:55 Tests run: 1, Failures: 0, Errors: 0, Skipped: 1, Time elapsed: 0.001 sec
03-Dec-2021 18:00:55 Running org.openmrs.module.reporting.validator.SqlCohortDefinitionValidatorTest
03-Dec-2021 18:00:55 Tests run: 3, Failures: 0, Errors: 0, Skipped: 0, Time elapsed: 0.063 sec
03-Dec-2021 18:00:55 Running org.openmrs.module.reporting.cohort.definition.evaluator.PatientStateCohortDefinitionEvaluatorTest
03-Dec-2021 18:00:56 Tests run: 7, Failures: 0, Errors: 0, Skipped: 0, Time elapsed: 0.972 sec
03-Dec-2021 18:00:56 Running org.openmrs.module.reporting.data.converter.NullValueConverterTest
03-Dec-2021 18:00:56 Tests run: 1, Failures: 0, Errors: 0, Skipped: 0, Time elapsed: 0.002 sec
03-Dec-2021 18:00:56 Running org.openmrs.module.reporting.query.encounter.evaluator.ConditionalParameterEncounterQueryEvaluatorTest
03-Dec-2021 18:00:56 Tests run: 1, Failures: 0, Errors: 0, Skipped: 0, Time elapsed: 0.141 sec
03-Dec-2021 18:00:56 Running org.openmrs.module.reporting.report.service.TestReportProcessor
03-Dec-2021 18:00:56 Tests run: 1, Failures: 0, Errors: 0, Skipped: 1, Time elapsed: 0.001 sec
03-Dec-2021 18:00:56 Running org.openmrs.module.reporting.common.FractionTest
03-Dec-2021 18:00:56 Tests run: 7, Failures: 0, Errors: 0, Skipped: 0, Time elapsed: 0.003 sec
03-Dec-2021 18:00:56 Running org.openmrs.module.reporting.report.renderer.ReportDesignRendererTest
03-Dec-2021 18:00:56 Tests run: 2, Failures: 0, Errors: 0, Skipped: 0, Time elapsed: 0.036 sec
03-Dec-2021 18:00:56 Running org.openmrs.module.reporting.data.patient.evaluator.ProgramEnrollmentsForPatientDataEvaluatorTest
03-Dec-2021 18:00:57 Tests run: 8, Failures: 0, Errors: 0, Skipped: 0, Time elapsed: 0.926 sec
03-Dec-2021 18:00:57 Running org.openmrs.module.reporting.data.visit.evaluator.OrderForVisitDataEvaluatorTest
03-Dec-2021 18:00:57 Tests run: 2, Failures: 0, Errors: 0, Skipped: 0, Time elapsed: 0.057 sec
03-Dec-2021 18:00:57 Running org.openmrs.module.reporting.report.util.SqlScriptParserTest
03-Dec-2021 18:00:57 Tests run: 4, Failures: 0, Errors: 0, Skipped: 0, Time elapsed: 0.003 sec
03-Dec-2021 18:00:57 Running org.openmrs.module.reporting.definition.library.implementerconfigured.ImplementerConfiguredDataSetDefinitionLibraryTest
03-Dec-2021 18:00:57 Tests run: 3, Failures: 0, Errors: 0, Skipped: 0, Time elapsed: 0.224 sec
03-Dec-2021 18:00:57 Running org.openmrs.module.reporting.cohort.definition.evaluator.PresenceOrAbsenceCohortDefinitionEvaluatorTest
03-Dec-2021 18:00:57 Tests run: 3, Failures: 0, Errors: 0, Skipped: 0, Time elapsed: 0.355 sec
03-Dec-2021 18:00:57 Running org.openmrs.module.reporting.report.definition.service.ReportDefinitionServiceImplTest
03-Dec-2021 18:00:58 Tests run: 2, Failures: 0, Errors: 0, Skipped: 0, Time elapsed: 0.093 sec
03-Dec-2021 18:00:58 Running org.openmrs.module.reporting.data.converter.ObsValueTextAsCodedConverterTest
03-Dec-2021 18:00:58 Tests run: 3, Failures: 0, Errors: 0, Skipped: 0, Time elapsed: 0.024 sec
03-Dec-2021 18:00:58 Running org.openmrs.module.reporting.cohort.definition.service.BaseCohortDefinitionServiceTest
03-Dec-2021 18:00:58 Tests run: 1, Failures: 0, Errors: 0, Skipped: 0, Time elapsed: 0.108 sec
03-Dec-2021 18:00:58 Running org.openmrs.module.reporting.cohort.definition.evaluator.InStateCohortDefinitionEvaluatorTest
03-Dec-2021 18:00:58 Cohort: Cohort id=null size=2
03-Dec-2021 18:00:59 Tests run: 7, Failures: 0, Errors: 0, Skipped: 0, Time elapsed: 0.987 sec
03-Dec-2021 18:00:59 Running org.openmrs.module.reporting.data.patient.evaluator.DefinitionLibraryPatientDataEvaluatorTest
03-Dec-2021 18:00:59 Tests run: 3, Failures: 0, Errors: 0, Skipped: 0, Time elapsed: 0.41 sec
03-Dec-2021 18:00:59 Running org.openmrs.module.reporting.cohort.definition.evaluator.DefinitionLibraryCohortDefinitionEvaluatorTest
03-Dec-2021 18:01:00 Tests run: 3, Failures: 0, Errors: 0, Skipped: 0, Time elapsed: 0.451 sec
03-Dec-2021 18:01:00 Running org.openmrs.module.reporting.dataset.definition.evaluator.CohortsWithVaryingParametersDataSetEvaluatorTest
03-Dec-2021 18:01:00 Tests run: 1, Failures: 0, Errors: 0, Skipped: 0, Time elapsed: 0.163 sec
03-Dec-2021 18:01:00 Running org.openmrs.module.reporting.dataset.definition.evaluator.ObsDataSetEvaluatorTest
03-Dec-2021 18:01:00 Tests run: 1, Failures: 0, Errors: 0, Skipped: 0, Time elapsed: 0.175 sec
03-Dec-2021 18:01:00 Running org.openmrs.module.reporting.data.patient.evaluator.SqlPatientDataEvaluatorTest
03-Dec-2021 18:01:00 Tests run: 1, Failures: 0, Errors: 0, Skipped: 0, Time elapsed: 0.105 sec
03-Dec-2021 18:01:00 Running org.openmrs.module.reporting.data.converter.PrivilegedDataConverterTest
03-Dec-2021 18:01:01 SLF4J: Class path contains multiple SLF4J bindings.
03-Dec-2021 18:01:01 SLF4J: Found binding in [jar:file:/home/bamboo-agent/.m2/repository/org/slf4j/slf4j-log4j12/1.6.0/slf4j-log4j12-1.6.0.jar!/org/slf4j/impl/StaticLoggerBinder.class]
03-Dec-2021 18:01:01 SLF4J: Found binding in [jar:file:/home/bamboo-agent/.m2/repository/org/slf4j/slf4j-log4j12/1.6.0/slf4j-log4j12-1.6.0.jar!/org/slf4j/impl/StaticLoggerBinder.class]
03-Dec-2021 18:01:01 SLF4J: See http://www.slf4j.org/codes.html#multiple_bindings for an explanation.
03-Dec-2021 18:01:02 Tests run: 2, Failures: 0, Errors: 0, Skipped: 0, Time elapsed: 1.849 sec
03-Dec-2021 18:01:02 Running org.openmrs.module.reporting.data.patient.evaluator.PatientCalculationDataEvaluatorTest
03-Dec-2021 18:01:02 ERROR - EvaluationProfiler.log(111) |2021-12-03 18:01:02,475| 1777        2021-12-03 18:01:02.475        >        ERROR        EVALUATING_DEFINITION                        PatientCalculationDataDefinition[Example]: Failed to evaluate No PatientCalculation found on this PatientCalculationDataDefinition
03-Dec-2021 18:01:02 org.openmrs.module.reporting.evaluation.EvaluationException: Failed to evaluate No PatientCalculation found on this PatientCalculationDataDefinition
03-Dec-2021 18:01:02         at org.openmrs.module.reporting.data.patient.evaluator.PatientCalculationDataEvaluator.evaluate(PatientCalculationDataEvaluator.java:50)
03-Dec-2021 18:01:02         at org.openmrs.module.reporting.data.patient.evaluator.PatientCalculationDataEvaluator.evaluate(PatientCalculationDataEvaluator.java:34)
03-Dec-2021 18:01:02         at org.openmrs.module.reporting.definition.service.BaseDefinitionService.executeEvaluator(BaseDefinitionService.java:369)
03-Dec-2021 18:01:02         at org.openmrs.module.reporting.data.patient.service.PatientDataServiceImpl.executeEvaluator(PatientDataServiceImpl.java:66)
03-Dec-2021 18:01:02         at org.openmrs.module.reporting.data.patient.service.PatientDataServiceImpl.executeEvaluator(PatientDataServiceImpl.java:34)
03-Dec-2021 18:01:02         at org.openmrs.module.reporting.definition.service.BaseDefinitionService.evaluateBypassingExclusionOfTestPatients(BaseDefinitionService.java:264)
03-Dec-2021 18:01:02         at org.openmrs.module.reporting.definition.service.BaseDefinitionService.evaluate(BaseDefinitionService.java:229)
03-Dec-2021 18:01:02         at org.openmrs.module.reporting.data.patient.service.PatientDataServiceImpl.evaluate(PatientDataServiceImpl.java:48)
03-Dec-2021 18:01:02         at sun.reflect.GeneratedMethodAccessor837.invoke(Unknown Source)
03-Dec-2021 18:01:02         at sun.reflect.DelegatingMethodAccessorImpl.invoke(DelegatingMethodAccessorImpl.java:43)
03-Dec-2021 18:01:02         at java.lang.reflect.Method.invoke(Method.java:498)
03-Dec-2021 18:01:02         at org.springframework.aop.support.AopUtils.invokeJoinpointUsingReflection(AopUtils.java:317)
03-Dec-2021 18:01:02         at org.springframework.aop.framework.ReflectiveMethodInvocation.invokeJoinpoint(ReflectiveMethodInvocation.java:190)
03-Dec-2021 18:01:02         at org.springframework.aop.framework.ReflectiveMethodInvocation.proceed(ReflectiveMethodInvocation.java:157)
03-Dec-2021 18:01:02         at org.springframework.cache.interceptor.CacheInterceptor$1.invoke(CacheInterceptor.java:52)
03-Dec-2021 18:01:02         at org.springframework.cache.interceptor.CacheAspectSupport.execute(CacheAspectSupport.java:303)
03-Dec-2021 18:01:02         at org.springframework.cache.interceptor.CacheInterceptor.invoke(CacheInterceptor.java:61)
03-Dec-2021 18:01:02         at org.springframework.aop.framework.ReflectiveMethodInvocation.proceed(ReflectiveMethodInvocation.java:179)
03-Dec-2021 18:01:02         at org.openmrs.aop.LoggingAdvice.invoke(LoggingAdvice.java:121)
03-Dec-2021 18:01:02         at org.springframework.aop.framework.ReflectiveMethodInvocation.proceed(ReflectiveMethodInvocation.java:179)
03-Dec-2021 18:01:02         at org.springframework.aop.framework.adapter.MethodBeforeAdviceInterceptor.invoke(MethodBeforeAdviceInterceptor.java:52)
03-Dec-2021 18:01:02         at org.springframework.aop.framework.ReflectiveMethodInvocation.proceed(ReflectiveMethodInvocation.java:179)
03-Dec-2021 18:01:02         at org.springframework.aop.framework.adapter.MethodBeforeAdviceInterceptor.invoke(MethodBeforeAdviceInterceptor.java:52)
03-Dec-2021 18:01:02         at org.springframework.aop.framework.ReflectiveMethodInvocation.proceed(ReflectiveMethodInvocation.java:179)
03-Dec-2021 18:01:02         at org.springframework.aop.framework.JdkDynamicAopProxy.invoke(JdkDynamicAopProxy.java:207)
03-Dec-2021 18:01:02         at com.sun.proxy.$Proxy37.evaluate(Unknown Source)
03-Dec-2021 18:01:02         at sun.reflect.GeneratedMethodAccessor837.invoke(Unknown Source)
03-Dec-2021 18:01:02         at sun.reflect.DelegatingMethodAccessorImpl.invoke(DelegatingMethodAccessorImpl.java:43)
03-Dec-2021 18:01:02         at java.lang.reflect.Method.invoke(Method.java:498)
03-Dec-2021 18:01:02         at org.springframework.aop.support.AopUtils.invokeJoinpointUsingReflection(AopUtils.java:317)
03-Dec-2021 18:01:02         at org.springframework.aop.framework.JdkDynamicAopProxy.invoke(JdkDynamicAopProxy.java:201)
03-Dec-2021 18:01:02         at com.sun.proxy.$Proxy148.evaluate(Unknown Source)
03-Dec-2021 18:01:02         at org.openmrs.module.reporting.data.patient.evaluator.PatientCalculationDataEvaluatorTest.evaluate_shouldThrowAnErrorIfNoCalculationRegistrationExistsOnTheDefinition(PatientCalculationDataEvaluatorTest.java:90)
03-Dec-2021 18:01:02         at sun.reflect.NativeMethodAccessorImpl.invoke0(Native Method)
03-Dec-2021 18:01:02         at sun.reflect.NativeMethodAccessorImpl.invoke(NativeMethodAccessorImpl.java:62)
03-Dec-2021 18:01:02         at sun.reflect.DelegatingMethodAccessorImpl.invoke(DelegatingMethodAccessorImpl.java:43)
03-Dec-2021 18:01:02         at java.lang.reflect.Method.invoke(Method.java:498)
03-Dec-2021 18:01:02         at org.junit.runners.model.FrameworkMethod$1.runReflectiveCall(FrameworkMethod.java:47)
03-Dec-2021 18:01:02         at org.junit.internal.runners.model.ReflectiveCallable.run(ReflectiveCallable.java:12)
03-Dec-2021 18:01:02         at org.junit.runners.model.FrameworkMethod.invokeExplosively(FrameworkMethod.java:44)
03-Dec-2021 18:01:02         at org.junit.internal.runners.statements.InvokeMethod.evaluate(InvokeMethod.java:17)
03-Dec-2021 18:01:02         at org.junit.internal.runners.statements.ExpectException.evaluate(ExpectException.java:19)
03-Dec-2021 18:01:02         at org.junit.internal.runners.statements.RunBefores.evaluate(RunBefores.java:26)
03-Dec-2021 18:01:02         at org.springframework.test.context.junit4.statements.RunBeforeTestMethodCallbacks.evaluate(RunBeforeTestMethodCallbacks.java:73)
03-Dec-2021 18:01:02         at org.junit.internal.runners.statements.RunAfters.evaluate(RunAfters.java:27)
03-Dec-2021 18:01:02         at org.springframework.test.context.junit4.statements.RunAfterTestMethodCallbacks.evaluate(RunAfterTestMethodCallbacks.java:82)
03-Dec-2021 18:01:02         at org.springframework.test.context.junit4.statements.SpringRepeat.evaluate(SpringRepeat.java:73)
03-Dec-2021 18:01:02         at org.junit.runners.ParentRunner.runLeaf(ParentRunner.java:271)
03-Dec-2021 18:01:02         at org.springframework.test.context.junit4.SpringJUnit4ClassRunner.runChild(SpringJUnit4ClassRunner.java:217)
03-Dec-2021 18:01:02         at org.springframework.test.context.junit4.SpringJUnit4ClassRunner.runChild(SpringJUnit4ClassRunner.java:83)
03-Dec-2021 18:01:02         at org.junit.runners.ParentRunner$3.run(ParentRunner.java:238)
03-Dec-2021 18:01:02         at org.junit.runners.ParentRunner$1.schedule(ParentRunner.java:63)
03-Dec-2021 18:01:02         at org.junit.runners.ParentRunner.runChildren(ParentRunner.java:236)
03-Dec-2021 18:01:02         at org.junit.runners.ParentRunner.access$000(ParentRunner.java:53)
03-Dec-2021 18:01:02         at org.junit.runners.ParentRunner$2.evaluate(ParentRunner.java:229)
03-Dec-2021 18:01:02         at org.springframework.test.context.junit4.statements.RunBeforeTestClassCallbacks.evaluate(RunBeforeTestClassCallbacks.java:61)
03-Dec-2021 18:01:02         at org.junit.internal.runners.statements.RunAfters.evaluate(RunAfters.java:27)
03-Dec-2021 18:01:02         at org.springframework.test.context.junit4.statements.RunAfterTestClassCallbacks.evaluate(RunAfterTestClassCallbacks.java:68)
03-Dec-2021 18:01:02         at org.junit.runners.ParentRunner.run(ParentRunner.java:309)
03-Dec-2021 18:01:02         at org.springframework.test.context.junit4.SpringJUnit4ClassRunner.run(SpringJUnit4ClassRunner.java:163)
03-Dec-2021 18:01:02         at org.apache.maven.surefire.junit4.JUnit4TestSet.execute(JUnit4TestSet.java:59)
03-Dec-2021 18:01:02         at org.apache.maven.surefire.suite.AbstractDirectoryTestSuite.executeTestSet(AbstractDirectoryTestSuite.java:115)
03-Dec-2021 18:01:02         at org.apache.maven.surefire.suite.AbstractDirectoryTestSuite.execute(AbstractDirectoryTestSuite.java:102)
03-Dec-2021 18:01:02         at org.apache.maven.surefire.Surefire.run(Surefire.java:180)
03-Dec-2021 18:01:02         at sun.reflect.NativeMethodAccessorImpl.invoke0(Native Method)
03-Dec-2021 18:01:02         at sun.reflect.NativeMethodAccessorImpl.invoke(NativeMethodAccessorImpl.java:62)
03-Dec-2021 18:01:02         at sun.reflect.DelegatingMethodAccessorImpl.invoke(DelegatingMethodAccessorImpl.java:43)
03-Dec-2021 18:01:02         at java.lang.reflect.Method.invoke(Method.java:498)
03-Dec-2021 18:01:02         at org.apache.maven.surefire.booter.SurefireBooter.runSuitesInProcess(SurefireBooter.java:350)
03-Dec-2021 18:01:02         at org.apache.maven.surefire.booter.SurefireBooter.main(SurefireBooter.java:1021)
03-Dec-2021 18:01:02 Tests run: 2, Failures: 0, Errors: 0, Skipped: 0, Time elapsed: 0.288 sec
03-Dec-2021 18:01:02 Running org.openmrs.module.reporting.data.converter.DateConverterTest
03-Dec-2021 18:01:02 Tests run: 1, Failures: 0, Errors: 0, Skipped: 0, Time elapsed: 0.026 sec
03-Dec-2021 18:01:02 Running org.openmrs.module.reporting.dataset.definition.evaluator.EncounterAndObsDataSetEvaluatorTest
03-Dec-2021 18:01:02 Tests run: 1, Failures: 0, Errors: 0, Skipped: 0, Time elapsed: 0.259 sec
03-Dec-2021 18:01:02 Running org.openmrs.module.reporting.data.encounter.evaluator.PatientToEncounterDataEvaluatorTest
03-Dec-2021 18:01:03 Tests run: 3, Failures: 0, Errors: 0, Skipped: 0, Time elapsed: 0.399 sec
03-Dec-2021 18:01:03 Running org.openmrs.module.reporting.data.patient.evaluator.PatientIdDataEvaluatorTest
03-Dec-2021 18:01:03 Tests run: 1, Failures: 0, Errors: 0, Skipped: 0, Time elapsed: 0.183 sec
03-Dec-2021 18:01:03 Running org.openmrs.module.reporting.data.person.evaluator.RelationshipsForPersonDataEvaluatorTest
03-Dec-2021 18:01:04 Tests run: 3, Failures: 0, Errors: 0, Skipped: 0, Time elapsed: 0.506 sec
03-Dec-2021 18:01:04 Running org.openmrs.module.reporting.data.patient.evaluator.PersonToPatientDataEvaluatorTest
03-Dec-2021 18:01:04 Tests run: 1, Failures: 0, Errors: 0, Skipped: 0, Time elapsed: 0.2 sec
03-Dec-2021 18:01:04 Running org.openmrs.module.reporting.data.patient.service.PatientDataServiceImplTest
03-Dec-2021 18:01:05 Tests run: 6, Failures: 0, Errors: 0, Skipped: 0, Time elapsed: 0.836 sec
03-Dec-2021 18:01:05
03-Dec-2021 18:01:05 Results :
03-Dec-2021 18:01:05
03-Dec-2021 18:01:05 Tests run: 732, Failures: 0, Errors: 0, Skipped: 13
03-Dec-2021 18:01:05
03-Dec-2021 18:01:05 [INFO]
03-Dec-2021 18:01:05 [INFO] --- maven-jar-plugin:2.4:jar (default-jar) @ reporting-api-tests ---
03-Dec-2021 18:01:05 [WARNING] JAR will be empty - no content was marked for inclusion!
03-Dec-2021 18:01:05 [INFO] Building jar: /home/bamboo-agent/bamboo-agent/xml-data/build-dir/REP-REP-T2DOT1/api-tests/target/reporting-api-tests-1.24.0-SNAPSHOT.jar
03-Dec-2021 18:01:05 [INFO]
03-Dec-2021 18:01:05 [INFO] --- maven-jar-plugin:2.4:test-jar (default) @ reporting-api-tests ---
03-Dec-2021 18:01:05 [INFO] Building jar: /home/bamboo-agent/bamboo-agent/xml-data/build-dir/REP-REP-T2DOT1/api-tests/target/reporting-api-tests-1.24.0-SNAPSHOT-tests.jar
03-Dec-2021 18:01:06 [INFO]                                                                         
03-Dec-2021 18:01:06 [INFO] ------------------------------------------------------------------------
03-Dec-2021 18:01:06 [INFO] Building reporting Module api 1.10 1.24.0-SNAPSHOT
03-Dec-2021 18:01:06 [INFO] ------------------------------------------------------------------------
03-Dec-2021 18:01:07 [INFO]
03-Dec-2021 18:01:07 [INFO] --- maven-clean-plugin:2.5:clean (default-clean) @ reporting-api-1.10 ---
03-Dec-2021 18:01:07 [INFO]
03-Dec-2021 18:01:07 [INFO] --- maven-resources-plugin:2.6:resources (default-resources) @ reporting-api-1.10 ---
03-Dec-2021 18:01:07 [INFO] Using 'UTF-8' encoding to copy filtered resources.
03-Dec-2021 18:01:07 [INFO] skip non existing resourceDirectory /home/bamboo-agent/bamboo-agent/xml-data/build-dir/REP-REP-T2DOT1/api-1.10/src/main/resources
03-Dec-2021 18:01:07 [INFO]
03-Dec-2021 18:01:07 [INFO] --- maven-compiler-plugin:3.1:compile (default-compile) @ reporting-api-1.10 ---
03-Dec-2021 18:01:07 [INFO] Changes detected - recompiling the module!
03-Dec-2021 18:01:07 [INFO] Compiling 3 source files to /home/bamboo-agent/bamboo-agent/xml-data/build-dir/REP-REP-T2DOT1/api-1.10/target/classes
03-Dec-2021 18:01:10 [INFO]
03-Dec-2021 18:01:10 [INFO] --- build-helper-maven-plugin:1.7:parse-version (default) @ reporting-api-1.10 ---
03-Dec-2021 18:01:10 [INFO]
03-Dec-2021 18:01:10 [INFO] --- maven-resources-plugin:2.6:testResources (default-testResources) @ reporting-api-1.10 ---
03-Dec-2021 18:01:10 [INFO] Using 'UTF-8' encoding to copy filtered resources.
03-Dec-2021 18:01:10 [INFO] Copying 1 resource
03-Dec-2021 18:01:10 [INFO] Copying 0 resource
03-Dec-2021 18:01:10 [INFO]
03-Dec-2021 18:01:10 [INFO] --- maven-compiler-plugin:3.1:testCompile (default-testCompile) @ reporting-api-1.10 ---
03-Dec-2021 18:01:10 [INFO] Changes detected - recompiling the module!
03-Dec-2021 18:01:10 [INFO] Compiling 2 source files to /home/bamboo-agent/bamboo-agent/xml-data/build-dir/REP-REP-T2DOT1/api-1.10/target/test-classes
03-Dec-2021 18:01:11 [WARNING] /home/bamboo-agent/bamboo-agent/xml-data/build-dir/REP-REP-T2DOT1/api-1.10/src/test/java/org/openmrs/module/reporting/cohort/definition/evaluator/DrugOrderCohortDefinitionEvaluatorTest.java: /home/bamboo-agent/bamboo-agent/xml-data/build-dir/REP-REP-T2DOT1/api-1.10/src/test/java/org/openmrs/module/reporting/cohort/definition/evaluator/DrugOrderCohortDefinitionEvaluatorTest.java uses or overrides a deprecated API.
03-Dec-2021 18:01:11 [WARNING] /home/bamboo-agent/bamboo-agent/xml-data/build-dir/REP-REP-T2DOT1/api-1.10/src/test/java/org/openmrs/module/reporting/cohort/definition/evaluator/DrugOrderCohortDefinitionEvaluatorTest.java: Recompile with -Xlint:deprecation for details.
03-Dec-2021 18:01:11 [WARNING] /home/bamboo-agent/bamboo-agent/xml-data/build-dir/REP-REP-T2DOT1/api-1.10/src/test/java/org/openmrs/module/reporting/cohort/definition/evaluator/DrugOrderCohortDefinitionEvaluatorTest.java: /home/bamboo-agent/bamboo-agent/xml-data/build-dir/REP-REP-T2DOT1/api-1.10/src/test/java/org/openmrs/module/reporting/cohort/definition/evaluator/DrugOrderCohortDefinitionEvaluatorTest.java uses unchecked or unsafe operations.
03-Dec-2021 18:01:11 [WARNING] /home/bamboo-agent/bamboo-agent/xml-data/build-dir/REP-REP-T2DOT1/api-1.10/src/test/java/org/openmrs/module/reporting/cohort/definition/evaluator/DrugOrderCohortDefinitionEvaluatorTest.java: Recompile with -Xlint:unchecked for details.
03-Dec-2021 18:01:11 [INFO]
03-Dec-2021 18:01:11 [INFO] --- maven-surefire-plugin:2.5:test (default-test) @ reporting-api-1.10 ---
03-Dec-2021 18:01:11 [INFO] Surefire report directory: /home/bamboo-agent/bamboo-agent/xml-data/build-dir/REP-REP-T2DOT1/api-1.10/target/surefire-reports
03-Dec-2021 18:01:11 OpenJDK 64-Bit Server VM warning: ignoring option MaxPermSize=512m; support was removed in 8.0
03-Dec-2021 18:01:12
03-Dec-2021 18:01:12 -------------------------------------------------------
03-Dec-2021 18:01:12 T E S T S
03-Dec-2021 18:01:12 -------------------------------------------------------
03-Dec-2021 18:01:12 Running org.openmrs.module.reporting.cohort.definition.evaluator.DrugOrderCohortDefinitionEvaluatorTest
03-Dec-2021 18:01:12 log4j:WARN No appenders could be found for logger (org.springframework.test.context.junit4.SpringJUnit4ClassRunner).
03-Dec-2021 18:01:12 log4j:WARN Please initialize the log4j system properly.
03-Dec-2021 18:01:36 Tests run: 18, Failures: 0, Errors: 0, Skipped: 0, Time elapsed: 24.684 sec
03-Dec-2021 18:01:36 Running org.openmrs.module.reporting.cohort.definition.library.BuiltInCohortDefinitionLibrary1_10Test
03-Dec-2021 18:01:36 Tests run: 1, Failures: 0, Errors: 0, Skipped: 0, Time elapsed: 0.014 sec
03-Dec-2021 18:01:36
03-Dec-2021 18:01:36 Results :
03-Dec-2021 18:01:36
03-Dec-2021 18:01:36 Tests run: 19, Failures: 0, Errors: 0, Skipped: 0
03-Dec-2021 18:01:36
03-Dec-2021 18:01:37 [INFO]
03-Dec-2021 18:01:37 [INFO] --- maven-jar-plugin:2.4:jar (default-jar) @ reporting-api-1.10 ---
03-Dec-2021 18:01:37 [INFO] Building jar: /home/bamboo-agent/bamboo-agent/xml-data/build-dir/REP-REP-T2DOT1/api-1.10/target/reporting-api-1.10-1.24.0-SNAPSHOT.jar
03-Dec-2021 18:01:37 [INFO]
03-Dec-2021 18:01:37 [INFO] --- maven-jar-plugin:2.4:test-jar (default) @ reporting-api-1.10 ---
03-Dec-2021 18:01:37 [INFO] Building jar: /home/bamboo-agent/bamboo-agent/xml-data/build-dir/REP-REP-T2DOT1/api-1.10/target/reporting-api-1.10-1.24.0-SNAPSHOT-tests.jar
03-Dec-2021 18:01:37 [INFO]                                                                         
03-Dec-2021 18:01:37 [INFO] ------------------------------------------------------------------------
03-Dec-2021 18:01:37 [INFO] Building reporting Module api 2.2 1.24.0-SNAPSHOT
03-Dec-2021 18:01:37 [INFO] ------------------------------------------------------------------------
03-Dec-2021 18:01:38 [INFO] Downloading: http://mavenrepo.openmrs.org/nexus/content/repositories/public/org/powermock/powermock-module-junit4/1.6.6/powermock-module-junit4-1.6.6.pom
03-Dec-2021 18:01:39 [INFO] Downloaded: http://mavenrepo.openmrs.org/nexus/content/repositories/public/org/powermock/powermock-module-junit4/1.6.6/powermock-module-junit4-1.6.6.pom (2 KB at 1.8 KB/sec)
03-Dec-2021 18:01:39 [INFO] Downloading: http://mavenrepo.openmrs.org/nexus/content/repositories/public/org/powermock/powermock-module-junit4-common/1.6.6/powermock-module-junit4-common-1.6.6.pom
03-Dec-2021 18:01:39 [INFO] Downloaded: http://mavenrepo.openmrs.org/nexus/content/repositories/public/org/powermock/powermock-module-junit4-common/1.6.6/powermock-module-junit4-common-1.6.6.pom (2 KB at 4.7 KB/sec)
03-Dec-2021 18:01:39 [INFO] Downloading: http://mavenrepo.openmrs.org/nexus/content/repositories/public/org/powermock/powermock-core/1.6.6/powermock-core-1.6.6.pom
03-Dec-2021 18:01:39 [INFO] Downloaded: http://mavenrepo.openmrs.org/nexus/content/repositories/public/org/powermock/powermock-core/1.6.6/powermock-core-1.6.6.pom (3 KB at 10.5 KB/sec)
03-Dec-2021 18:01:39 [INFO] Downloading: http://mavenrepo.openmrs.org/nexus/content/repositories/public/org/powermock/powermock-reflect/1.6.6/powermock-reflect-1.6.6.pom
03-Dec-2021 18:01:40 [INFO] Downloaded: http://mavenrepo.openmrs.org/nexus/content/repositories/public/org/powermock/powermock-reflect/1.6.6/powermock-reflect-1.6.6.pom (2 KB at 4.7 KB/sec)
03-Dec-2021 18:01:40 [INFO] Downloading: http://mavenrepo.openmrs.org/nexus/content/repositories/public/org/powermock/powermock-api-mockito/1.6.6/powermock-api-mockito-1.6.6.pom
03-Dec-2021 18:01:40 [INFO] Downloaded: http://mavenrepo.openmrs.org/nexus/content/repositories/public/org/powermock/powermock-api-mockito/1.6.6/powermock-api-mockito-1.6.6.pom (2 KB at 4.7 KB/sec)
03-Dec-2021 18:01:40 [INFO] Downloading: http://mavenrepo.openmrs.org/nexus/content/repositories/public/org/powermock/powermock-api-mockito-common/1.6.6/powermock-api-mockito-common-1.6.6.pom
03-Dec-2021 18:01:40 [INFO] Downloaded: http://mavenrepo.openmrs.org/nexus/content/repositories/public/org/powermock/powermock-api-mockito-common/1.6.6/powermock-api-mockito-common-1.6.6.pom (2 KB at 5.6 KB/sec)
03-Dec-2021 18:01:40 [INFO] Downloading: http://mavenrepo.openmrs.org/nexus/content/repositories/public/org/powermock/powermock-api-support/1.6.6/powermock-api-support-1.6.6.pom
03-Dec-2021 18:01:41 [INFO] Downloaded: http://mavenrepo.openmrs.org/nexus/content/repositories/public/org/powermock/powermock-api-support/1.6.6/powermock-api-support-1.6.6.pom (2 KB at 4.1 KB/sec)
03-Dec-2021 18:01:42 [INFO] Downloading: http://mavenrepo.openmrs.org/nexus/content/repositories/public/org/powermock/powermock-module-junit4/1.6.6/powermock-module-junit4-1.6.6.jar
03-Dec-2021 18:01:42 [INFO] Downloading: http://mavenrepo.openmrs.org/nexus/content/repositories/public/org/powermock/powermock-core/1.6.6/powermock-core-1.6.6.jar
03-Dec-2021 18:01:42 [INFO] Downloading: http://mavenrepo.openmrs.org/nexus/content/repositories/public/org/powermock/powermock-reflect/1.6.6/powermock-reflect-1.6.6.jar
03-Dec-2021 18:01:42 [INFO] Downloading: http://mavenrepo.openmrs.org/nexus/content/repositories/public/org/powermock/powermock-module-junit4-common/1.6.6/powermock-module-junit4-common-1.6.6.jar
03-Dec-2021 18:01:42 [INFO] Downloading: http://mavenrepo.openmrs.org/nexus/content/repositories/public/org/powermock/powermock-api-mockito/1.6.6/powermock-api-mockito-1.6.6.jar
03-Dec-2021 18:01:43 [INFO] Downloaded: http://mavenrepo.openmrs.org/nexus/content/repositories/public/org/powermock/powermock-module-junit4-common/1.6.6/powermock-module-junit4-common-1.6.6.jar (16 KB at 36.3 KB/sec)
03-Dec-2021 18:01:43 [INFO] Downloading: http://mavenrepo.openmrs.org/nexus/content/repositories/public/org/powermock/powermock-api-mockito-common/1.6.6/powermock-api-mockito-common-1.6.6.jar
03-Dec-2021 18:01:43 [INFO] Downloaded: http://mavenrepo.openmrs.org/nexus/content/repositories/public/org/powermock/powermock-api-mockito-common/1.6.6/powermock-api-mockito-common-1.6.6.jar (39 KB at 49.5 KB/sec)
03-Dec-2021 18:01:43 [INFO] Downloading: http://mavenrepo.openmrs.org/nexus/content/repositories/public/org/powermock/powermock-api-support/1.6.6/powermock-api-support-1.6.6.jar
03-Dec-2021 18:01:43 [INFO] Downloaded: http://mavenrepo.openmrs.org/nexus/content/repositories/public/org/powermock/powermock-module-junit4/1.6.6/powermock-module-junit4-1.6.6.jar (45 KB at 49.4 KB/sec)
03-Dec-2021 18:01:43 [INFO] Downloaded: http://mavenrepo.openmrs.org/nexus/content/repositories/public/org/powermock/powermock-reflect/1.6.6/powermock-reflect-1.6.6.jar (59 KB at 61.6 KB/sec)
03-Dec-2021 18:01:43 [INFO] Downloaded: http://mavenrepo.openmrs.org/nexus/content/repositories/public/org/powermock/powermock-api-support/1.6.6/powermock-api-support-1.6.6.jar (21 KB at 19.6 KB/sec)
03-Dec-2021 18:01:44 [INFO] Downloaded: http://mavenrepo.openmrs.org/nexus/content/repositories/public/org/powermock/powermock-core/1.6.6/powermock-core-1.6.6.jar (120 KB at 100.9 KB/sec)
03-Dec-2021 18:01:44 [INFO] Downloaded: http://mavenrepo.openmrs.org/nexus/content/repositories/public/org/powermock/powermock-api-mockito/1.6.6/powermock-api-mockito-1.6.6.jar (80 KB at 67.3 KB/sec)
03-Dec-2021 18:01:44 [INFO]
03-Dec-2021 18:01:44 [INFO] --- maven-clean-plugin:2.5:clean (default-clean) @ reporting-api-2.2 ---
03-Dec-2021 18:01:44 [INFO]
03-Dec-2021 18:01:44 [INFO] --- maven-resources-plugin:2.6:resources (default-resources) @ reporting-api-2.2 ---
03-Dec-2021 18:01:44 [INFO] Using 'UTF-8' encoding to copy filtered resources.
03-Dec-2021 18:01:44 [INFO] skip non existing resourceDirectory /home/bamboo-agent/bamboo-agent/xml-data/build-dir/REP-REP-T2DOT1/api-2.2/src/main/resources
03-Dec-2021 18:01:44 [INFO]
03-Dec-2021 18:01:44 [INFO] --- maven-compiler-plugin:3.1:compile (default-compile) @ reporting-api-2.2 ---
03-Dec-2021 18:01:44 [INFO] Changes detected - recompiling the module!
03-Dec-2021 18:01:44 [INFO] Compiling 3 source files to /home/bamboo-agent/bamboo-agent/xml-data/build-dir/REP-REP-T2DOT1/api-2.2/target/classes
03-Dec-2021 18:01:45 [INFO]
03-Dec-2021 18:01:45 [INFO] --- build-helper-maven-plugin:1.7:parse-version (default) @ reporting-api-2.2 ---
03-Dec-2021 18:01:45 [INFO]
03-Dec-2021 18:01:45 [INFO] --- maven-resources-plugin:2.6:testResources (default-testResources) @ reporting-api-2.2 ---
03-Dec-2021 18:01:45 [INFO] Using 'UTF-8' encoding to copy filtered resources.
03-Dec-2021 18:01:45 [INFO] Copying 1 resource
03-Dec-2021 18:01:45 [INFO] Copying 0 resource
03-Dec-2021 18:01:45 [INFO]
03-Dec-2021 18:01:45 [INFO] --- maven-compiler-plugin:3.1:testCompile (default-testCompile) @ reporting-api-2.2 ---
03-Dec-2021 18:01:45 [INFO] Changes detected - recompiling the module!
03-Dec-2021 18:01:45 [INFO] Compiling 2 source files to /home/bamboo-agent/bamboo-agent/xml-data/build-dir/REP-REP-T2DOT1/api-2.2/target/test-classes
03-Dec-2021 18:01:46 [INFO]
03-Dec-2021 18:01:46 [INFO] --- maven-surefire-plugin:2.5:test (default-test) @ reporting-api-2.2 ---
03-Dec-2021 18:01:46 [INFO] Surefire report directory: /home/bamboo-agent/bamboo-agent/xml-data/build-dir/REP-REP-T2DOT1/api-2.2/target/surefire-reports
03-Dec-2021 18:01:46 OpenJDK 64-Bit Server VM warning: ignoring option MaxPermSize=512m; support was removed in 8.0
03-Dec-2021 18:01:47
03-Dec-2021 18:01:47 -------------------------------------------------------
03-Dec-2021 18:01:47 T E S T S
03-Dec-2021 18:01:47 -------------------------------------------------------
03-Dec-2021 18:01:47 Running org.openmrs.module.reporting.cohort.definition.evaluator.ConditionCohortDefinitionEvaluatorTest
03-Dec-2021 18:01:47 log4j:WARN No appenders could be found for logger (org.springframework.test.context.junit4.SpringJUnit4ClassRunner).
03-Dec-2021 18:01:47 log4j:WARN Please initialize the log4j system properly.
03-Dec-2021 18:02:07 Tests run: 12, Failures: 0, Errors: 0, Skipped: 0, Time elapsed: 19.986 sec
03-Dec-2021 18:02:07 Running org.openmrs.module.reporting.cohort.definition.library.BuiltInCohortDefinitionLibrary2_2Test
03-Dec-2021 18:02:07 Tests run: 1, Failures: 0, Errors: 0, Skipped: 0, Time elapsed: 0.007 sec
03-Dec-2021 18:02:07
03-Dec-2021 18:02:07 Results :
03-Dec-2021 18:02:07
03-Dec-2021 18:02:07 Tests run: 13, Failures: 0, Errors: 0, Skipped: 0
03-Dec-2021 18:02:07
03-Dec-2021 18:02:07 [INFO]
03-Dec-2021 18:02:07 [INFO] --- maven-jar-plugin:2.4:jar (default-jar) @ reporting-api-2.2 ---
03-Dec-2021 18:02:07 [INFO] Building jar: /home/bamboo-agent/bamboo-agent/xml-data/build-dir/REP-REP-T2DOT1/api-2.2/target/reporting-api-2.2-1.24.0-SNAPSHOT.jar
03-Dec-2021 18:02:07 [INFO]
03-Dec-2021 18:02:07 [INFO] --- maven-jar-plugin:2.4:test-jar (default) @ reporting-api-2.2 ---
03-Dec-2021 18:02:07 [INFO] Building jar: /home/bamboo-agent/bamboo-agent/xml-data/build-dir/REP-REP-T2DOT1/api-2.2/target/reporting-api-2.2-1.24.0-SNAPSHOT-tests.jar
03-Dec-2021 18:02:07 [INFO]                                                                         
03-Dec-2021 18:02:07 [INFO] ------------------------------------------------------------------------
03-Dec-2021 18:02:07 [INFO] Building reporting Module api 2.4 1.24.0-SNAPSHOT
03-Dec-2021 18:02:07 [INFO] ------------------------------------------------------------------------
03-Dec-2021 18:02:07 [INFO] Downloading: http://mavenrepo.openmrs.org/nexus/content/repositories/public/org/openmrs/api/openmrs-api/2.4.0/openmrs-api-2.4.0.pom
03-Dec-2021 18:02:07 [INFO] Downloaded: http://mavenrepo.openmrs.org/nexus/content/repositories/public/org/openmrs/api/openmrs-api/2.4.0/openmrs-api-2.4.0.pom (13 KB at 49.4 KB/sec)
03-Dec-2021 18:02:12 [INFO] Downloading: http://mavenrepo.openmrs.org/nexus/content/repositories/public/org/openmrs/test/openmrs-test/2.4.0/openmrs-test-2.4.0.pom
03-Dec-2021 18:02:12 [INFO] Downloaded: http://mavenrepo.openmrs.org/nexus/content/repositories/public/org/openmrs/test/openmrs-test/2.4.0/openmrs-test-2.4.0.pom (3 KB at 10.3 KB/sec)
03-Dec-2021 18:02:14 [INFO] Downloading: http://mavenrepo.openmrs.org/nexus/content/repositories/public/org/openmrs/web/openmrs-web/2.4.0/openmrs-web-2.4.0.pom
03-Dec-2021 18:02:14 [INFO] Downloaded: http://mavenrepo.openmrs.org/nexus/content/repositories/public/org/openmrs/web/openmrs-web/2.4.0/openmrs-web-2.4.0.pom (6 KB at 22.0 KB/sec)
03-Dec-2021 18:02:14 [INFO] Downloading: http://mavenrepo.openmrs.org/nexus/content/repositories/public/org/openmrs/api/openmrs-api/2.4.0/openmrs-api-2.4.0.jar
03-Dec-2021 18:02:14 [INFO] Downloading: http://mavenrepo.openmrs.org/nexus/content/repositories/public/org/openmrs/api/openmrs-api/2.4.0/openmrs-api-2.4.0-tests.jar
03-Dec-2021 18:02:14 [INFO] Downloading: http://mavenrepo.openmrs.org/nexus/content/repositories/public/org/openmrs/web/openmrs-web/2.4.0/openmrs-web-2.4.0.jar
03-Dec-2021 18:02:14 [INFO] Downloading: http://mavenrepo.openmrs.org/nexus/content/repositories/public/org/openmrs/web/openmrs-web/2.4.0/openmrs-web-2.4.0-tests.jar
03-Dec-2021 18:02:15 [INFO] Downloaded: http://mavenrepo.openmrs.org/nexus/content/repositories/public/org/openmrs/web/openmrs-web/2.4.0/openmrs-web-2.4.0-tests.jar (34 KB at 90.9 KB/sec)
03-Dec-2021 18:02:15 [INFO] Downloaded: http://mavenrepo.openmrs.org/nexus/content/repositories/public/org/openmrs/web/openmrs-web/2.4.0/openmrs-web-2.4.0.jar (154 KB at 399.5 KB/sec)
03-Dec-2021 18:02:16 [INFO] Downloaded: http://mavenrepo.openmrs.org/nexus/content/repositories/public/org/openmrs/api/openmrs-api/2.4.0/openmrs-api-2.4.0.jar (2765 KB at 1524.9 KB/sec)
03-Dec-2021 18:02:16 [INFO] Downloaded: http://mavenrepo.openmrs.org/nexus/content/repositories/public/org/openmrs/api/openmrs-api/2.4.0/openmrs-api-2.4.0-tests.jar (2444 KB at 1324.6 KB/sec)
03-Dec-2021 18:02:16 [INFO]
03-Dec-2021 18:02:16 [INFO] --- maven-clean-plugin:2.5:clean (default-clean) @ reporting-api-2.4 ---
03-Dec-2021 18:02:16 [INFO]
03-Dec-2021 18:02:16 [INFO] --- maven-resources-plugin:2.6:resources (default-resources) @ reporting-api-2.4 ---
03-Dec-2021 18:02:16 [INFO] Using 'UTF-8' encoding to copy filtered resources.
03-Dec-2021 18:02:16 [INFO] skip non existing resourceDirectory /home/bamboo-agent/bamboo-agent/xml-data/build-dir/REP-REP-T2DOT1/api-2.4/src/main/resources
03-Dec-2021 18:02:16 [INFO]
03-Dec-2021 18:02:16 [INFO] --- maven-compiler-plugin:3.1:compile (default-compile) @ reporting-api-2.4 ---
03-Dec-2021 18:02:16 [INFO] Changes detected - recompiling the module!
03-Dec-2021 18:02:16 [INFO] Compiling 4 source files to /home/bamboo-agent/bamboo-agent/xml-data/build-dir/REP-REP-T2DOT1/api-2.4/target/classes
03-Dec-2021 18:02:22 [INFO]
03-Dec-2021 18:02:22 [INFO] --- build-helper-maven-plugin:1.7:parse-version (default) @ reporting-api-2.4 ---
03-Dec-2021 18:02:22 [INFO]
03-Dec-2021 18:02:22 [INFO] --- maven-resources-plugin:2.6:testResources (default-testResources) @ reporting-api-2.4 ---
03-Dec-2021 18:02:22 [INFO] Using 'UTF-8' encoding to copy filtered resources.
03-Dec-2021 18:02:22 [INFO] skip non existing resourceDirectory /home/bamboo-agent/bamboo-agent/xml-data/build-dir/REP-REP-T2DOT1/api-2.4/src/test/resources
03-Dec-2021 18:02:22 [INFO] skip non existing resourceDirectory /home/bamboo-agent/bamboo-agent/xml-data/build-dir/REP-REP-T2DOT1/api-2.4/src/test/resources
03-Dec-2021 18:02:22 [INFO]
03-Dec-2021 18:02:22 [INFO] --- maven-compiler-plugin:3.1:testCompile (default-testCompile) @ reporting-api-2.4 ---
03-Dec-2021 18:02:22 [INFO] No sources to compile
03-Dec-2021 18:02:22 [INFO]
03-Dec-2021 18:02:22 [INFO] --- maven-surefire-plugin:2.5:test (default-test) @ reporting-api-2.4 ---
03-Dec-2021 18:02:22 [INFO] No tests to run.
03-Dec-2021 18:02:22 [INFO]
03-Dec-2021 18:02:22 [INFO] --- maven-jar-plugin:2.4:jar (default-jar) @ reporting-api-2.4 ---
03-Dec-2021 18:02:22 [INFO] Building jar: /home/bamboo-agent/bamboo-agent/xml-data/build-dir/REP-REP-T2DOT1/api-2.4/target/reporting-api-2.4-1.24.0-SNAPSHOT.jar
03-Dec-2021 18:02:22 [INFO]
03-Dec-2021 18:02:22 [INFO] --- maven-jar-plugin:2.4:test-jar (default) @ reporting-api-2.4 ---
03-Dec-2021 18:02:22 [WARNING] JAR will be empty - no content was marked for inclusion!
03-Dec-2021 18:02:22 [INFO] Building jar: /home/bamboo-agent/bamboo-agent/xml-data/build-dir/REP-REP-T2DOT1/api-2.4/target/reporting-api-2.4-1.24.0-SNAPSHOT-tests.jar
03-Dec-2021 18:02:22 [INFO]                                                                         
03-Dec-2021 18:02:22 [INFO] ------------------------------------------------------------------------
03-Dec-2021 18:02:22 [INFO] Building Reporting OMOD 1.24.0-SNAPSHOT
03-Dec-2021 18:02:22 [INFO] ------------------------------------------------------------------------
03-Dec-2021 18:02:23 [INFO]
03-Dec-2021 18:02:23 [INFO] --- maven-clean-plugin:2.5:clean (default-clean) @ reporting-omod ---
03-Dec-2021 18:02:23 [INFO]
03-Dec-2021 18:02:23 [INFO] --- maven-openmrs-plugin:1.0.1:initialize-module (init) @ reporting-omod ---
03-Dec-2021 18:02:23 [INFO]
03-Dec-2021 18:02:23 [INFO] --- maven-dependency-plugin:2.8:unpack-dependencies (Expand resources) @ reporting-omod ---
03-Dec-2021 18:02:27 [INFO] Unpacking /home/bamboo-agent/bamboo-agent/xml-data/build-dir/REP-REP-T2DOT1/api/target/reporting-api-1.24.0-SNAPSHOT.jar to /home/bamboo-agent/bamboo-agent/xml-data/build-dir/REP-REP-T2DOT1/omod/target/classes with includes "**\/*.xml,**\/*.properties" and excludes ""
03-Dec-2021 18:02:27 [INFO]
03-Dec-2021 18:02:27 [INFO] --- maven-resources-plugin:2.6:resources (default-resources) @ reporting-omod ---
03-Dec-2021 18:02:27 [INFO] Using 'UTF-8' encoding to copy filtered resources.
03-Dec-2021 18:02:27 [INFO] Copying 0 resource
03-Dec-2021 18:02:27 [INFO] Copying 2 resources
03-Dec-2021 18:02:27 [INFO] Copying 224 resources to web/module
03-Dec-2021 18:02:29 [INFO] Copying 224 resources to web/module
03-Dec-2021 18:02:29 [INFO]
03-Dec-2021 18:02:29 [INFO] --- maven-compiler-plugin:3.1:compile (default-compile) @ reporting-omod ---
03-Dec-2021 18:02:30 [INFO] Changes detected - recompiling the module!
03-Dec-2021 18:02:30 [INFO] Compiling 113 source files to /home/bamboo-agent/bamboo-agent/xml-data/build-dir/REP-REP-T2DOT1/omod/target/classes
03-Dec-2021 18:02:33 [WARNING] /home/bamboo-agent/bamboo-agent/xml-data/build-dir/REP-REP-T2DOT1/omod/src/main/java/org/openmrs/module/reporting/web/controller/mapping/LogicDataSetDefinitionMappingHandler.java: Some input files use or override a deprecated API.
03-Dec-2021 18:02:33 [WARNING] /home/bamboo-agent/bamboo-agent/xml-data/build-dir/REP-REP-T2DOT1/omod/src/main/java/org/openmrs/module/reporting/web/controller/mapping/LogicDataSetDefinitionMappingHandler.java: Recompile with -Xlint:deprecation for details.
03-Dec-2021 18:02:33 [WARNING] /home/bamboo-agent/bamboo-agent/xml-data/build-dir/REP-REP-T2DOT1/omod/src/main/java/org/openmrs/module/reporting/web/datasets/PatientDataSetEditor.java: Some input files use unchecked or unsafe operations.
03-Dec-2021 18:02:33 [WARNING] /home/bamboo-agent/bamboo-agent/xml-data/build-dir/REP-REP-T2DOT1/omod/src/main/java/org/openmrs/module/reporting/web/datasets/PatientDataSetEditor.java: Recompile with -Xlint:unchecked for details.
03-Dec-2021 18:02:33 [INFO]
03-Dec-2021 18:02:33 [INFO] --- build-helper-maven-plugin:1.7:parse-version (default) @ reporting-omod ---
03-Dec-2021 18:02:33 [INFO]
03-Dec-2021 18:02:33 [INFO] --- maven-resources-plugin:2.6:testResources (default-testResources) @ reporting-omod ---
03-Dec-2021 18:02:33 [INFO] Using 'UTF-8' encoding to copy filtered resources.
03-Dec-2021 18:02:33 [INFO] skip non existing resourceDirectory /home/bamboo-agent/bamboo-agent/xml-data/build-dir/REP-REP-T2DOT1/omod/src/test/resources
03-Dec-2021 18:02:33 [INFO] skip non existing resourceDirectory /home/bamboo-agent/bamboo-agent/xml-data/build-dir/REP-REP-T2DOT1/omod/src/test/resources
03-Dec-2021 18:02:33 [INFO]
03-Dec-2021 18:02:33 [INFO] --- maven-compiler-plugin:3.1:testCompile (default-testCompile) @ reporting-omod ---
03-Dec-2021 18:02:33 [INFO] No sources to compile
03-Dec-2021 18:02:33 [INFO]
03-Dec-2021 18:02:33 [INFO] --- maven-surefire-plugin:2.5:test (default-test) @ reporting-omod ---
03-Dec-2021 18:02:33 [INFO] No tests to run.
03-Dec-2021 18:02:33 [INFO]
03-Dec-2021 18:02:33 [INFO] --- maven-jar-plugin:2.4:jar (default-jar) @ reporting-omod ---
03-Dec-2021 18:02:34 [INFO] Building jar: /home/bamboo-agent/bamboo-agent/xml-data/build-dir/REP-REP-T2DOT1/omod/target/reporting-1.24.0-SNAPSHOT.jar
03-Dec-2021 18:02:34 [INFO]
03-Dec-2021 18:02:34 [INFO] --- maven-openmrs-plugin:1.0.1:package-module (pack) @ reporting-omod ---
03-Dec-2021 18:02:34 [INFO] Packaging OpenMRS module
03-Dec-2021 18:02:35 [INFO] Building jar: /home/bamboo-agent/bamboo-agent/xml-data/build-dir/REP-REP-T2DOT1/omod/target/reporting-1.24.0-SNAPSHOT.omod
03-Dec-2021 18:02:35 [INFO]
03-Dec-2021 18:02:35 [INFO] --- maven-jar-plugin:2.4:test-jar (default) @ reporting-omod ---
03-Dec-2021 18:02:35 [WARNING] JAR will be empty - no content was marked for inclusion!
03-Dec-2021 18:02:35 [INFO] Building jar: /home/bamboo-agent/bamboo-agent/xml-data/build-dir/REP-REP-T2DOT1/omod/target/reporting-1.24.0-SNAPSHOT-tests.jar
03-Dec-2021 18:02:35 [INFO] ------------------------------------------------------------------------
03-Dec-2021 18:02:35 [INFO] Reactor Summary:
03-Dec-2021 18:02:35 [INFO]
03-Dec-2021 18:02:35 [INFO] Reporting .......................................... SUCCESS [  6.241 s]
03-Dec-2021 18:02:35 [INFO] Reporting API ...................................... SUCCESS [ 25.740 s]
03-Dec-2021 18:02:35 [INFO] reporting Module api 1.9 ........................... SUCCESS [  3.645 s]
03-Dec-2021 18:02:35 [INFO] reporting Module api 2.0 ........................... SUCCESS [  1.219 s]
03-Dec-2021 18:02:35 [INFO] reporting API Tests ................................ SUCCESS [02:02 min]
03-Dec-2021 18:02:35 [INFO] reporting Module api 1.10 .......................... SUCCESS [ 31.273 s]
03-Dec-2021 18:02:35 [INFO] reporting Module api 2.2 ........................... SUCCESS [ 30.112 s]
03-Dec-2021 18:02:35 [INFO] reporting Module api 2.4 ........................... SUCCESS [ 15.330 s]
03-Dec-2021 18:02:35 [INFO] Reporting OMOD ..................................... SUCCESS [ 13.164 s]
03-Dec-2021 18:02:35 [INFO] ------------------------------------------------------------------------
03-Dec-2021 18:02:35 [INFO] BUILD SUCCESS
03-Dec-2021 18:02:35 [INFO] ------------------------------------------------------------------------
03-Dec-2021 18:02:35 [INFO] Total time: 04:10 min
03-Dec-2021 18:02:35 [INFO] Finished at: 2021-12-03T18:02:35+00:00
03-Dec-2021 18:02:36 [INFO] Final Memory: 75M/434M
03-Dec-2021 18:02:36 [INFO] ------------------------------------------------------------------------
03-Dec-2021 18:02:36 Parsing test results under /home/bamboo-agent/bamboo-agent/xml-data/build-dir/REP-REP-T2DOT1...
03-Dec-2021 18:02:36 Finished task 'Maven 3.x' with result: Success
03-Dec-2021 18:02:36 Running post build plugin 'Docker Container Cleanup'
03-Dec-2021 18:02:37 Running post build plugin 'NCover Results Collector'
03-Dec-2021 18:02:37 Running post build plugin 'Clover Results Collector'
03-Dec-2021 18:02:37 Running post build plugin 'Sauce OnDemand Post Runner'
03-Dec-2021 18:02:37 Running post build plugin 'npm Cache Cleanup'
03-Dec-2021 18:02:37 Running post build plugin 'Artifact Copier'
03-Dec-2021 18:02:37 Finalising the build...
03-Dec-2021 18:02:37 Stopping timer.
03-Dec-2021 18:02:37 Build REP-REP-T2DOT1-884 completed.
03-Dec-2021 18:02:37 Running on server: post build plugin 'NCover Results Collector'
03-Dec-2021 18:02:37 Running on server: post build plugin 'Build Hanging Detection Configuration'
03-Dec-2021 18:02:37 Running on server: post build plugin 'Clover Delta Calculator'
03-Dec-2021 18:02:37 Running on server: post build plugin 'Maven Dependencies Postprocessor'
03-Dec-2021 18:02:37 All post build plugins have finished
03-Dec-2021 18:02:37 Generating build results summary...
03-Dec-2021 18:02:38 Saving build results to disk...
03-Dec-2021 18:02:38 Logging substituted variables...
03-Dec-2021 18:02:38 Indexing build results...
03-Dec-2021 18:02:38 Finished building REP-REP-T2DOT1-884.