Builds and runs unit tests. More details of the release in https://wiki.openmrs.org/x/i4DTAw

Build: #76 failed

Job: Default Job failed

Stages & jobs

  1. Default Stage

Job result summary

Completed
Duration
3 minutes
Revision
682099b20742976b764d96231e3ccaa3f4ec89b1 682099b20742976b764d96231e3ccaa3f4ec89b1
Total tests
570
Fixed in
#95 (Code changes detected)

Tests

  • 570 tests in total
  • 1 test failed
  • 1 failure is new
  • 2 minutes taken in total.
New test failures 1
Status Test Duration
Collapse Failed DelegatingCrudResourceTest org.openmrs.module.webservices.rest.web.DelegatingCrudResourceTest History
< 1 sec
org.openmrs.api.APIException: contextDAO is null
	at org.openmrs.api.context.Context.getContextDAO(Context.java:167)
	at org.openmrs.api.context.Context.closeSession(Context.java:732)
	at org.openmrs.test.BaseContextSensitiveTest.closeSessionAfterEachClass(BaseContextSensitiveTest.java:710)
	at sun.reflect.NativeMethodAccessorImpl.invoke0(Native Method)
	at sun.reflect.NativeMethodAccessorImpl.invoke(NativeMethodAccessorImpl.java:57)
	at sun.reflect.DelegatingMethodAccessorImpl.invoke(DelegatingMethodAccessorImpl.java:43)
	at java.lang.reflect.Method.invoke(Method.java:622)
(19 more lines...)

Error summary

The build generated some errors. See the full build log for more details.

[INFO] ------------------------------------------------------------------------
[ERROR] BUILD FAILURE
[INFO] ------------------------------------------------------------------------
[INFO] There are test failures.

Please refer to /opt/bamboo-agent/agent1-home/xml-data/build-dir/RESTWS-RESTWS-JOB1/omod-1.8/target/surefire-reports for the individual test results.
[INFO] ------------------------------------------------------------------------
[INFO] For more information, run Maven with the -e switch