Sonar metrics for OpenMRS Core Master

Build: #115 failed Manual run by Rafal Korytkowski

Build result summary

Details

Completed
Duration
96 minutes
Labels
None
Revision
2f2e21e895e7e5cf2e2d8a1bcc1bc5ec228e3607 2f2e21e895e7e5cf2e2d8a1bcc1bc5ec228e3607
Total tests
2648
Fixed in
#117 (Manual run by Rafal Korytkowski)

Tests

Code commits

Author Commit Message Commit date
Rafal Korytkowski Rafal Korytkowski 2f2e21e895e7e5cf2e2d8a1bcc1bc5ec228e3607 2f2e21e895e7e5cf2e2d8a1bcc1bc5ec228e3607 Merge pull request #553 from lrozanski/TRUNK-4225
TRUNK-4225: SonarQube - Avoid Catching Throwable[d31bfa5_BAM_file_list]
[d31bfa5_BAM_hash]cbd72b476f00e12582a5dc04c4aa33dc19cd95bf
[d31bfa5_BAM_commiter_name]Rafal Korytkowski
[d31bfa5_BAM_commiter_email]rafal@openmrs.org
[d31bfa5_BAM_timestamp]1389971120
[d31bfa5_BAM_commit_message]Merge pull request #554 from kkaczmarczyk/TRUNK-4224
TRUNK-4224 SonarQube - method invokes inefficient Number constructor; use static valueOf instead[d31bfa5_BAM_file_list]
[d31bfa5_BAM_hash]52b19b83c52de30847c43dce09f8d5c51c94d2ec
[d31bfa5_BAM_commiter_name]Krzysztof Kaczmarczyk
[d31bfa5_BAM_commiter_email]kkaczmarczyk@soldevelo.com
[d31bfa5_BAM_timestamp]1389967963
[d31bfa5_BAM_commit_message]TRUNK-4224 SonarQube - method invokes inefficient Number constructor; use static valueOf instead
Lech Rozanski <lrozanski@soldevelo.com> Lech Rozanski <lrozanski@soldevelo.com> cd1f18393b7ce804efa343d7d1e2a1e1c3d0eced cd1f18393b7ce804efa343d7d1e2a1e1c3d0eced TRUNK-4225: SonarQube - Avoid Catching Throwable
Daniel Kayiwa Daniel Kayiwa edb4b985654cf0fb7912cad755483a0c6caaa81d edb4b985654cf0fb7912cad755483a0c6caaa81d Merge pull request #542 from tadeitto/TRUNK-3283
TRUNK-3283 Add observation to an encounter: the field person can be over...[d31bfa5_BAM_file_list]
[d31bfa5_BAM_hash]2d2b4b8aeb18d4a985b370de0e572488bde4452a
[d31bfa5_BAM_commiter_name]dkayiwa
[d31bfa5_BAM_commiter_email]dkayiwa@openmrs.org
[d31bfa5_BAM_timestamp]1389961655
[d31bfa5_BAM_commit_message]Merge pull request #549 from lrozanski/TRUNK-3898-master
TRUNK-3898: Retired and hidden ConceptMapTypes should be at the end of the list[d31bfa5_BAM_file_list]
[d31bfa5_BAM_hash]f2d99ca3f3ec8c7afea99bbe60d7d402cbaf7414
[d31bfa5_BAM_commiter_name]Lech Rozanski
[d31bfa5_BAM_commiter_email]lrozanski@soldevelo.com
[d31bfa5_BAM_timestamp]1389952517
[d31bfa5_BAM_commit_message]TRUNK-3898: Retired and hidden ConceptMapTypes should be at the end of the list
Daniel Kayiwa Daniel Kayiwa 64a87aa12d7fcddd6199e773f2c89b16fb44495a 64a87aa12d7fcddd6199e773f2c89b16fb44495a Merge pull request #540 from dszafranek/TRUNK-4216
TRUNK-4216 - Equals method should not assume anything about the type of its argument[d31bfa5_BAM_file_list]
[d31bfa5_BAM_hash]0ed421cdd24e8e17d6b98d7498839de5ea18159c
[d31bfa5_BAM_commiter_name]dkayiwa
[d31bfa5_BAM_commiter_email]dkayiwa@openmrs.org
[d31bfa5_BAM_timestamp]1389898730
[d31bfa5_BAM_commit_message]Merge pull request #544 from dkithmal/TRUNK-2218
TRUNK-2218: remove missed direct method calls[d31bfa5_BAM_file_list]
[d31bfa5_BAM_hash]e6cc36f475131cea791b3062a2055d1db215014f
[d31bfa5_BAM_commiter_name]dkithmal
[d31bfa5_BAM_commiter_email]dkithmalfit@gmail.com
[d31bfa5_BAM_timestamp]1389898432
[d31bfa5_BAM_commit_message]TRUNK-2218: remove missed direct method calls
tadeitto <pgierszewski@soldevelo.com> tadeitto <pgierszewski@soldevelo.com> 1c516a687862c405c099120f9bd52e594c144446 1c516a687862c405c099120f9bd52e594c144446 TRUNK-3283 Add observation to an encounter: the field person can be overwritten, and it leads to inconsistent behaviour after saving

Configuration changes

Some of the jobs or stages referenced by this result no longer exist.

Tests

New test failures 234
Status Test View job Duration
Collapse Failed SchedulerFormControllerTest onSubmit_shouldNotRescheduleAnExecutingTask History
Sonar Full Analysis < 1 sec
org.dbunit.dataset.NoSuchTableException: person
	at org.dbunit.database.DatabaseDataSet.getTableMetaData(DatabaseDataSet.java:282)
	at org.dbunit.operation.AbstractOperation.getOperationMetaData(AbstractOperation.java:80)
	at org.dbunit.operation.RefreshOperation.execute(RefreshOperation.java:98)
	at org.openmrs.test.BaseContextSensitiveTest.executeDataSet(BaseContextSensitiveTest.java:682)
	at org.openmrs.test.BaseContextSensitiveTest.executeDataSet(BaseContextSensitiveTest.java:577)
	at org.openmrs.test.BaseContextSensitiveTest.initializeInMemoryDatabase(BaseContextSensitiveTest.java:489)
	at org.openmrs.test.BaseContextSensitiveTest.baseSetupWithStandardDataAndAuthentication(BaseContextSensitiveTest.java:778)
(33 more lines...)
Collapse Failed SchedulerFormControllerTest onSubmit_shouldRescheduleACurrentlyScheduledTask History
Sonar Full Analysis 2 secs
org.dbunit.dataset.NoSuchTableException: person
	at org.dbunit.database.DatabaseDataSet.getTableMetaData(DatabaseDataSet.java:282)
	at org.dbunit.operation.AbstractOperation.getOperationMetaData(AbstractOperation.java:80)
	at org.dbunit.operation.RefreshOperation.execute(RefreshOperation.java:98)
	at org.openmrs.test.BaseContextSensitiveTest.executeDataSet(BaseContextSensitiveTest.java:682)
	at org.openmrs.test.BaseContextSensitiveTest.executeDataSet(BaseContextSensitiveTest.java:577)
	at org.openmrs.test.BaseContextSensitiveTest.initializeInMemoryDatabase(BaseContextSensitiveTest.java:489)
	at org.openmrs.test.BaseContextSensitiveTest.baseSetupWithStandardDataAndAuthentication(BaseContextSensitiveTest.java:778)
(33 more lines...)
Collapse Failed SchedulerFormControllerTest onSubmit_shouldNotRescheduleATaskThatIsNotCurrentlyScheduled History
Sonar Full Analysis < 1 sec
org.dbunit.dataset.NoSuchTableException: person
	at org.dbunit.database.DatabaseDataSet.getTableMetaData(DatabaseDataSet.java:282)
	at org.dbunit.operation.AbstractOperation.getOperationMetaData(AbstractOperation.java:80)
	at org.dbunit.operation.RefreshOperation.execute(RefreshOperation.java:98)
	at org.openmrs.test.BaseContextSensitiveTest.executeDataSet(BaseContextSensitiveTest.java:682)
	at org.openmrs.test.BaseContextSensitiveTest.executeDataSet(BaseContextSensitiveTest.java:577)
	at org.openmrs.test.BaseContextSensitiveTest.initializeInMemoryDatabase(BaseContextSensitiveTest.java:489)
	at org.openmrs.test.BaseContextSensitiveTest.baseSetupWithStandardDataAndAuthentication(BaseContextSensitiveTest.java:778)
(33 more lines...)
Collapse Failed SchedulerFormTest addANewTaskShouldNotError History
Sonar Full Analysis 3 secs
org.dbunit.dataset.NoSuchTableException: person
	at org.dbunit.database.DatabaseDataSet.getTableMetaData(DatabaseDataSet.java:282)
	at org.dbunit.operation.AbstractOperation.getOperationMetaData(AbstractOperation.java:80)
	at org.dbunit.operation.RefreshOperation.execute(RefreshOperation.java:98)
	at org.openmrs.test.BaseContextSensitiveTest.executeDataSet(BaseContextSensitiveTest.java:682)
	at org.openmrs.test.BaseContextSensitiveTest.executeDataSet(BaseContextSensitiveTest.java:577)
	at org.openmrs.test.BaseContextSensitiveTest.initializeInMemoryDatabase(BaseContextSensitiveTest.java:489)
	at org.openmrs.test.BaseContextSensitiveTest.baseSetupWithStandardDataAndAuthentication(BaseContextSensitiveTest.java:778)
(33 more lines...)
Collapse Failed TaskHelperTest waitUntilTaskIsExecuting_shouldRaiseATimeoutExceptionWhenTheTimeoutIsExceeded History
Sonar Full Analysis < 1 sec
org.dbunit.dataset.NoSuchTableException: person
	at org.dbunit.database.DatabaseDataSet.getTableMetaData(DatabaseDataSet.java:282)
	at org.dbunit.operation.AbstractOperation.getOperationMetaData(AbstractOperation.java:80)
	at org.dbunit.operation.RefreshOperation.execute(RefreshOperation.java:98)
	at org.openmrs.test.BaseContextSensitiveTest.executeDataSet(BaseContextSensitiveTest.java:682)
	at org.openmrs.test.BaseContextSensitiveTest.executeDataSet(BaseContextSensitiveTest.java:577)
	at org.openmrs.test.BaseContextSensitiveTest.initializeInMemoryDatabase(BaseContextSensitiveTest.java:489)
	at org.openmrs.test.BaseContextSensitiveTest.baseSetupWithStandardDataAndAuthentication(BaseContextSensitiveTest.java:778)
(33 more lines...)
Collapse Failed TaskHelperTest getTime_shouldGetATimeInTheFuture History
Sonar Full Analysis < 1 sec
org.dbunit.dataset.NoSuchTableException: person
	at org.dbunit.database.DatabaseDataSet.getTableMetaData(DatabaseDataSet.java:282)
	at org.dbunit.operation.AbstractOperation.getOperationMetaData(AbstractOperation.java:80)
	at org.dbunit.operation.RefreshOperation.execute(RefreshOperation.java:98)
	at org.openmrs.test.BaseContextSensitiveTest.executeDataSet(BaseContextSensitiveTest.java:682)
	at org.openmrs.test.BaseContextSensitiveTest.executeDataSet(BaseContextSensitiveTest.java:577)
	at org.openmrs.test.BaseContextSensitiveTest.initializeInMemoryDatabase(BaseContextSensitiveTest.java:489)
	at org.openmrs.test.BaseContextSensitiveTest.baseSetupWithStandardDataAndAuthentication(BaseContextSensitiveTest.java:778)
(33 more lines...)
Collapse Failed TaskHelperTest getUnscheduledTaskDefinition_shouldReturnATaskThatHasNotBeenStarted History
Sonar Full Analysis < 1 sec
org.dbunit.dataset.NoSuchTableException: person
	at org.dbunit.database.DatabaseDataSet.getTableMetaData(DatabaseDataSet.java:282)
	at org.dbunit.operation.AbstractOperation.getOperationMetaData(AbstractOperation.java:80)
	at org.dbunit.operation.RefreshOperation.execute(RefreshOperation.java:98)
	at org.openmrs.test.BaseContextSensitiveTest.executeDataSet(BaseContextSensitiveTest.java:682)
	at org.openmrs.test.BaseContextSensitiveTest.executeDataSet(BaseContextSensitiveTest.java:577)
	at org.openmrs.test.BaseContextSensitiveTest.initializeInMemoryDatabase(BaseContextSensitiveTest.java:489)
	at org.openmrs.test.BaseContextSensitiveTest.baseSetupWithStandardDataAndAuthentication(BaseContextSensitiveTest.java:778)
(33 more lines...)
Collapse Failed TaskHelperTest getTime_shouldGetATimeInThePast History
Sonar Full Analysis < 1 sec
org.dbunit.dataset.NoSuchTableException: person
	at org.dbunit.database.DatabaseDataSet.getTableMetaData(DatabaseDataSet.java:282)
	at org.dbunit.operation.AbstractOperation.getOperationMetaData(AbstractOperation.java:80)
	at org.dbunit.operation.RefreshOperation.execute(RefreshOperation.java:98)
	at org.openmrs.test.BaseContextSensitiveTest.executeDataSet(BaseContextSensitiveTest.java:682)
	at org.openmrs.test.BaseContextSensitiveTest.executeDataSet(BaseContextSensitiveTest.java:577)
	at org.openmrs.test.BaseContextSensitiveTest.initializeInMemoryDatabase(BaseContextSensitiveTest.java:489)
	at org.openmrs.test.BaseContextSensitiveTest.baseSetupWithStandardDataAndAuthentication(BaseContextSensitiveTest.java:778)
(33 more lines...)
Collapse Failed TaskHelperTest getScheduledTaskDefinition_shouldReturnATaskThatHasBeenStarted History
Sonar Full Analysis < 1 sec
org.dbunit.dataset.NoSuchTableException: person
	at org.dbunit.database.DatabaseDataSet.getTableMetaData(DatabaseDataSet.java:282)
	at org.dbunit.operation.AbstractOperation.getOperationMetaData(AbstractOperation.java:80)
	at org.dbunit.operation.RefreshOperation.execute(RefreshOperation.java:98)
	at org.openmrs.test.BaseContextSensitiveTest.executeDataSet(BaseContextSensitiveTest.java:682)
	at org.openmrs.test.BaseContextSensitiveTest.executeDataSet(BaseContextSensitiveTest.java:577)
	at org.openmrs.test.BaseContextSensitiveTest.initializeInMemoryDatabase(BaseContextSensitiveTest.java:489)
	at org.openmrs.test.BaseContextSensitiveTest.baseSetupWithStandardDataAndAuthentication(BaseContextSensitiveTest.java:778)
(33 more lines...)
Collapse Failed TaskHelperTest waitUntilTaskIsExecuting_shouldWaitUntilTaskIsExecuting History
Sonar Full Analysis < 1 sec
org.dbunit.dataset.NoSuchTableException: person
	at org.dbunit.database.DatabaseDataSet.getTableMetaData(DatabaseDataSet.java:282)
	at org.dbunit.operation.AbstractOperation.getOperationMetaData(AbstractOperation.java:80)
	at org.dbunit.operation.RefreshOperation.execute(RefreshOperation.java:98)
	at org.openmrs.test.BaseContextSensitiveTest.executeDataSet(BaseContextSensitiveTest.java:682)
	at org.openmrs.test.BaseContextSensitiveTest.executeDataSet(BaseContextSensitiveTest.java:577)
	at org.openmrs.test.BaseContextSensitiveTest.initializeInMemoryDatabase(BaseContextSensitiveTest.java:489)
	at org.openmrs.test.BaseContextSensitiveTest.baseSetupWithStandardDataAndAuthentication(BaseContextSensitiveTest.java:778)
(33 more lines...)
Collapse Failed ForgotPasswordFormControllerTest shouldNotAuthenticateAsUserWithValidSecretQuestion History
Sonar Full Analysis < 1 sec
org.dbunit.dataset.NoSuchTableException: person
	at org.dbunit.database.DatabaseDataSet.getTableMetaData(DatabaseDataSet.java:282)
	at org.dbunit.operation.AbstractOperation.getOperationMetaData(AbstractOperation.java:80)
	at org.dbunit.operation.RefreshOperation.execute(RefreshOperation.java:98)
	at org.openmrs.test.BaseContextSensitiveTest.executeDataSet(BaseContextSensitiveTest.java:682)
	at org.openmrs.test.BaseContextSensitiveTest.executeDataSet(BaseContextSensitiveTest.java:577)
	at org.openmrs.test.BaseContextSensitiveTest.initializeInMemoryDatabase(BaseContextSensitiveTest.java:489)
	at org.openmrs.test.BaseContextSensitiveTest.baseSetupWithStandardDataAndAuthentication(BaseContextSensitiveTest.java:778)
(34 more lines...)
Collapse Failed ForgotPasswordFormControllerTest shouldLoadPageNormallyWithNoInput History
Sonar Full Analysis < 1 sec
org.dbunit.dataset.NoSuchTableException: person
	at org.dbunit.database.DatabaseDataSet.getTableMetaData(DatabaseDataSet.java:282)
	at org.dbunit.operation.AbstractOperation.getOperationMetaData(AbstractOperation.java:80)
	at org.dbunit.operation.RefreshOperation.execute(RefreshOperation.java:98)
	at org.openmrs.test.BaseContextSensitiveTest.executeDataSet(BaseContextSensitiveTest.java:682)
	at org.openmrs.test.BaseContextSensitiveTest.executeDataSet(BaseContextSensitiveTest.java:577)
	at org.openmrs.test.BaseContextSensitiveTest.initializeInMemoryDatabase(BaseContextSensitiveTest.java:489)
	at org.openmrs.test.BaseContextSensitiveTest.baseSetupWithStandardDataAndAuthentication(BaseContextSensitiveTest.java:778)
(34 more lines...)
Collapse Failed ForgotPasswordFormControllerTest shouldAuthenticateAsUserWithValidSecretQuestion History
Sonar Full Analysis 1 sec
org.dbunit.dataset.NoSuchTableException: person
	at org.dbunit.database.DatabaseDataSet.getTableMetaData(DatabaseDataSet.java:282)
	at org.dbunit.operation.AbstractOperation.getOperationMetaData(AbstractOperation.java:80)
	at org.dbunit.operation.RefreshOperation.execute(RefreshOperation.java:98)
	at org.openmrs.test.BaseContextSensitiveTest.executeDataSet(BaseContextSensitiveTest.java:682)
	at org.openmrs.test.BaseContextSensitiveTest.executeDataSet(BaseContextSensitiveTest.java:577)
	at org.openmrs.test.BaseContextSensitiveTest.initializeInMemoryDatabase(BaseContextSensitiveTest.java:489)
	at org.openmrs.test.BaseContextSensitiveTest.baseSetupWithStandardDataAndAuthentication(BaseContextSensitiveTest.java:778)
(34 more lines...)
Collapse Failed ForgotPasswordFormControllerTest shouldGiveUserFiveSecretAnswerAttemptsAfterLessThanFiveFailedUsernameAttempts History
Sonar Full Analysis < 1 sec
org.dbunit.dataset.NoSuchTableException: person
	at org.dbunit.database.DatabaseDataSet.getTableMetaData(DatabaseDataSet.java:282)
	at org.dbunit.operation.AbstractOperation.getOperationMetaData(AbstractOperation.java:80)
	at org.dbunit.operation.RefreshOperation.execute(RefreshOperation.java:98)
	at org.openmrs.test.BaseContextSensitiveTest.executeDataSet(BaseContextSensitiveTest.java:682)
	at org.openmrs.test.BaseContextSensitiveTest.executeDataSet(BaseContextSensitiveTest.java:577)
	at org.openmrs.test.BaseContextSensitiveTest.initializeInMemoryDatabase(BaseContextSensitiveTest.java:489)
	at org.openmrs.test.BaseContextSensitiveTest.baseSetupWithStandardDataAndAuthentication(BaseContextSensitiveTest.java:778)
(34 more lines...)
Collapse Failed ForgotPasswordFormControllerTest shouldNotAuthenticateAfterFiveFailedInvalidUsernames History
Sonar Full Analysis < 1 sec
org.dbunit.dataset.NoSuchTableException: person
	at org.dbunit.database.DatabaseDataSet.getTableMetaData(DatabaseDataSet.java:282)
	at org.dbunit.operation.AbstractOperation.getOperationMetaData(AbstractOperation.java:80)
	at org.dbunit.operation.RefreshOperation.execute(RefreshOperation.java:98)
	at org.openmrs.test.BaseContextSensitiveTest.executeDataSet(BaseContextSensitiveTest.java:682)
	at org.openmrs.test.BaseContextSensitiveTest.executeDataSet(BaseContextSensitiveTest.java:577)
	at org.openmrs.test.BaseContextSensitiveTest.initializeInMemoryDatabase(BaseContextSensitiveTest.java:489)
	at org.openmrs.test.BaseContextSensitiveTest.baseSetupWithStandardDataAndAuthentication(BaseContextSensitiveTest.java:778)
(34 more lines...)
Collapse Failed ForgotPasswordFormControllerTest shouldNotNotFailOnNotFoundUsername History
Sonar Full Analysis < 1 sec
org.dbunit.dataset.NoSuchTableException: person
	at org.dbunit.database.DatabaseDataSet.getTableMetaData(DatabaseDataSet.java:282)
	at org.dbunit.operation.AbstractOperation.getOperationMetaData(AbstractOperation.java:80)
	at org.dbunit.operation.RefreshOperation.execute(RefreshOperation.java:98)
	at org.openmrs.test.BaseContextSensitiveTest.executeDataSet(BaseContextSensitiveTest.java:682)
	at org.openmrs.test.BaseContextSensitiveTest.executeDataSet(BaseContextSensitiveTest.java:577)
	at org.openmrs.test.BaseContextSensitiveTest.initializeInMemoryDatabase(BaseContextSensitiveTest.java:489)
	at org.openmrs.test.BaseContextSensitiveTest.baseSetupWithStandardDataAndAuthentication(BaseContextSensitiveTest.java:778)
(34 more lines...)
Collapse Failed ForgotPasswordFormControllerTest shouldLockOutAfterFiveFailedInvalidSecretAnswers History
Sonar Full Analysis < 1 sec
org.dbunit.dataset.NoSuchTableException: person
	at org.dbunit.database.DatabaseDataSet.getTableMetaData(DatabaseDataSet.java:282)
	at org.dbunit.operation.AbstractOperation.getOperationMetaData(AbstractOperation.java:80)
	at org.dbunit.operation.RefreshOperation.execute(RefreshOperation.java:98)
	at org.openmrs.test.BaseContextSensitiveTest.executeDataSet(BaseContextSensitiveTest.java:682)
	at org.openmrs.test.BaseContextSensitiveTest.executeDataSet(BaseContextSensitiveTest.java:577)
	at org.openmrs.test.BaseContextSensitiveTest.initializeInMemoryDatabase(BaseContextSensitiveTest.java:489)
	at org.openmrs.test.BaseContextSensitiveTest.baseSetupWithStandardDataAndAuthentication(BaseContextSensitiveTest.java:778)
(34 more lines...)
Collapse Failed ForgotPasswordFormControllerTest shouldLockOutAfterFiveFailedInvalidUsernames History
Sonar Full Analysis < 1 sec
org.dbunit.dataset.NoSuchTableException: person
	at org.dbunit.database.DatabaseDataSet.getTableMetaData(DatabaseDataSet.java:282)
	at org.dbunit.operation.AbstractOperation.getOperationMetaData(AbstractOperation.java:80)
	at org.dbunit.operation.RefreshOperation.execute(RefreshOperation.java:98)
	at org.openmrs.test.BaseContextSensitiveTest.executeDataSet(BaseContextSensitiveTest.java:682)
	at org.openmrs.test.BaseContextSensitiveTest.executeDataSet(BaseContextSensitiveTest.java:577)
	at org.openmrs.test.BaseContextSensitiveTest.initializeInMemoryDatabase(BaseContextSensitiveTest.java:489)
	at org.openmrs.test.BaseContextSensitiveTest.baseSetupWithStandardDataAndAuthentication(BaseContextSensitiveTest.java:778)
(34 more lines...)
Collapse Failed ConceptFormControllerTest shouldAddConceptWithNameAndShortNameAndDescriptionSpecifiedToNumericConcepts History
Sonar Full Analysis < 1 sec
org.dbunit.dataset.NoSuchTableException: person
	at org.dbunit.database.DatabaseDataSet.getTableMetaData(DatabaseDataSet.java:282)
	at org.dbunit.operation.AbstractOperation.getOperationMetaData(AbstractOperation.java:80)
	at org.dbunit.operation.RefreshOperation.execute(RefreshOperation.java:98)
	at org.openmrs.test.BaseContextSensitiveTest.executeDataSet(BaseContextSensitiveTest.java:682)
	at org.openmrs.test.BaseContextSensitiveTest.executeDataSet(BaseContextSensitiveTest.java:577)
	at org.openmrs.test.BaseContextSensitiveTest.initializeInMemoryDatabase(BaseContextSensitiveTest.java:489)
	at org.openmrs.test.BaseContextSensitiveTest.baseSetupWithStandardDataAndAuthentication(BaseContextSensitiveTest.java:778)
(33 more lines...)
Collapse Failed ConceptFormControllerTest shouldRemoveConceptAnswersIfDatatypeChangedFromCoded History
Sonar Full Analysis < 1 sec
org.dbunit.dataset.NoSuchTableException: person
	at org.dbunit.database.DatabaseDataSet.getTableMetaData(DatabaseDataSet.java:282)
	at org.dbunit.operation.AbstractOperation.getOperationMetaData(AbstractOperation.java:80)
	at org.dbunit.operation.RefreshOperation.execute(RefreshOperation.java:98)
	at org.openmrs.test.BaseContextSensitiveTest.executeDataSet(BaseContextSensitiveTest.java:682)
	at org.openmrs.test.BaseContextSensitiveTest.executeDataSet(BaseContextSensitiveTest.java:577)
	at org.openmrs.test.BaseContextSensitiveTest.initializeInMemoryDatabase(BaseContextSensitiveTest.java:489)
	at org.openmrs.test.BaseContextSensitiveTest.baseSetupWithStandardDataAndAuthentication(BaseContextSensitiveTest.java:778)
(33 more lines...)
Collapse Failed ConceptFormControllerTest shouldRemoveConceptAnswer History
Sonar Full Analysis < 1 sec
org.dbunit.dataset.NoSuchTableException: person
	at org.dbunit.database.DatabaseDataSet.getTableMetaData(DatabaseDataSet.java:282)
	at org.dbunit.operation.AbstractOperation.getOperationMetaData(AbstractOperation.java:80)
	at org.dbunit.operation.RefreshOperation.execute(RefreshOperation.java:98)
	at org.openmrs.test.BaseContextSensitiveTest.executeDataSet(BaseContextSensitiveTest.java:682)
	at org.openmrs.test.BaseContextSensitiveTest.executeDataSet(BaseContextSensitiveTest.java:577)
	at org.openmrs.test.BaseContextSensitiveTest.initializeInMemoryDatabase(BaseContextSensitiveTest.java:489)
	at org.openmrs.test.BaseContextSensitiveTest.baseSetupWithStandardDataAndAuthentication(BaseContextSensitiveTest.java:778)
(33 more lines...)
Collapse Failed ConceptFormControllerTest onSubmit_shouldReturnAConceptWithANullIdIfNoMatchIsFound History
Sonar Full Analysis < 1 sec
org.dbunit.dataset.NoSuchTableException: person
	at org.dbunit.database.DatabaseDataSet.getTableMetaData(DatabaseDataSet.java:282)
	at org.dbunit.operation.AbstractOperation.getOperationMetaData(AbstractOperation.java:80)
	at org.dbunit.operation.RefreshOperation.execute(RefreshOperation.java:98)
	at org.openmrs.test.BaseContextSensitiveTest.executeDataSet(BaseContextSensitiveTest.java:682)
	at org.openmrs.test.BaseContextSensitiveTest.executeDataSet(BaseContextSensitiveTest.java:577)
	at org.openmrs.test.BaseContextSensitiveTest.initializeInMemoryDatabase(BaseContextSensitiveTest.java:489)
	at org.openmrs.test.BaseContextSensitiveTest.baseSetupWithStandardDataAndAuthentication(BaseContextSensitiveTest.java:778)
(33 more lines...)
Collapse Failed ConceptFormControllerTest onSubmit_shouldVoidASynonymMarkedAsPreferredWhenItIsRemoved History
Sonar Full Analysis 1 sec
org.dbunit.dataset.NoSuchTableException: person
	at org.dbunit.database.DatabaseDataSet.getTableMetaData(DatabaseDataSet.java:282)
	at org.dbunit.operation.AbstractOperation.getOperationMetaData(AbstractOperation.java:80)
	at org.dbunit.operation.RefreshOperation.execute(RefreshOperation.java:98)
	at org.openmrs.test.BaseContextSensitiveTest.executeDataSet(BaseContextSensitiveTest.java:682)
	at org.openmrs.test.BaseContextSensitiveTest.executeDataSet(BaseContextSensitiveTest.java:577)
	at org.openmrs.test.BaseContextSensitiveTest.initializeInMemoryDatabase(BaseContextSensitiveTest.java:489)
	at org.openmrs.test.BaseContextSensitiveTest.baseSetupWithStandardDataAndAuthentication(BaseContextSensitiveTest.java:778)
(33 more lines...)
Collapse Failed ConceptFormControllerTest onSubmit_shouldSetTheLocalPreferredName History
Sonar Full Analysis < 1 sec
org.dbunit.dataset.NoSuchTableException: person
	at org.dbunit.database.DatabaseDataSet.getTableMetaData(DatabaseDataSet.java:282)
	at org.dbunit.operation.AbstractOperation.getOperationMetaData(AbstractOperation.java:80)
	at org.dbunit.operation.RefreshOperation.execute(RefreshOperation.java:98)
	at org.openmrs.test.BaseContextSensitiveTest.executeDataSet(BaseContextSensitiveTest.java:682)
	at org.openmrs.test.BaseContextSensitiveTest.executeDataSet(BaseContextSensitiveTest.java:577)
	at org.openmrs.test.BaseContextSensitiveTest.initializeInMemoryDatabase(BaseContextSensitiveTest.java:489)
	at org.openmrs.test.BaseContextSensitiveTest.baseSetupWithStandardDataAndAuthentication(BaseContextSensitiveTest.java:778)
(33 more lines...)
Collapse Failed ConceptFormControllerTest shouldUpdateConceptWithNameAlreadyInSynonymList History
Sonar Full Analysis < 1 sec
org.dbunit.dataset.NoSuchTableException: person
	at org.dbunit.database.DatabaseDataSet.getTableMetaData(DatabaseDataSet.java:282)
	at org.dbunit.operation.AbstractOperation.getOperationMetaData(AbstractOperation.java:80)
	at org.dbunit.operation.RefreshOperation.execute(RefreshOperation.java:98)
	at org.openmrs.test.BaseContextSensitiveTest.executeDataSet(BaseContextSensitiveTest.java:682)
	at org.openmrs.test.BaseContextSensitiveTest.executeDataSet(BaseContextSensitiveTest.java:577)
	at org.openmrs.test.BaseContextSensitiveTest.initializeInMemoryDatabase(BaseContextSensitiveTest.java:489)
	at org.openmrs.test.BaseContextSensitiveTest.baseSetupWithStandardDataAndAuthentication(BaseContextSensitiveTest.java:778)
(33 more lines...)
Collapse Failed ConceptFormControllerTest shouldRemoveConceptSet History
Sonar Full Analysis < 1 sec
org.dbunit.dataset.NoSuchTableException: person
	at org.dbunit.database.DatabaseDataSet.getTableMetaData(DatabaseDataSet.java:282)
	at org.dbunit.operation.AbstractOperation.getOperationMetaData(AbstractOperation.java:80)
	at org.dbunit.operation.RefreshOperation.execute(RefreshOperation.java:98)
	at org.openmrs.test.BaseContextSensitiveTest.executeDataSet(BaseContextSensitiveTest.java:682)
	at org.openmrs.test.BaseContextSensitiveTest.executeDataSet(BaseContextSensitiveTest.java:577)
	at org.openmrs.test.BaseContextSensitiveTest.initializeInMemoryDatabase(BaseContextSensitiveTest.java:489)
	at org.openmrs.test.BaseContextSensitiveTest.baseSetupWithStandardDataAndAuthentication(BaseContextSensitiveTest.java:778)
(33 more lines...)
Collapse Failed ConceptFormControllerTest validateConceptReferenceTermUsesPersistedObjects_shouldAddErrorIfSourceIsNotSaved History
Sonar Full Analysis < 1 sec
org.dbunit.dataset.NoSuchTableException: person
	at org.dbunit.database.DatabaseDataSet.getTableMetaData(DatabaseDataSet.java:282)
	at org.dbunit.operation.AbstractOperation.getOperationMetaData(AbstractOperation.java:80)
	at org.dbunit.operation.RefreshOperation.execute(RefreshOperation.java:98)
	at org.openmrs.test.BaseContextSensitiveTest.executeDataSet(BaseContextSensitiveTest.java:682)
	at org.openmrs.test.BaseContextSensitiveTest.executeDataSet(BaseContextSensitiveTest.java:577)
	at org.openmrs.test.BaseContextSensitiveTest.initializeInMemoryDatabase(BaseContextSensitiveTest.java:489)
	at org.openmrs.test.BaseContextSensitiveTest.baseSetupWithStandardDataAndAuthentication(BaseContextSensitiveTest.java:778)
(33 more lines...)
Collapse Failed ConceptFormControllerTest onSubmit_shouldAddANewConceptMapWhenCreatingAConcept History
Sonar Full Analysis < 1 sec
org.dbunit.dataset.NoSuchTableException: person
	at org.dbunit.database.DatabaseDataSet.getTableMetaData(DatabaseDataSet.java:282)
	at org.dbunit.operation.AbstractOperation.getOperationMetaData(AbstractOperation.java:80)
	at org.dbunit.operation.RefreshOperation.execute(RefreshOperation.java:98)
	at org.openmrs.test.BaseContextSensitiveTest.executeDataSet(BaseContextSensitiveTest.java:682)
	at org.openmrs.test.BaseContextSensitiveTest.executeDataSet(BaseContextSensitiveTest.java:577)
	at org.openmrs.test.BaseContextSensitiveTest.initializeInMemoryDatabase(BaseContextSensitiveTest.java:489)
	at org.openmrs.test.BaseContextSensitiveTest.baseSetupWithStandardDataAndAuthentication(BaseContextSensitiveTest.java:778)
(33 more lines...)
Collapse Failed ConceptFormControllerTest shouldReplacePreviousDescription History
Sonar Full Analysis < 1 sec
org.dbunit.dataset.NoSuchTableException: person
	at org.dbunit.database.DatabaseDataSet.getTableMetaData(DatabaseDataSet.java:282)
	at org.dbunit.operation.AbstractOperation.getOperationMetaData(AbstractOperation.java:80)
	at org.dbunit.operation.RefreshOperation.execute(RefreshOperation.java:98)
	at org.openmrs.test.BaseContextSensitiveTest.executeDataSet(BaseContextSensitiveTest.java:682)
	at org.openmrs.test.BaseContextSensitiveTest.executeDataSet(BaseContextSensitiveTest.java:577)
	at org.openmrs.test.BaseContextSensitiveTest.initializeInMemoryDatabase(BaseContextSensitiveTest.java:489)
	at org.openmrs.test.BaseContextSensitiveTest.baseSetupWithStandardDataAndAuthentication(BaseContextSensitiveTest.java:778)
(33 more lines...)
Collapse Failed ConceptFormControllerTest shouldGetConcept History
Sonar Full Analysis < 1 sec
org.dbunit.dataset.NoSuchTableException: person
	at org.dbunit.database.DatabaseDataSet.getTableMetaData(DatabaseDataSet.java:282)
	at org.dbunit.operation.AbstractOperation.getOperationMetaData(AbstractOperation.java:80)
	at org.dbunit.operation.RefreshOperation.execute(RefreshOperation.java:98)
	at org.openmrs.test.BaseContextSensitiveTest.executeDataSet(BaseContextSensitiveTest.java:682)
	at org.openmrs.test.BaseContextSensitiveTest.executeDataSet(BaseContextSensitiveTest.java:577)
	at org.openmrs.test.BaseContextSensitiveTest.initializeInMemoryDatabase(BaseContextSensitiveTest.java:489)
	at org.openmrs.test.BaseContextSensitiveTest.baseSetupWithStandardDataAndAuthentication(BaseContextSensitiveTest.java:778)
(33 more lines...)
Collapse Failed ConceptFormControllerTest shouldVoidShortName History
Sonar Full Analysis < 1 sec
org.dbunit.dataset.NoSuchTableException: person
	at org.dbunit.database.DatabaseDataSet.getTableMetaData(DatabaseDataSet.java:282)
	at org.dbunit.operation.AbstractOperation.getOperationMetaData(AbstractOperation.java:80)
	at org.dbunit.operation.RefreshOperation.execute(RefreshOperation.java:98)
	at org.openmrs.test.BaseContextSensitiveTest.executeDataSet(BaseContextSensitiveTest.java:682)
	at org.openmrs.test.BaseContextSensitiveTest.executeDataSet(BaseContextSensitiveTest.java:577)
	at org.openmrs.test.BaseContextSensitiveTest.initializeInMemoryDatabase(BaseContextSensitiveTest.java:489)
	at org.openmrs.test.BaseContextSensitiveTest.baseSetupWithStandardDataAndAuthentication(BaseContextSensitiveTest.java:778)
(33 more lines...)
Collapse Failed ConceptFormControllerTest onSubmit_shouldAddANewConceptMapToAnExistingConcept History
Sonar Full Analysis < 1 sec
org.dbunit.dataset.NoSuchTableException: person
	at org.dbunit.database.DatabaseDataSet.getTableMetaData(DatabaseDataSet.java:282)
	at org.dbunit.operation.AbstractOperation.getOperationMetaData(AbstractOperation.java:80)
	at org.dbunit.operation.RefreshOperation.execute(RefreshOperation.java:98)
	at org.openmrs.test.BaseContextSensitiveTest.executeDataSet(BaseContextSensitiveTest.java:682)
	at org.openmrs.test.BaseContextSensitiveTest.executeDataSet(BaseContextSensitiveTest.java:577)
	at org.openmrs.test.BaseContextSensitiveTest.initializeInMemoryDatabase(BaseContextSensitiveTest.java:489)
	at org.openmrs.test.BaseContextSensitiveTest.baseSetupWithStandardDataAndAuthentication(BaseContextSensitiveTest.java:778)
(33 more lines...)
Collapse Failed ConceptFormControllerTest onSubmit_shouldDisplayNumericValuesFromTable History
Sonar Full Analysis < 1 sec
org.dbunit.dataset.NoSuchTableException: person
	at org.dbunit.database.DatabaseDataSet.getTableMetaData(DatabaseDataSet.java:282)
	at org.dbunit.operation.AbstractOperation.getOperationMetaData(AbstractOperation.java:80)
	at org.dbunit.operation.RefreshOperation.execute(RefreshOperation.java:98)
	at org.openmrs.test.BaseContextSensitiveTest.executeDataSet(BaseContextSensitiveTest.java:682)
	at org.openmrs.test.BaseContextSensitiveTest.executeDataSet(BaseContextSensitiveTest.java:577)
	at org.openmrs.test.BaseContextSensitiveTest.initializeInMemoryDatabase(BaseContextSensitiveTest.java:489)
	at org.openmrs.test.BaseContextSensitiveTest.baseSetupWithStandardDataAndAuthentication(BaseContextSensitiveTest.java:778)
(33 more lines...)
Collapse Failed ConceptFormControllerTest onSubmit_shouldNotSaveChangesIfThereAreValidationErrors History
Sonar Full Analysis < 1 sec
org.dbunit.dataset.NoSuchTableException: person
	at org.dbunit.database.DatabaseDataSet.getTableMetaData(DatabaseDataSet.java:282)
	at org.dbunit.operation.AbstractOperation.getOperationMetaData(AbstractOperation.java:80)
	at org.dbunit.operation.RefreshOperation.execute(RefreshOperation.java:98)
	at org.openmrs.test.BaseContextSensitiveTest.executeDataSet(BaseContextSensitiveTest.java:682)
	at org.openmrs.test.BaseContextSensitiveTest.executeDataSet(BaseContextSensitiveTest.java:577)
	at org.openmrs.test.BaseContextSensitiveTest.initializeInMemoryDatabase(BaseContextSensitiveTest.java:489)
	at org.openmrs.test.BaseContextSensitiveTest.baseSetupWithStandardDataAndAuthentication(BaseContextSensitiveTest.java:778)
(33 more lines...)
Collapse Failed ConceptFormControllerTest shouldUpdateConceptWithShortNameAlreadyInSynonymList History
Sonar Full Analysis < 1 sec
org.dbunit.dataset.NoSuchTableException: person
	at org.dbunit.database.DatabaseDataSet.getTableMetaData(DatabaseDataSet.java:282)
	at org.dbunit.operation.AbstractOperation.getOperationMetaData(AbstractOperation.java:80)
	at org.dbunit.operation.RefreshOperation.execute(RefreshOperation.java:98)
	at org.openmrs.test.BaseContextSensitiveTest.executeDataSet(BaseContextSensitiveTest.java:682)
	at org.openmrs.test.BaseContextSensitiveTest.executeDataSet(BaseContextSensitiveTest.java:577)
	at org.openmrs.test.BaseContextSensitiveTest.initializeInMemoryDatabase(BaseContextSensitiveTest.java:489)
	at org.openmrs.test.BaseContextSensitiveTest.baseSetupWithStandardDataAndAuthentication(BaseContextSensitiveTest.java:778)
(33 more lines...)
Collapse Failed ConceptFormControllerTest shouldAddConceptWithNameAndShortNameAndDescriptionSpecifiedToCodeConcepts History
Sonar Full Analysis < 1 sec
org.dbunit.dataset.NoSuchTableException: person
	at org.dbunit.database.DatabaseDataSet.getTableMetaData(DatabaseDataSet.java:282)
	at org.dbunit.operation.AbstractOperation.getOperationMetaData(AbstractOperation.java:80)
	at org.dbunit.operation.RefreshOperation.execute(RefreshOperation.java:98)
	at org.openmrs.test.BaseContextSensitiveTest.executeDataSet(BaseContextSensitiveTest.java:682)
	at org.openmrs.test.BaseContextSensitiveTest.executeDataSet(BaseContextSensitiveTest.java:577)
	at org.openmrs.test.BaseContextSensitiveTest.initializeInMemoryDatabase(BaseContextSensitiveTest.java:489)
	at org.openmrs.test.BaseContextSensitiveTest.baseSetupWithStandardDataAndAuthentication(BaseContextSensitiveTest.java:778)
(33 more lines...)
Collapse Failed ConceptFormControllerTest shouldEditConceptComplex History
Sonar Full Analysis 3 secs
org.dbunit.dataset.NoSuchTableException: person
	at org.dbunit.database.DatabaseDataSet.getTableMetaData(DatabaseDataSet.java:282)
	at org.dbunit.operation.AbstractOperation.getOperationMetaData(AbstractOperation.java:80)
	at org.dbunit.operation.RefreshOperation.execute(RefreshOperation.java:98)
	at org.openmrs.test.BaseContextSensitiveTest.executeDataSet(BaseContextSensitiveTest.java:682)
	at org.openmrs.test.BaseContextSensitiveTest.executeDataSet(BaseContextSensitiveTest.java:577)
	at org.openmrs.test.BaseContextSensitiveTest.initializeInMemoryDatabase(BaseContextSensitiveTest.java:489)
	at org.openmrs.test.BaseContextSensitiveTest.baseSetupWithStandardDataAndAuthentication(BaseContextSensitiveTest.java:778)
(33 more lines...)
Collapse Failed ConceptFormControllerTest onSubmit_shouldIgnoreNewConceptMapRowIfTheUserDidNotSelectATerm History
Sonar Full Analysis < 1 sec
org.dbunit.dataset.NoSuchTableException: person
	at org.dbunit.database.DatabaseDataSet.getTableMetaData(DatabaseDataSet.java:282)
	at org.dbunit.operation.AbstractOperation.getOperationMetaData(AbstractOperation.java:80)
	at org.dbunit.operation.RefreshOperation.execute(RefreshOperation.java:98)
	at org.openmrs.test.BaseContextSensitiveTest.executeDataSet(BaseContextSensitiveTest.java:682)
	at org.openmrs.test.BaseContextSensitiveTest.executeDataSet(BaseContextSensitiveTest.java:577)
	at org.openmrs.test.BaseContextSensitiveTest.initializeInMemoryDatabase(BaseContextSensitiveTest.java:489)
	at org.openmrs.test.BaseContextSensitiveTest.baseSetupWithStandardDataAndAuthentication(BaseContextSensitiveTest.java:778)
(33 more lines...)
Collapse Failed ConceptFormControllerTest shouldAddConceptWithAllNamingSpecified History
Sonar Full Analysis < 1 sec
org.dbunit.dataset.NoSuchTableException: person
	at org.dbunit.database.DatabaseDataSet.getTableMetaData(DatabaseDataSet.java:282)
	at org.dbunit.operation.AbstractOperation.getOperationMetaData(AbstractOperation.java:80)
	at org.dbunit.operation.RefreshOperation.execute(RefreshOperation.java:98)
	at org.openmrs.test.BaseContextSensitiveTest.executeDataSet(BaseContextSensitiveTest.java:682)
	at org.openmrs.test.BaseContextSensitiveTest.executeDataSet(BaseContextSensitiveTest.java:577)
	at org.openmrs.test.BaseContextSensitiveTest.initializeInMemoryDatabase(BaseContextSensitiveTest.java:489)
	at org.openmrs.test.BaseContextSensitiveTest.baseSetupWithStandardDataAndAuthentication(BaseContextSensitiveTest.java:778)
(33 more lines...)
Collapse Failed ConceptFormControllerTest onSubmit_shouldRemoveAConceptMapFromAnExistingConcept History
Sonar Full Analysis < 1 sec
org.dbunit.dataset.NoSuchTableException: person
	at org.dbunit.database.DatabaseDataSet.getTableMetaData(DatabaseDataSet.java:282)
	at org.dbunit.operation.AbstractOperation.getOperationMetaData(AbstractOperation.java:80)
	at org.dbunit.operation.RefreshOperation.execute(RefreshOperation.java:98)
	at org.openmrs.test.BaseContextSensitiveTest.executeDataSet(BaseContextSensitiveTest.java:682)
	at org.openmrs.test.BaseContextSensitiveTest.executeDataSet(BaseContextSensitiveTest.java:577)
	at org.openmrs.test.BaseContextSensitiveTest.initializeInMemoryDatabase(BaseContextSensitiveTest.java:489)
	at org.openmrs.test.BaseContextSensitiveTest.baseSetupWithStandardDataAndAuthentication(BaseContextSensitiveTest.java:778)
(33 more lines...)
Collapse Failed ConceptFormControllerTest shouldUpdateConceptByAddingName History
Sonar Full Analysis < 1 sec
org.dbunit.dataset.NoSuchTableException: person
	at org.dbunit.database.DatabaseDataSet.getTableMetaData(DatabaseDataSet.java:282)
	at org.dbunit.operation.AbstractOperation.getOperationMetaData(AbstractOperation.java:80)
	at org.dbunit.operation.RefreshOperation.execute(RefreshOperation.java:98)
	at org.openmrs.test.BaseContextSensitiveTest.executeDataSet(BaseContextSensitiveTest.java:682)
	at org.openmrs.test.BaseContextSensitiveTest.executeDataSet(BaseContextSensitiveTest.java:577)
	at org.openmrs.test.BaseContextSensitiveTest.initializeInMemoryDatabase(BaseContextSensitiveTest.java:489)
	at org.openmrs.test.BaseContextSensitiveTest.baseSetupWithStandardDataAndAuthentication(BaseContextSensitiveTest.java:778)
(33 more lines...)
Collapse Failed ConceptFormControllerTest onSubmit_shouldCopyNumericValuesIntoNumericConcepts History
Sonar Full Analysis < 1 sec
org.dbunit.dataset.NoSuchTableException: person
	at org.dbunit.database.DatabaseDataSet.getTableMetaData(DatabaseDataSet.java:282)
	at org.dbunit.operation.AbstractOperation.getOperationMetaData(AbstractOperation.java:80)
	at org.dbunit.operation.RefreshOperation.execute(RefreshOperation.java:98)
	at org.openmrs.test.BaseContextSensitiveTest.executeDataSet(BaseContextSensitiveTest.java:682)
	at org.openmrs.test.BaseContextSensitiveTest.executeDataSet(BaseContextSensitiveTest.java:577)
	at org.openmrs.test.BaseContextSensitiveTest.initializeInMemoryDatabase(BaseContextSensitiveTest.java:489)
	at org.openmrs.test.BaseContextSensitiveTest.baseSetupWithStandardDataAndAuthentication(BaseContextSensitiveTest.java:778)
(33 more lines...)
Collapse Failed ConceptFormControllerTest shouldAddConceptWithOnlyNameSpecified History
Sonar Full Analysis < 1 sec
org.dbunit.dataset.NoSuchTableException: person
	at org.dbunit.database.DatabaseDataSet.getTableMetaData(DatabaseDataSet.java:282)
	at org.dbunit.operation.AbstractOperation.getOperationMetaData(AbstractOperation.java:80)
	at org.dbunit.operation.RefreshOperation.execute(RefreshOperation.java:98)
	at org.openmrs.test.BaseContextSensitiveTest.executeDataSet(BaseContextSensitiveTest.java:682)
	at org.openmrs.test.BaseContextSensitiveTest.executeDataSet(BaseContextSensitiveTest.java:577)
	at org.openmrs.test.BaseContextSensitiveTest.initializeInMemoryDatabase(BaseContextSensitiveTest.java:489)
	at org.openmrs.test.BaseContextSensitiveTest.baseSetupWithStandardDataAndAuthentication(BaseContextSensitiveTest.java:778)
(33 more lines...)
Collapse Failed ConceptFormControllerTest validateConceptReferenceTermUsesPersistedObjects_shouldAddErrorIfMapTypeIsNotSaved History
Sonar Full Analysis < 1 sec
org.dbunit.dataset.NoSuchTableException: person
	at org.dbunit.database.DatabaseDataSet.getTableMetaData(DatabaseDataSet.java:282)
	at org.dbunit.operation.AbstractOperation.getOperationMetaData(AbstractOperation.java:80)
	at org.dbunit.operation.RefreshOperation.execute(RefreshOperation.java:98)
	at org.openmrs.test.BaseContextSensitiveTest.executeDataSet(BaseContextSensitiveTest.java:682)
	at org.openmrs.test.BaseContextSensitiveTest.executeDataSet(BaseContextSensitiveTest.java:577)
	at org.openmrs.test.BaseContextSensitiveTest.initializeInMemoryDatabase(BaseContextSensitiveTest.java:489)
	at org.openmrs.test.BaseContextSensitiveTest.baseSetupWithStandardDataAndAuthentication(BaseContextSensitiveTest.java:778)
(33 more lines...)
Collapse Failed ConceptFormControllerTest shouldAddConceptWithNameAndShortNameSpecified History
Sonar Full Analysis < 1 sec
org.dbunit.dataset.NoSuchTableException: person
	at org.dbunit.database.DatabaseDataSet.getTableMetaData(DatabaseDataSet.java:282)
	at org.dbunit.operation.AbstractOperation.getOperationMetaData(AbstractOperation.java:80)
	at org.dbunit.operation.RefreshOperation.execute(RefreshOperation.java:98)
	at org.openmrs.test.BaseContextSensitiveTest.executeDataSet(BaseContextSensitiveTest.java:682)
	at org.openmrs.test.BaseContextSensitiveTest.executeDataSet(BaseContextSensitiveTest.java:577)
	at org.openmrs.test.BaseContextSensitiveTest.initializeInMemoryDatabase(BaseContextSensitiveTest.java:489)
	at org.openmrs.test.BaseContextSensitiveTest.baseSetupWithStandardDataAndAuthentication(BaseContextSensitiveTest.java:778)
(33 more lines...)
Collapse Failed ConceptFormControllerTest validateConceptReferenceTermUsesPersistedObjects_shouldAddErrorIfTermBIsNotSaved History
Sonar Full Analysis < 1 sec
org.dbunit.dataset.NoSuchTableException: person
	at org.dbunit.database.DatabaseDataSet.getTableMetaData(DatabaseDataSet.java:282)
	at org.dbunit.operation.AbstractOperation.getOperationMetaData(AbstractOperation.java:80)
	at org.dbunit.operation.RefreshOperation.execute(RefreshOperation.java:98)
	at org.openmrs.test.BaseContextSensitiveTest.executeDataSet(BaseContextSensitiveTest.java:682)
	at org.openmrs.test.BaseContextSensitiveTest.executeDataSet(BaseContextSensitiveTest.java:577)
	at org.openmrs.test.BaseContextSensitiveTest.initializeInMemoryDatabase(BaseContextSensitiveTest.java:489)
	at org.openmrs.test.BaseContextSensitiveTest.baseSetupWithStandardDataAndAuthentication(BaseContextSensitiveTest.java:778)
(33 more lines...)
Collapse Failed ConceptFormControllerTest shouldNotDeleteConceptsWhenConceptsAreLocked History
Sonar Full Analysis < 1 sec
org.dbunit.dataset.NoSuchTableException: person
	at org.dbunit.database.DatabaseDataSet.getTableMetaData(DatabaseDataSet.java:282)
	at org.dbunit.operation.AbstractOperation.getOperationMetaData(AbstractOperation.java:80)
	at org.dbunit.operation.RefreshOperation.execute(RefreshOperation.java:98)
	at org.openmrs.test.BaseContextSensitiveTest.executeDataSet(BaseContextSensitiveTest.java:682)
	at org.openmrs.test.BaseContextSensitiveTest.executeDataSet(BaseContextSensitiveTest.java:577)
	at org.openmrs.test.BaseContextSensitiveTest.initializeInMemoryDatabase(BaseContextSensitiveTest.java:489)
	at org.openmrs.test.BaseContextSensitiveTest.baseSetupWithStandardDataAndAuthentication(BaseContextSensitiveTest.java:778)
(33 more lines...)
Collapse Failed GlobalPropertyPortletControllerTest setupModelForModule_shouldChangeModelIfForModuleIsPresent History
Sonar Full Analysis < 1 sec
org.dbunit.dataset.NoSuchTableException: person
	at org.dbunit.database.DatabaseDataSet.getTableMetaData(DatabaseDataSet.java:282)
	at org.dbunit.operation.AbstractOperation.getOperationMetaData(AbstractOperation.java:80)
	at org.dbunit.operation.RefreshOperation.execute(RefreshOperation.java:98)
	at org.openmrs.test.BaseContextSensitiveTest.executeDataSet(BaseContextSensitiveTest.java:682)
	at org.openmrs.test.BaseContextSensitiveTest.executeDataSet(BaseContextSensitiveTest.java:577)
	at org.openmrs.test.BaseContextSensitiveTest.initializeInMemoryDatabase(BaseContextSensitiveTest.java:489)
	at org.openmrs.test.BaseContextSensitiveTest.baseSetupWithStandardDataAndAuthentication(BaseContextSensitiveTest.java:778)
(33 more lines...)
Collapse Failed GlobalPropertyPortletControllerTest populateModel_shouldExcludeMultiplePrefixes History
Sonar Full Analysis < 1 sec
org.dbunit.dataset.NoSuchTableException: person
	at org.dbunit.database.DatabaseDataSet.getTableMetaData(DatabaseDataSet.java:282)
	at org.dbunit.operation.AbstractOperation.getOperationMetaData(AbstractOperation.java:80)
	at org.dbunit.operation.RefreshOperation.execute(RefreshOperation.java:98)
	at org.openmrs.test.BaseContextSensitiveTest.executeDataSet(BaseContextSensitiveTest.java:682)
	at org.openmrs.test.BaseContextSensitiveTest.executeDataSet(BaseContextSensitiveTest.java:577)
	at org.openmrs.test.BaseContextSensitiveTest.initializeInMemoryDatabase(BaseContextSensitiveTest.java:489)
	at org.openmrs.test.BaseContextSensitiveTest.baseSetupWithStandardDataAndAuthentication(BaseContextSensitiveTest.java:778)
(33 more lines...)
Collapse Failed GlobalPropertyPortletControllerTest setupModelForModule_shouldNotChangeModeIfForModuleIsNotPresent History
Sonar Full Analysis < 1 sec
org.dbunit.dataset.NoSuchTableException: person
	at org.dbunit.database.DatabaseDataSet.getTableMetaData(DatabaseDataSet.java:282)
	at org.dbunit.operation.AbstractOperation.getOperationMetaData(AbstractOperation.java:80)
	at org.dbunit.operation.RefreshOperation.execute(RefreshOperation.java:98)
	at org.openmrs.test.BaseContextSensitiveTest.executeDataSet(BaseContextSensitiveTest.java:682)
	at org.openmrs.test.BaseContextSensitiveTest.executeDataSet(BaseContextSensitiveTest.java:577)
	at org.openmrs.test.BaseContextSensitiveTest.initializeInMemoryDatabase(BaseContextSensitiveTest.java:489)
	at org.openmrs.test.BaseContextSensitiveTest.baseSetupWithStandardDataAndAuthentication(BaseContextSensitiveTest.java:778)
(33 more lines...)

Jira issues

IssueDescriptionStatus
9 more issues…
Unknown Issue TypeTRUNK-2147Could not obtain issue details from Jira
Unknown Issue TypeTRUNK-2218Could not obtain issue details from Jira
Unknown Issue TypeTRUNK-3283Could not obtain issue details from Jira
Unknown Issue TypeTRUNK-3865Could not obtain issue details from Jira
Unknown Issue TypeTRUNK-3898Could not obtain issue details from Jira