Sonar metrics for OpenMRS Core Master

Build: #115 failed

Job: Sonar Full Analysis failed

Stages & jobs

  1. Default Stage

Job result summary

Completed
Duration
95 minutes
Revision
2f2e21e895e7e5cf2e2d8a1bcc1bc5ec228e3607 2f2e21e895e7e5cf2e2d8a1bcc1bc5ec228e3607
Total tests
2648
Fixed in
#117 (Manual run by Rafal Korytkowski)

Tests

  • 2,648 tests in total
  • 234 tests failed
  • 234 failures are new
  • 50 minutes taken in total.
New test failures 234
Status Test Duration
Collapse Failed SchedulerFormControllerTest onSubmit_shouldNotRescheduleATaskThatIsNotCurrentlyScheduled History
< 1 sec
org.dbunit.dataset.NoSuchTableException: person
	at org.dbunit.database.DatabaseDataSet.getTableMetaData(DatabaseDataSet.java:282)
	at org.dbunit.operation.AbstractOperation.getOperationMetaData(AbstractOperation.java:80)
	at org.dbunit.operation.RefreshOperation.execute(RefreshOperation.java:98)
	at org.openmrs.test.BaseContextSensitiveTest.executeDataSet(BaseContextSensitiveTest.java:682)
	at org.openmrs.test.BaseContextSensitiveTest.executeDataSet(BaseContextSensitiveTest.java:577)
	at org.openmrs.test.BaseContextSensitiveTest.initializeInMemoryDatabase(BaseContextSensitiveTest.java:489)
	at org.openmrs.test.BaseContextSensitiveTest.baseSetupWithStandardDataAndAuthentication(BaseContextSensitiveTest.java:778)
(33 more lines...)
Collapse Failed SchedulerFormControllerTest onSubmit_shouldNotRescheduleAnExecutingTask History
< 1 sec
org.dbunit.dataset.NoSuchTableException: person
	at org.dbunit.database.DatabaseDataSet.getTableMetaData(DatabaseDataSet.java:282)
	at org.dbunit.operation.AbstractOperation.getOperationMetaData(AbstractOperation.java:80)
	at org.dbunit.operation.RefreshOperation.execute(RefreshOperation.java:98)
	at org.openmrs.test.BaseContextSensitiveTest.executeDataSet(BaseContextSensitiveTest.java:682)
	at org.openmrs.test.BaseContextSensitiveTest.executeDataSet(BaseContextSensitiveTest.java:577)
	at org.openmrs.test.BaseContextSensitiveTest.initializeInMemoryDatabase(BaseContextSensitiveTest.java:489)
	at org.openmrs.test.BaseContextSensitiveTest.baseSetupWithStandardDataAndAuthentication(BaseContextSensitiveTest.java:778)
(33 more lines...)
Collapse Failed SchedulerFormControllerTest onSubmit_shouldRescheduleACurrentlyScheduledTask History
2 secs
org.dbunit.dataset.NoSuchTableException: person
	at org.dbunit.database.DatabaseDataSet.getTableMetaData(DatabaseDataSet.java:282)
	at org.dbunit.operation.AbstractOperation.getOperationMetaData(AbstractOperation.java:80)
	at org.dbunit.operation.RefreshOperation.execute(RefreshOperation.java:98)
	at org.openmrs.test.BaseContextSensitiveTest.executeDataSet(BaseContextSensitiveTest.java:682)
	at org.openmrs.test.BaseContextSensitiveTest.executeDataSet(BaseContextSensitiveTest.java:577)
	at org.openmrs.test.BaseContextSensitiveTest.initializeInMemoryDatabase(BaseContextSensitiveTest.java:489)
	at org.openmrs.test.BaseContextSensitiveTest.baseSetupWithStandardDataAndAuthentication(BaseContextSensitiveTest.java:778)
(33 more lines...)
Collapse Failed SchedulerFormTest addANewTaskShouldNotError History
3 secs
org.dbunit.dataset.NoSuchTableException: person
	at org.dbunit.database.DatabaseDataSet.getTableMetaData(DatabaseDataSet.java:282)
	at org.dbunit.operation.AbstractOperation.getOperationMetaData(AbstractOperation.java:80)
	at org.dbunit.operation.RefreshOperation.execute(RefreshOperation.java:98)
	at org.openmrs.test.BaseContextSensitiveTest.executeDataSet(BaseContextSensitiveTest.java:682)
	at org.openmrs.test.BaseContextSensitiveTest.executeDataSet(BaseContextSensitiveTest.java:577)
	at org.openmrs.test.BaseContextSensitiveTest.initializeInMemoryDatabase(BaseContextSensitiveTest.java:489)
	at org.openmrs.test.BaseContextSensitiveTest.baseSetupWithStandardDataAndAuthentication(BaseContextSensitiveTest.java:778)
(33 more lines...)
Collapse Failed TaskHelperTest getScheduledTaskDefinition_shouldReturnATaskThatHasBeenStarted History
< 1 sec
org.dbunit.dataset.NoSuchTableException: person
	at org.dbunit.database.DatabaseDataSet.getTableMetaData(DatabaseDataSet.java:282)
	at org.dbunit.operation.AbstractOperation.getOperationMetaData(AbstractOperation.java:80)
	at org.dbunit.operation.RefreshOperation.execute(RefreshOperation.java:98)
	at org.openmrs.test.BaseContextSensitiveTest.executeDataSet(BaseContextSensitiveTest.java:682)
	at org.openmrs.test.BaseContextSensitiveTest.executeDataSet(BaseContextSensitiveTest.java:577)
	at org.openmrs.test.BaseContextSensitiveTest.initializeInMemoryDatabase(BaseContextSensitiveTest.java:489)
	at org.openmrs.test.BaseContextSensitiveTest.baseSetupWithStandardDataAndAuthentication(BaseContextSensitiveTest.java:778)
(33 more lines...)
Collapse Failed TaskHelperTest getTime_shouldGetATimeInTheFuture History
< 1 sec
org.dbunit.dataset.NoSuchTableException: person
	at org.dbunit.database.DatabaseDataSet.getTableMetaData(DatabaseDataSet.java:282)
	at org.dbunit.operation.AbstractOperation.getOperationMetaData(AbstractOperation.java:80)
	at org.dbunit.operation.RefreshOperation.execute(RefreshOperation.java:98)
	at org.openmrs.test.BaseContextSensitiveTest.executeDataSet(BaseContextSensitiveTest.java:682)
	at org.openmrs.test.BaseContextSensitiveTest.executeDataSet(BaseContextSensitiveTest.java:577)
	at org.openmrs.test.BaseContextSensitiveTest.initializeInMemoryDatabase(BaseContextSensitiveTest.java:489)
	at org.openmrs.test.BaseContextSensitiveTest.baseSetupWithStandardDataAndAuthentication(BaseContextSensitiveTest.java:778)
(33 more lines...)
Collapse Failed TaskHelperTest getTime_shouldGetATimeInThePast History
< 1 sec
org.dbunit.dataset.NoSuchTableException: person
	at org.dbunit.database.DatabaseDataSet.getTableMetaData(DatabaseDataSet.java:282)
	at org.dbunit.operation.AbstractOperation.getOperationMetaData(AbstractOperation.java:80)
	at org.dbunit.operation.RefreshOperation.execute(RefreshOperation.java:98)
	at org.openmrs.test.BaseContextSensitiveTest.executeDataSet(BaseContextSensitiveTest.java:682)
	at org.openmrs.test.BaseContextSensitiveTest.executeDataSet(BaseContextSensitiveTest.java:577)
	at org.openmrs.test.BaseContextSensitiveTest.initializeInMemoryDatabase(BaseContextSensitiveTest.java:489)
	at org.openmrs.test.BaseContextSensitiveTest.baseSetupWithStandardDataAndAuthentication(BaseContextSensitiveTest.java:778)
(33 more lines...)
Collapse Failed TaskHelperTest getUnscheduledTaskDefinition_shouldReturnATaskThatHasNotBeenStarted History
< 1 sec
org.dbunit.dataset.NoSuchTableException: person
	at org.dbunit.database.DatabaseDataSet.getTableMetaData(DatabaseDataSet.java:282)
	at org.dbunit.operation.AbstractOperation.getOperationMetaData(AbstractOperation.java:80)
	at org.dbunit.operation.RefreshOperation.execute(RefreshOperation.java:98)
	at org.openmrs.test.BaseContextSensitiveTest.executeDataSet(BaseContextSensitiveTest.java:682)
	at org.openmrs.test.BaseContextSensitiveTest.executeDataSet(BaseContextSensitiveTest.java:577)
	at org.openmrs.test.BaseContextSensitiveTest.initializeInMemoryDatabase(BaseContextSensitiveTest.java:489)
	at org.openmrs.test.BaseContextSensitiveTest.baseSetupWithStandardDataAndAuthentication(BaseContextSensitiveTest.java:778)
(33 more lines...)
Collapse Failed TaskHelperTest waitUntilTaskIsExecuting_shouldRaiseATimeoutExceptionWhenTheTimeoutIsExceeded History
< 1 sec
org.dbunit.dataset.NoSuchTableException: person
	at org.dbunit.database.DatabaseDataSet.getTableMetaData(DatabaseDataSet.java:282)
	at org.dbunit.operation.AbstractOperation.getOperationMetaData(AbstractOperation.java:80)
	at org.dbunit.operation.RefreshOperation.execute(RefreshOperation.java:98)
	at org.openmrs.test.BaseContextSensitiveTest.executeDataSet(BaseContextSensitiveTest.java:682)
	at org.openmrs.test.BaseContextSensitiveTest.executeDataSet(BaseContextSensitiveTest.java:577)
	at org.openmrs.test.BaseContextSensitiveTest.initializeInMemoryDatabase(BaseContextSensitiveTest.java:489)
	at org.openmrs.test.BaseContextSensitiveTest.baseSetupWithStandardDataAndAuthentication(BaseContextSensitiveTest.java:778)
(33 more lines...)
Collapse Failed TaskHelperTest waitUntilTaskIsExecuting_shouldWaitUntilTaskIsExecuting History
< 1 sec
org.dbunit.dataset.NoSuchTableException: person
	at org.dbunit.database.DatabaseDataSet.getTableMetaData(DatabaseDataSet.java:282)
	at org.dbunit.operation.AbstractOperation.getOperationMetaData(AbstractOperation.java:80)
	at org.dbunit.operation.RefreshOperation.execute(RefreshOperation.java:98)
	at org.openmrs.test.BaseContextSensitiveTest.executeDataSet(BaseContextSensitiveTest.java:682)
	at org.openmrs.test.BaseContextSensitiveTest.executeDataSet(BaseContextSensitiveTest.java:577)
	at org.openmrs.test.BaseContextSensitiveTest.initializeInMemoryDatabase(BaseContextSensitiveTest.java:489)
	at org.openmrs.test.BaseContextSensitiveTest.baseSetupWithStandardDataAndAuthentication(BaseContextSensitiveTest.java:778)
(33 more lines...)
Collapse Failed ForgotPasswordFormControllerTest shouldAuthenticateAsUserWithValidSecretQuestion History
1 sec
org.dbunit.dataset.NoSuchTableException: person
	at org.dbunit.database.DatabaseDataSet.getTableMetaData(DatabaseDataSet.java:282)
	at org.dbunit.operation.AbstractOperation.getOperationMetaData(AbstractOperation.java:80)
	at org.dbunit.operation.RefreshOperation.execute(RefreshOperation.java:98)
	at org.openmrs.test.BaseContextSensitiveTest.executeDataSet(BaseContextSensitiveTest.java:682)
	at org.openmrs.test.BaseContextSensitiveTest.executeDataSet(BaseContextSensitiveTest.java:577)
	at org.openmrs.test.BaseContextSensitiveTest.initializeInMemoryDatabase(BaseContextSensitiveTest.java:489)
	at org.openmrs.test.BaseContextSensitiveTest.baseSetupWithStandardDataAndAuthentication(BaseContextSensitiveTest.java:778)
(34 more lines...)
Collapse Failed ForgotPasswordFormControllerTest shouldGiveUserFiveSecretAnswerAttemptsAfterLessThanFiveFailedUsernameAttempts History
< 1 sec
org.dbunit.dataset.NoSuchTableException: person
	at org.dbunit.database.DatabaseDataSet.getTableMetaData(DatabaseDataSet.java:282)
	at org.dbunit.operation.AbstractOperation.getOperationMetaData(AbstractOperation.java:80)
	at org.dbunit.operation.RefreshOperation.execute(RefreshOperation.java:98)
	at org.openmrs.test.BaseContextSensitiveTest.executeDataSet(BaseContextSensitiveTest.java:682)
	at org.openmrs.test.BaseContextSensitiveTest.executeDataSet(BaseContextSensitiveTest.java:577)
	at org.openmrs.test.BaseContextSensitiveTest.initializeInMemoryDatabase(BaseContextSensitiveTest.java:489)
	at org.openmrs.test.BaseContextSensitiveTest.baseSetupWithStandardDataAndAuthentication(BaseContextSensitiveTest.java:778)
(34 more lines...)
Collapse Failed ForgotPasswordFormControllerTest shouldLoadPageNormallyWithNoInput History
< 1 sec
org.dbunit.dataset.NoSuchTableException: person
	at org.dbunit.database.DatabaseDataSet.getTableMetaData(DatabaseDataSet.java:282)
	at org.dbunit.operation.AbstractOperation.getOperationMetaData(AbstractOperation.java:80)
	at org.dbunit.operation.RefreshOperation.execute(RefreshOperation.java:98)
	at org.openmrs.test.BaseContextSensitiveTest.executeDataSet(BaseContextSensitiveTest.java:682)
	at org.openmrs.test.BaseContextSensitiveTest.executeDataSet(BaseContextSensitiveTest.java:577)
	at org.openmrs.test.BaseContextSensitiveTest.initializeInMemoryDatabase(BaseContextSensitiveTest.java:489)
	at org.openmrs.test.BaseContextSensitiveTest.baseSetupWithStandardDataAndAuthentication(BaseContextSensitiveTest.java:778)
(34 more lines...)
Collapse Failed ForgotPasswordFormControllerTest shouldLockOutAfterFiveFailedInvalidSecretAnswers History
< 1 sec
org.dbunit.dataset.NoSuchTableException: person
	at org.dbunit.database.DatabaseDataSet.getTableMetaData(DatabaseDataSet.java:282)
	at org.dbunit.operation.AbstractOperation.getOperationMetaData(AbstractOperation.java:80)
	at org.dbunit.operation.RefreshOperation.execute(RefreshOperation.java:98)
	at org.openmrs.test.BaseContextSensitiveTest.executeDataSet(BaseContextSensitiveTest.java:682)
	at org.openmrs.test.BaseContextSensitiveTest.executeDataSet(BaseContextSensitiveTest.java:577)
	at org.openmrs.test.BaseContextSensitiveTest.initializeInMemoryDatabase(BaseContextSensitiveTest.java:489)
	at org.openmrs.test.BaseContextSensitiveTest.baseSetupWithStandardDataAndAuthentication(BaseContextSensitiveTest.java:778)
(34 more lines...)
Collapse Failed ForgotPasswordFormControllerTest shouldLockOutAfterFiveFailedInvalidUsernames History
< 1 sec
org.dbunit.dataset.NoSuchTableException: person
	at org.dbunit.database.DatabaseDataSet.getTableMetaData(DatabaseDataSet.java:282)
	at org.dbunit.operation.AbstractOperation.getOperationMetaData(AbstractOperation.java:80)
	at org.dbunit.operation.RefreshOperation.execute(RefreshOperation.java:98)
	at org.openmrs.test.BaseContextSensitiveTest.executeDataSet(BaseContextSensitiveTest.java:682)
	at org.openmrs.test.BaseContextSensitiveTest.executeDataSet(BaseContextSensitiveTest.java:577)
	at org.openmrs.test.BaseContextSensitiveTest.initializeInMemoryDatabase(BaseContextSensitiveTest.java:489)
	at org.openmrs.test.BaseContextSensitiveTest.baseSetupWithStandardDataAndAuthentication(BaseContextSensitiveTest.java:778)
(34 more lines...)
Collapse Failed ForgotPasswordFormControllerTest shouldNotAuthenticateAfterFiveFailedInvalidUsernames History
< 1 sec
org.dbunit.dataset.NoSuchTableException: person
	at org.dbunit.database.DatabaseDataSet.getTableMetaData(DatabaseDataSet.java:282)
	at org.dbunit.operation.AbstractOperation.getOperationMetaData(AbstractOperation.java:80)
	at org.dbunit.operation.RefreshOperation.execute(RefreshOperation.java:98)
	at org.openmrs.test.BaseContextSensitiveTest.executeDataSet(BaseContextSensitiveTest.java:682)
	at org.openmrs.test.BaseContextSensitiveTest.executeDataSet(BaseContextSensitiveTest.java:577)
	at org.openmrs.test.BaseContextSensitiveTest.initializeInMemoryDatabase(BaseContextSensitiveTest.java:489)
	at org.openmrs.test.BaseContextSensitiveTest.baseSetupWithStandardDataAndAuthentication(BaseContextSensitiveTest.java:778)
(34 more lines...)
Collapse Failed ForgotPasswordFormControllerTest shouldNotAuthenticateAsUserWithValidSecretQuestion History
< 1 sec
org.dbunit.dataset.NoSuchTableException: person
	at org.dbunit.database.DatabaseDataSet.getTableMetaData(DatabaseDataSet.java:282)
	at org.dbunit.operation.AbstractOperation.getOperationMetaData(AbstractOperation.java:80)
	at org.dbunit.operation.RefreshOperation.execute(RefreshOperation.java:98)
	at org.openmrs.test.BaseContextSensitiveTest.executeDataSet(BaseContextSensitiveTest.java:682)
	at org.openmrs.test.BaseContextSensitiveTest.executeDataSet(BaseContextSensitiveTest.java:577)
	at org.openmrs.test.BaseContextSensitiveTest.initializeInMemoryDatabase(BaseContextSensitiveTest.java:489)
	at org.openmrs.test.BaseContextSensitiveTest.baseSetupWithStandardDataAndAuthentication(BaseContextSensitiveTest.java:778)
(34 more lines...)
Collapse Failed ForgotPasswordFormControllerTest shouldNotNotFailOnNotFoundUsername History
< 1 sec
org.dbunit.dataset.NoSuchTableException: person
	at org.dbunit.database.DatabaseDataSet.getTableMetaData(DatabaseDataSet.java:282)
	at org.dbunit.operation.AbstractOperation.getOperationMetaData(AbstractOperation.java:80)
	at org.dbunit.operation.RefreshOperation.execute(RefreshOperation.java:98)
	at org.openmrs.test.BaseContextSensitiveTest.executeDataSet(BaseContextSensitiveTest.java:682)
	at org.openmrs.test.BaseContextSensitiveTest.executeDataSet(BaseContextSensitiveTest.java:577)
	at org.openmrs.test.BaseContextSensitiveTest.initializeInMemoryDatabase(BaseContextSensitiveTest.java:489)
	at org.openmrs.test.BaseContextSensitiveTest.baseSetupWithStandardDataAndAuthentication(BaseContextSensitiveTest.java:778)
(34 more lines...)
Collapse Failed ConceptFormControllerTest onSubmit_shouldAddANewConceptMapToAnExistingConcept History
< 1 sec
org.dbunit.dataset.NoSuchTableException: person
	at org.dbunit.database.DatabaseDataSet.getTableMetaData(DatabaseDataSet.java:282)
	at org.dbunit.operation.AbstractOperation.getOperationMetaData(AbstractOperation.java:80)
	at org.dbunit.operation.RefreshOperation.execute(RefreshOperation.java:98)
	at org.openmrs.test.BaseContextSensitiveTest.executeDataSet(BaseContextSensitiveTest.java:682)
	at org.openmrs.test.BaseContextSensitiveTest.executeDataSet(BaseContextSensitiveTest.java:577)
	at org.openmrs.test.BaseContextSensitiveTest.initializeInMemoryDatabase(BaseContextSensitiveTest.java:489)
	at org.openmrs.test.BaseContextSensitiveTest.baseSetupWithStandardDataAndAuthentication(BaseContextSensitiveTest.java:778)
(33 more lines...)
Collapse Failed ConceptFormControllerTest onSubmit_shouldAddANewConceptMapWhenCreatingAConcept History
< 1 sec
org.dbunit.dataset.NoSuchTableException: person
	at org.dbunit.database.DatabaseDataSet.getTableMetaData(DatabaseDataSet.java:282)
	at org.dbunit.operation.AbstractOperation.getOperationMetaData(AbstractOperation.java:80)
	at org.dbunit.operation.RefreshOperation.execute(RefreshOperation.java:98)
	at org.openmrs.test.BaseContextSensitiveTest.executeDataSet(BaseContextSensitiveTest.java:682)
	at org.openmrs.test.BaseContextSensitiveTest.executeDataSet(BaseContextSensitiveTest.java:577)
	at org.openmrs.test.BaseContextSensitiveTest.initializeInMemoryDatabase(BaseContextSensitiveTest.java:489)
	at org.openmrs.test.BaseContextSensitiveTest.baseSetupWithStandardDataAndAuthentication(BaseContextSensitiveTest.java:778)
(33 more lines...)
Collapse Failed ConceptFormControllerTest onSubmit_shouldCopyNumericValuesIntoNumericConcepts History
< 1 sec
org.dbunit.dataset.NoSuchTableException: person
	at org.dbunit.database.DatabaseDataSet.getTableMetaData(DatabaseDataSet.java:282)
	at org.dbunit.operation.AbstractOperation.getOperationMetaData(AbstractOperation.java:80)
	at org.dbunit.operation.RefreshOperation.execute(RefreshOperation.java:98)
	at org.openmrs.test.BaseContextSensitiveTest.executeDataSet(BaseContextSensitiveTest.java:682)
	at org.openmrs.test.BaseContextSensitiveTest.executeDataSet(BaseContextSensitiveTest.java:577)
	at org.openmrs.test.BaseContextSensitiveTest.initializeInMemoryDatabase(BaseContextSensitiveTest.java:489)
	at org.openmrs.test.BaseContextSensitiveTest.baseSetupWithStandardDataAndAuthentication(BaseContextSensitiveTest.java:778)
(33 more lines...)
Collapse Failed ConceptFormControllerTest onSubmit_shouldDisplayNumericValuesFromTable History
< 1 sec
org.dbunit.dataset.NoSuchTableException: person
	at org.dbunit.database.DatabaseDataSet.getTableMetaData(DatabaseDataSet.java:282)
	at org.dbunit.operation.AbstractOperation.getOperationMetaData(AbstractOperation.java:80)
	at org.dbunit.operation.RefreshOperation.execute(RefreshOperation.java:98)
	at org.openmrs.test.BaseContextSensitiveTest.executeDataSet(BaseContextSensitiveTest.java:682)
	at org.openmrs.test.BaseContextSensitiveTest.executeDataSet(BaseContextSensitiveTest.java:577)
	at org.openmrs.test.BaseContextSensitiveTest.initializeInMemoryDatabase(BaseContextSensitiveTest.java:489)
	at org.openmrs.test.BaseContextSensitiveTest.baseSetupWithStandardDataAndAuthentication(BaseContextSensitiveTest.java:778)
(33 more lines...)
Collapse Failed ConceptFormControllerTest onSubmit_shouldIgnoreNewConceptMapRowIfTheUserDidNotSelectATerm History
< 1 sec
org.dbunit.dataset.NoSuchTableException: person
	at org.dbunit.database.DatabaseDataSet.getTableMetaData(DatabaseDataSet.java:282)
	at org.dbunit.operation.AbstractOperation.getOperationMetaData(AbstractOperation.java:80)
	at org.dbunit.operation.RefreshOperation.execute(RefreshOperation.java:98)
	at org.openmrs.test.BaseContextSensitiveTest.executeDataSet(BaseContextSensitiveTest.java:682)
	at org.openmrs.test.BaseContextSensitiveTest.executeDataSet(BaseContextSensitiveTest.java:577)
	at org.openmrs.test.BaseContextSensitiveTest.initializeInMemoryDatabase(BaseContextSensitiveTest.java:489)
	at org.openmrs.test.BaseContextSensitiveTest.baseSetupWithStandardDataAndAuthentication(BaseContextSensitiveTest.java:778)
(33 more lines...)
Collapse Failed ConceptFormControllerTest onSubmit_shouldNotSaveChangesIfThereAreValidationErrors History
< 1 sec
org.dbunit.dataset.NoSuchTableException: person
	at org.dbunit.database.DatabaseDataSet.getTableMetaData(DatabaseDataSet.java:282)
	at org.dbunit.operation.AbstractOperation.getOperationMetaData(AbstractOperation.java:80)
	at org.dbunit.operation.RefreshOperation.execute(RefreshOperation.java:98)
	at org.openmrs.test.BaseContextSensitiveTest.executeDataSet(BaseContextSensitiveTest.java:682)
	at org.openmrs.test.BaseContextSensitiveTest.executeDataSet(BaseContextSensitiveTest.java:577)
	at org.openmrs.test.BaseContextSensitiveTest.initializeInMemoryDatabase(BaseContextSensitiveTest.java:489)
	at org.openmrs.test.BaseContextSensitiveTest.baseSetupWithStandardDataAndAuthentication(BaseContextSensitiveTest.java:778)
(33 more lines...)
Collapse Failed ConceptFormControllerTest onSubmit_shouldRemoveAConceptMapFromAnExistingConcept History
< 1 sec
org.dbunit.dataset.NoSuchTableException: person
	at org.dbunit.database.DatabaseDataSet.getTableMetaData(DatabaseDataSet.java:282)
	at org.dbunit.operation.AbstractOperation.getOperationMetaData(AbstractOperation.java:80)
	at org.dbunit.operation.RefreshOperation.execute(RefreshOperation.java:98)
	at org.openmrs.test.BaseContextSensitiveTest.executeDataSet(BaseContextSensitiveTest.java:682)
	at org.openmrs.test.BaseContextSensitiveTest.executeDataSet(BaseContextSensitiveTest.java:577)
	at org.openmrs.test.BaseContextSensitiveTest.initializeInMemoryDatabase(BaseContextSensitiveTest.java:489)
	at org.openmrs.test.BaseContextSensitiveTest.baseSetupWithStandardDataAndAuthentication(BaseContextSensitiveTest.java:778)
(33 more lines...)
Collapse Failed ConceptFormControllerTest onSubmit_shouldReturnAConceptWithANullIdIfNoMatchIsFound History
< 1 sec
org.dbunit.dataset.NoSuchTableException: person
	at org.dbunit.database.DatabaseDataSet.getTableMetaData(DatabaseDataSet.java:282)
	at org.dbunit.operation.AbstractOperation.getOperationMetaData(AbstractOperation.java:80)
	at org.dbunit.operation.RefreshOperation.execute(RefreshOperation.java:98)
	at org.openmrs.test.BaseContextSensitiveTest.executeDataSet(BaseContextSensitiveTest.java:682)
	at org.openmrs.test.BaseContextSensitiveTest.executeDataSet(BaseContextSensitiveTest.java:577)
	at org.openmrs.test.BaseContextSensitiveTest.initializeInMemoryDatabase(BaseContextSensitiveTest.java:489)
	at org.openmrs.test.BaseContextSensitiveTest.baseSetupWithStandardDataAndAuthentication(BaseContextSensitiveTest.java:778)
(33 more lines...)
Collapse Failed ConceptFormControllerTest onSubmit_shouldSetTheLocalPreferredName History
< 1 sec
org.dbunit.dataset.NoSuchTableException: person
	at org.dbunit.database.DatabaseDataSet.getTableMetaData(DatabaseDataSet.java:282)
	at org.dbunit.operation.AbstractOperation.getOperationMetaData(AbstractOperation.java:80)
	at org.dbunit.operation.RefreshOperation.execute(RefreshOperation.java:98)
	at org.openmrs.test.BaseContextSensitiveTest.executeDataSet(BaseContextSensitiveTest.java:682)
	at org.openmrs.test.BaseContextSensitiveTest.executeDataSet(BaseContextSensitiveTest.java:577)
	at org.openmrs.test.BaseContextSensitiveTest.initializeInMemoryDatabase(BaseContextSensitiveTest.java:489)
	at org.openmrs.test.BaseContextSensitiveTest.baseSetupWithStandardDataAndAuthentication(BaseContextSensitiveTest.java:778)
(33 more lines...)
Collapse Failed ConceptFormControllerTest onSubmit_shouldVoidASynonymMarkedAsPreferredWhenItIsRemoved History
1 sec
org.dbunit.dataset.NoSuchTableException: person
	at org.dbunit.database.DatabaseDataSet.getTableMetaData(DatabaseDataSet.java:282)
	at org.dbunit.operation.AbstractOperation.getOperationMetaData(AbstractOperation.java:80)
	at org.dbunit.operation.RefreshOperation.execute(RefreshOperation.java:98)
	at org.openmrs.test.BaseContextSensitiveTest.executeDataSet(BaseContextSensitiveTest.java:682)
	at org.openmrs.test.BaseContextSensitiveTest.executeDataSet(BaseContextSensitiveTest.java:577)
	at org.openmrs.test.BaseContextSensitiveTest.initializeInMemoryDatabase(BaseContextSensitiveTest.java:489)
	at org.openmrs.test.BaseContextSensitiveTest.baseSetupWithStandardDataAndAuthentication(BaseContextSensitiveTest.java:778)
(33 more lines...)
Collapse Failed ConceptFormControllerTest shouldAddConceptWithAllNamingSpecified History
< 1 sec
org.dbunit.dataset.NoSuchTableException: person
	at org.dbunit.database.DatabaseDataSet.getTableMetaData(DatabaseDataSet.java:282)
	at org.dbunit.operation.AbstractOperation.getOperationMetaData(AbstractOperation.java:80)
	at org.dbunit.operation.RefreshOperation.execute(RefreshOperation.java:98)
	at org.openmrs.test.BaseContextSensitiveTest.executeDataSet(BaseContextSensitiveTest.java:682)
	at org.openmrs.test.BaseContextSensitiveTest.executeDataSet(BaseContextSensitiveTest.java:577)
	at org.openmrs.test.BaseContextSensitiveTest.initializeInMemoryDatabase(BaseContextSensitiveTest.java:489)
	at org.openmrs.test.BaseContextSensitiveTest.baseSetupWithStandardDataAndAuthentication(BaseContextSensitiveTest.java:778)
(33 more lines...)
Collapse Failed ConceptFormControllerTest shouldAddConceptWithNameAndShortNameAndDescriptionSpecifiedToCodeConcepts History
< 1 sec
org.dbunit.dataset.NoSuchTableException: person
	at org.dbunit.database.DatabaseDataSet.getTableMetaData(DatabaseDataSet.java:282)
	at org.dbunit.operation.AbstractOperation.getOperationMetaData(AbstractOperation.java:80)
	at org.dbunit.operation.RefreshOperation.execute(RefreshOperation.java:98)
	at org.openmrs.test.BaseContextSensitiveTest.executeDataSet(BaseContextSensitiveTest.java:682)
	at org.openmrs.test.BaseContextSensitiveTest.executeDataSet(BaseContextSensitiveTest.java:577)
	at org.openmrs.test.BaseContextSensitiveTest.initializeInMemoryDatabase(BaseContextSensitiveTest.java:489)
	at org.openmrs.test.BaseContextSensitiveTest.baseSetupWithStandardDataAndAuthentication(BaseContextSensitiveTest.java:778)
(33 more lines...)
Collapse Failed ConceptFormControllerTest shouldAddConceptWithNameAndShortNameAndDescriptionSpecifiedToNumericConcepts History
< 1 sec
org.dbunit.dataset.NoSuchTableException: person
	at org.dbunit.database.DatabaseDataSet.getTableMetaData(DatabaseDataSet.java:282)
	at org.dbunit.operation.AbstractOperation.getOperationMetaData(AbstractOperation.java:80)
	at org.dbunit.operation.RefreshOperation.execute(RefreshOperation.java:98)
	at org.openmrs.test.BaseContextSensitiveTest.executeDataSet(BaseContextSensitiveTest.java:682)
	at org.openmrs.test.BaseContextSensitiveTest.executeDataSet(BaseContextSensitiveTest.java:577)
	at org.openmrs.test.BaseContextSensitiveTest.initializeInMemoryDatabase(BaseContextSensitiveTest.java:489)
	at org.openmrs.test.BaseContextSensitiveTest.baseSetupWithStandardDataAndAuthentication(BaseContextSensitiveTest.java:778)
(33 more lines...)
Collapse Failed ConceptFormControllerTest shouldAddConceptWithNameAndShortNameSpecified History
< 1 sec
org.dbunit.dataset.NoSuchTableException: person
	at org.dbunit.database.DatabaseDataSet.getTableMetaData(DatabaseDataSet.java:282)
	at org.dbunit.operation.AbstractOperation.getOperationMetaData(AbstractOperation.java:80)
	at org.dbunit.operation.RefreshOperation.execute(RefreshOperation.java:98)
	at org.openmrs.test.BaseContextSensitiveTest.executeDataSet(BaseContextSensitiveTest.java:682)
	at org.openmrs.test.BaseContextSensitiveTest.executeDataSet(BaseContextSensitiveTest.java:577)
	at org.openmrs.test.BaseContextSensitiveTest.initializeInMemoryDatabase(BaseContextSensitiveTest.java:489)
	at org.openmrs.test.BaseContextSensitiveTest.baseSetupWithStandardDataAndAuthentication(BaseContextSensitiveTest.java:778)
(33 more lines...)
Collapse Failed ConceptFormControllerTest shouldAddConceptWithOnlyNameSpecified History
< 1 sec
org.dbunit.dataset.NoSuchTableException: person
	at org.dbunit.database.DatabaseDataSet.getTableMetaData(DatabaseDataSet.java:282)
	at org.dbunit.operation.AbstractOperation.getOperationMetaData(AbstractOperation.java:80)
	at org.dbunit.operation.RefreshOperation.execute(RefreshOperation.java:98)
	at org.openmrs.test.BaseContextSensitiveTest.executeDataSet(BaseContextSensitiveTest.java:682)
	at org.openmrs.test.BaseContextSensitiveTest.executeDataSet(BaseContextSensitiveTest.java:577)
	at org.openmrs.test.BaseContextSensitiveTest.initializeInMemoryDatabase(BaseContextSensitiveTest.java:489)
	at org.openmrs.test.BaseContextSensitiveTest.baseSetupWithStandardDataAndAuthentication(BaseContextSensitiveTest.java:778)
(33 more lines...)
Collapse Failed ConceptFormControllerTest shouldEditConceptComplex History
3 secs
org.dbunit.dataset.NoSuchTableException: person
	at org.dbunit.database.DatabaseDataSet.getTableMetaData(DatabaseDataSet.java:282)
	at org.dbunit.operation.AbstractOperation.getOperationMetaData(AbstractOperation.java:80)
	at org.dbunit.operation.RefreshOperation.execute(RefreshOperation.java:98)
	at org.openmrs.test.BaseContextSensitiveTest.executeDataSet(BaseContextSensitiveTest.java:682)
	at org.openmrs.test.BaseContextSensitiveTest.executeDataSet(BaseContextSensitiveTest.java:577)
	at org.openmrs.test.BaseContextSensitiveTest.initializeInMemoryDatabase(BaseContextSensitiveTest.java:489)
	at org.openmrs.test.BaseContextSensitiveTest.baseSetupWithStandardDataAndAuthentication(BaseContextSensitiveTest.java:778)
(33 more lines...)
Collapse Failed ConceptFormControllerTest shouldGetConcept History
< 1 sec
org.dbunit.dataset.NoSuchTableException: person
	at org.dbunit.database.DatabaseDataSet.getTableMetaData(DatabaseDataSet.java:282)
	at org.dbunit.operation.AbstractOperation.getOperationMetaData(AbstractOperation.java:80)
	at org.dbunit.operation.RefreshOperation.execute(RefreshOperation.java:98)
	at org.openmrs.test.BaseContextSensitiveTest.executeDataSet(BaseContextSensitiveTest.java:682)
	at org.openmrs.test.BaseContextSensitiveTest.executeDataSet(BaseContextSensitiveTest.java:577)
	at org.openmrs.test.BaseContextSensitiveTest.initializeInMemoryDatabase(BaseContextSensitiveTest.java:489)
	at org.openmrs.test.BaseContextSensitiveTest.baseSetupWithStandardDataAndAuthentication(BaseContextSensitiveTest.java:778)
(33 more lines...)
Collapse Failed ConceptFormControllerTest shouldNotDeleteConceptsWhenConceptsAreLocked History
< 1 sec
org.dbunit.dataset.NoSuchTableException: person
	at org.dbunit.database.DatabaseDataSet.getTableMetaData(DatabaseDataSet.java:282)
	at org.dbunit.operation.AbstractOperation.getOperationMetaData(AbstractOperation.java:80)
	at org.dbunit.operation.RefreshOperation.execute(RefreshOperation.java:98)
	at org.openmrs.test.BaseContextSensitiveTest.executeDataSet(BaseContextSensitiveTest.java:682)
	at org.openmrs.test.BaseContextSensitiveTest.executeDataSet(BaseContextSensitiveTest.java:577)
	at org.openmrs.test.BaseContextSensitiveTest.initializeInMemoryDatabase(BaseContextSensitiveTest.java:489)
	at org.openmrs.test.BaseContextSensitiveTest.baseSetupWithStandardDataAndAuthentication(BaseContextSensitiveTest.java:778)
(33 more lines...)
Collapse Failed ConceptFormControllerTest shouldRemoveConceptAnswer History
< 1 sec
org.dbunit.dataset.NoSuchTableException: person
	at org.dbunit.database.DatabaseDataSet.getTableMetaData(DatabaseDataSet.java:282)
	at org.dbunit.operation.AbstractOperation.getOperationMetaData(AbstractOperation.java:80)
	at org.dbunit.operation.RefreshOperation.execute(RefreshOperation.java:98)
	at org.openmrs.test.BaseContextSensitiveTest.executeDataSet(BaseContextSensitiveTest.java:682)
	at org.openmrs.test.BaseContextSensitiveTest.executeDataSet(BaseContextSensitiveTest.java:577)
	at org.openmrs.test.BaseContextSensitiveTest.initializeInMemoryDatabase(BaseContextSensitiveTest.java:489)
	at org.openmrs.test.BaseContextSensitiveTest.baseSetupWithStandardDataAndAuthentication(BaseContextSensitiveTest.java:778)
(33 more lines...)
Collapse Failed ConceptFormControllerTest shouldRemoveConceptAnswersIfDatatypeChangedFromCoded History
< 1 sec
org.dbunit.dataset.NoSuchTableException: person
	at org.dbunit.database.DatabaseDataSet.getTableMetaData(DatabaseDataSet.java:282)
	at org.dbunit.operation.AbstractOperation.getOperationMetaData(AbstractOperation.java:80)
	at org.dbunit.operation.RefreshOperation.execute(RefreshOperation.java:98)
	at org.openmrs.test.BaseContextSensitiveTest.executeDataSet(BaseContextSensitiveTest.java:682)
	at org.openmrs.test.BaseContextSensitiveTest.executeDataSet(BaseContextSensitiveTest.java:577)
	at org.openmrs.test.BaseContextSensitiveTest.initializeInMemoryDatabase(BaseContextSensitiveTest.java:489)
	at org.openmrs.test.BaseContextSensitiveTest.baseSetupWithStandardDataAndAuthentication(BaseContextSensitiveTest.java:778)
(33 more lines...)
Collapse Failed ConceptFormControllerTest shouldRemoveConceptSet History
< 1 sec
org.dbunit.dataset.NoSuchTableException: person
	at org.dbunit.database.DatabaseDataSet.getTableMetaData(DatabaseDataSet.java:282)
	at org.dbunit.operation.AbstractOperation.getOperationMetaData(AbstractOperation.java:80)
	at org.dbunit.operation.RefreshOperation.execute(RefreshOperation.java:98)
	at org.openmrs.test.BaseContextSensitiveTest.executeDataSet(BaseContextSensitiveTest.java:682)
	at org.openmrs.test.BaseContextSensitiveTest.executeDataSet(BaseContextSensitiveTest.java:577)
	at org.openmrs.test.BaseContextSensitiveTest.initializeInMemoryDatabase(BaseContextSensitiveTest.java:489)
	at org.openmrs.test.BaseContextSensitiveTest.baseSetupWithStandardDataAndAuthentication(BaseContextSensitiveTest.java:778)
(33 more lines...)
Collapse Failed ConceptFormControllerTest shouldReplacePreviousDescription History
< 1 sec
org.dbunit.dataset.NoSuchTableException: person
	at org.dbunit.database.DatabaseDataSet.getTableMetaData(DatabaseDataSet.java:282)
	at org.dbunit.operation.AbstractOperation.getOperationMetaData(AbstractOperation.java:80)
	at org.dbunit.operation.RefreshOperation.execute(RefreshOperation.java:98)
	at org.openmrs.test.BaseContextSensitiveTest.executeDataSet(BaseContextSensitiveTest.java:682)
	at org.openmrs.test.BaseContextSensitiveTest.executeDataSet(BaseContextSensitiveTest.java:577)
	at org.openmrs.test.BaseContextSensitiveTest.initializeInMemoryDatabase(BaseContextSensitiveTest.java:489)
	at org.openmrs.test.BaseContextSensitiveTest.baseSetupWithStandardDataAndAuthentication(BaseContextSensitiveTest.java:778)
(33 more lines...)
Collapse Failed ConceptFormControllerTest shouldUpdateConceptByAddingName History
< 1 sec
org.dbunit.dataset.NoSuchTableException: person
	at org.dbunit.database.DatabaseDataSet.getTableMetaData(DatabaseDataSet.java:282)
	at org.dbunit.operation.AbstractOperation.getOperationMetaData(AbstractOperation.java:80)
	at org.dbunit.operation.RefreshOperation.execute(RefreshOperation.java:98)
	at org.openmrs.test.BaseContextSensitiveTest.executeDataSet(BaseContextSensitiveTest.java:682)
	at org.openmrs.test.BaseContextSensitiveTest.executeDataSet(BaseContextSensitiveTest.java:577)
	at org.openmrs.test.BaseContextSensitiveTest.initializeInMemoryDatabase(BaseContextSensitiveTest.java:489)
	at org.openmrs.test.BaseContextSensitiveTest.baseSetupWithStandardDataAndAuthentication(BaseContextSensitiveTest.java:778)
(33 more lines...)
Collapse Failed ConceptFormControllerTest shouldUpdateConceptWithNameAlreadyInSynonymList History
< 1 sec
org.dbunit.dataset.NoSuchTableException: person
	at org.dbunit.database.DatabaseDataSet.getTableMetaData(DatabaseDataSet.java:282)
	at org.dbunit.operation.AbstractOperation.getOperationMetaData(AbstractOperation.java:80)
	at org.dbunit.operation.RefreshOperation.execute(RefreshOperation.java:98)
	at org.openmrs.test.BaseContextSensitiveTest.executeDataSet(BaseContextSensitiveTest.java:682)
	at org.openmrs.test.BaseContextSensitiveTest.executeDataSet(BaseContextSensitiveTest.java:577)
	at org.openmrs.test.BaseContextSensitiveTest.initializeInMemoryDatabase(BaseContextSensitiveTest.java:489)
	at org.openmrs.test.BaseContextSensitiveTest.baseSetupWithStandardDataAndAuthentication(BaseContextSensitiveTest.java:778)
(33 more lines...)
Collapse Failed ConceptFormControllerTest shouldUpdateConceptWithShortNameAlreadyInSynonymList History
< 1 sec
org.dbunit.dataset.NoSuchTableException: person
	at org.dbunit.database.DatabaseDataSet.getTableMetaData(DatabaseDataSet.java:282)
	at org.dbunit.operation.AbstractOperation.getOperationMetaData(AbstractOperation.java:80)
	at org.dbunit.operation.RefreshOperation.execute(RefreshOperation.java:98)
	at org.openmrs.test.BaseContextSensitiveTest.executeDataSet(BaseContextSensitiveTest.java:682)
	at org.openmrs.test.BaseContextSensitiveTest.executeDataSet(BaseContextSensitiveTest.java:577)
	at org.openmrs.test.BaseContextSensitiveTest.initializeInMemoryDatabase(BaseContextSensitiveTest.java:489)
	at org.openmrs.test.BaseContextSensitiveTest.baseSetupWithStandardDataAndAuthentication(BaseContextSensitiveTest.java:778)
(33 more lines...)
Collapse Failed ConceptFormControllerTest shouldVoidShortName History
< 1 sec
org.dbunit.dataset.NoSuchTableException: person
	at org.dbunit.database.DatabaseDataSet.getTableMetaData(DatabaseDataSet.java:282)
	at org.dbunit.operation.AbstractOperation.getOperationMetaData(AbstractOperation.java:80)
	at org.dbunit.operation.RefreshOperation.execute(RefreshOperation.java:98)
	at org.openmrs.test.BaseContextSensitiveTest.executeDataSet(BaseContextSensitiveTest.java:682)
	at org.openmrs.test.BaseContextSensitiveTest.executeDataSet(BaseContextSensitiveTest.java:577)
	at org.openmrs.test.BaseContextSensitiveTest.initializeInMemoryDatabase(BaseContextSensitiveTest.java:489)
	at org.openmrs.test.BaseContextSensitiveTest.baseSetupWithStandardDataAndAuthentication(BaseContextSensitiveTest.java:778)
(33 more lines...)
Collapse Failed ConceptFormControllerTest validateConceptReferenceTermUsesPersistedObjects_shouldAddErrorIfMapTypeIsNotSaved History
< 1 sec
org.dbunit.dataset.NoSuchTableException: person
	at org.dbunit.database.DatabaseDataSet.getTableMetaData(DatabaseDataSet.java:282)
	at org.dbunit.operation.AbstractOperation.getOperationMetaData(AbstractOperation.java:80)
	at org.dbunit.operation.RefreshOperation.execute(RefreshOperation.java:98)
	at org.openmrs.test.BaseContextSensitiveTest.executeDataSet(BaseContextSensitiveTest.java:682)
	at org.openmrs.test.BaseContextSensitiveTest.executeDataSet(BaseContextSensitiveTest.java:577)
	at org.openmrs.test.BaseContextSensitiveTest.initializeInMemoryDatabase(BaseContextSensitiveTest.java:489)
	at org.openmrs.test.BaseContextSensitiveTest.baseSetupWithStandardDataAndAuthentication(BaseContextSensitiveTest.java:778)
(33 more lines...)
Collapse Failed ConceptFormControllerTest validateConceptReferenceTermUsesPersistedObjects_shouldAddErrorIfSourceIsNotSaved History
< 1 sec
org.dbunit.dataset.NoSuchTableException: person
	at org.dbunit.database.DatabaseDataSet.getTableMetaData(DatabaseDataSet.java:282)
	at org.dbunit.operation.AbstractOperation.getOperationMetaData(AbstractOperation.java:80)
	at org.dbunit.operation.RefreshOperation.execute(RefreshOperation.java:98)
	at org.openmrs.test.BaseContextSensitiveTest.executeDataSet(BaseContextSensitiveTest.java:682)
	at org.openmrs.test.BaseContextSensitiveTest.executeDataSet(BaseContextSensitiveTest.java:577)
	at org.openmrs.test.BaseContextSensitiveTest.initializeInMemoryDatabase(BaseContextSensitiveTest.java:489)
	at org.openmrs.test.BaseContextSensitiveTest.baseSetupWithStandardDataAndAuthentication(BaseContextSensitiveTest.java:778)
(33 more lines...)
Collapse Failed ConceptFormControllerTest validateConceptReferenceTermUsesPersistedObjects_shouldAddErrorIfTermBIsNotSaved History
< 1 sec
org.dbunit.dataset.NoSuchTableException: person
	at org.dbunit.database.DatabaseDataSet.getTableMetaData(DatabaseDataSet.java:282)
	at org.dbunit.operation.AbstractOperation.getOperationMetaData(AbstractOperation.java:80)
	at org.dbunit.operation.RefreshOperation.execute(RefreshOperation.java:98)
	at org.openmrs.test.BaseContextSensitiveTest.executeDataSet(BaseContextSensitiveTest.java:682)
	at org.openmrs.test.BaseContextSensitiveTest.executeDataSet(BaseContextSensitiveTest.java:577)
	at org.openmrs.test.BaseContextSensitiveTest.initializeInMemoryDatabase(BaseContextSensitiveTest.java:489)
	at org.openmrs.test.BaseContextSensitiveTest.baseSetupWithStandardDataAndAuthentication(BaseContextSensitiveTest.java:778)
(33 more lines...)
Collapse Failed GlobalPropertyPortletControllerTest populateModel_shouldExcludeMultiplePrefixes History
< 1 sec
org.dbunit.dataset.NoSuchTableException: person
	at org.dbunit.database.DatabaseDataSet.getTableMetaData(DatabaseDataSet.java:282)
	at org.dbunit.operation.AbstractOperation.getOperationMetaData(AbstractOperation.java:80)
	at org.dbunit.operation.RefreshOperation.execute(RefreshOperation.java:98)
	at org.openmrs.test.BaseContextSensitiveTest.executeDataSet(BaseContextSensitiveTest.java:682)
	at org.openmrs.test.BaseContextSensitiveTest.executeDataSet(BaseContextSensitiveTest.java:577)
	at org.openmrs.test.BaseContextSensitiveTest.initializeInMemoryDatabase(BaseContextSensitiveTest.java:489)
	at org.openmrs.test.BaseContextSensitiveTest.baseSetupWithStandardDataAndAuthentication(BaseContextSensitiveTest.java:778)
(33 more lines...)
Collapse Failed GlobalPropertyPortletControllerTest setupModelForModule_shouldChangeModelIfForModuleIsPresent History
< 1 sec
org.dbunit.dataset.NoSuchTableException: person
	at org.dbunit.database.DatabaseDataSet.getTableMetaData(DatabaseDataSet.java:282)
	at org.dbunit.operation.AbstractOperation.getOperationMetaData(AbstractOperation.java:80)
	at org.dbunit.operation.RefreshOperation.execute(RefreshOperation.java:98)
	at org.openmrs.test.BaseContextSensitiveTest.executeDataSet(BaseContextSensitiveTest.java:682)
	at org.openmrs.test.BaseContextSensitiveTest.executeDataSet(BaseContextSensitiveTest.java:577)
	at org.openmrs.test.BaseContextSensitiveTest.initializeInMemoryDatabase(BaseContextSensitiveTest.java:489)
	at org.openmrs.test.BaseContextSensitiveTest.baseSetupWithStandardDataAndAuthentication(BaseContextSensitiveTest.java:778)
(33 more lines...)
Collapse Failed GlobalPropertyPortletControllerTest setupModelForModule_shouldNotChangeModeIfForModuleIsNotPresent History
< 1 sec
org.dbunit.dataset.NoSuchTableException: person
	at org.dbunit.database.DatabaseDataSet.getTableMetaData(DatabaseDataSet.java:282)
	at org.dbunit.operation.AbstractOperation.getOperationMetaData(AbstractOperation.java:80)
	at org.dbunit.operation.RefreshOperation.execute(RefreshOperation.java:98)
	at org.openmrs.test.BaseContextSensitiveTest.executeDataSet(BaseContextSensitiveTest.java:682)
	at org.openmrs.test.BaseContextSensitiveTest.executeDataSet(BaseContextSensitiveTest.java:577)
	at org.openmrs.test.BaseContextSensitiveTest.initializeInMemoryDatabase(BaseContextSensitiveTest.java:489)
	at org.openmrs.test.BaseContextSensitiveTest.baseSetupWithStandardDataAndAuthentication(BaseContextSensitiveTest.java:778)
(33 more lines...)

Error summary

The build generated some errors. See the full build log for more details.

[INFO] ------------------------------------------------------------------------
[ERROR] BUILD ERROR
[INFO] ------------------------------------------------------------------------
[INFO] Can not execute Sonar

Embedded error: Unable to execute Sonar
Alert thresholds have been hit (1 times).
[INFO] ------------------------------------------------------------------------
[INFO] For more information, run Maven with the -e switch