Build: #1344 failed Changes by teleivo <mrteleivo@gmail.com> and Daniel Kayiwa

Stages & jobs

  1. Build and Test

  2. Deploy

  3. Release

    Requires a user to start manually

Test results

  • 3,407 tests in total
  • 9 tests failed
  • 9 failures are new
  • 41 tests were quarantined / skipped
  • 7 minutes taken in total.
New test failures 9
Status Test View job Duration
Collapse Failed Database1_9_7UpgradeIT shouldUpgradeFromClean1_9To1_10 History
Integration Test 8 secs
java.io.IOException: liquibase.exception.MigrationFailedException: Migration failed for change set liquibase-update-to-latest.xml::TRUNK-4936-20160930-1000::teleivo:
     Reason: liquibase.exception.DatabaseException: Error executing SQL ALTER TABLE concept_reference_source ADD unique_id VARCHAR(250) UNIQUE: Syntax error in SQL statement "ALTER TABLE CONCEPT_REFERENCE_SOURCE ADD UNIQUE_ID VARCHAR(250) UNIQUE[*] "; SQL statement:
ALTER TABLE concept_reference_source ADD unique_id VARCHAR(250) UNIQUE [42000-187]:
          Caused By: Error executing SQL ALTER TABLE concept_reference_source ADD unique_id VARCHAR(250) UNIQUE: Syntax error in SQL statement "ALTER TABLE CONCEPT_REFERENCE_SOURCE ADD UNIQUE_ID VARCHAR(250) UNIQUE[*] "; SQL statement:
ALTER TABLE concept_reference_source ADD unique_id VARCHAR(250) UNIQUE [42000-187]:
          Caused By: Syntax error in SQL statement "ALTER TABLE CONCEPT_REFERENCE_SOURCE ADD UNIQUE_ID VARCHAR(250) UNIQUE[*] "; SQL statement:
ALTER TABLE concept_reference_source ADD unique_id VARCHAR(250) UNIQUE [42000-187]
	at org.h2.message.DbException.getJdbcSQLException(DbException.java:345)
(21 more lines...)
Collapse Failed Database1_9_7UpgradeIT shouldMigrateDrugOrders History
Integration Test 8 secs
java.io.IOException: liquibase.exception.MigrationFailedException: Migration failed for change set liquibase-update-to-latest.xml::TRUNK-4936-20160930-1000::teleivo:
     Reason: liquibase.exception.DatabaseException: Error executing SQL ALTER TABLE concept_reference_source ADD unique_id VARCHAR(250) UNIQUE: Syntax error in SQL statement "ALTER TABLE CONCEPT_REFERENCE_SOURCE ADD UNIQUE_ID VARCHAR(250) UNIQUE[*] "; SQL statement:
ALTER TABLE concept_reference_source ADD unique_id VARCHAR(250) UNIQUE [42000-187]:
          Caused By: Error executing SQL ALTER TABLE concept_reference_source ADD unique_id VARCHAR(250) UNIQUE: Syntax error in SQL statement "ALTER TABLE CONCEPT_REFERENCE_SOURCE ADD UNIQUE_ID VARCHAR(250) UNIQUE[*] "; SQL statement:
ALTER TABLE concept_reference_source ADD unique_id VARCHAR(250) UNIQUE [42000-187]:
          Caused By: Syntax error in SQL statement "ALTER TABLE CONCEPT_REFERENCE_SOURCE ADD UNIQUE_ID VARCHAR(250) UNIQUE[*] "; SQL statement:
ALTER TABLE concept_reference_source ADD unique_id VARCHAR(250) UNIQUE [42000-187]
	at org.h2.message.DbException.getJdbcSQLException(DbException.java:345)
(21 more lines...)
Collapse Failed Database1_9_7UpgradeIT shouldSetValuesToNullIfUnitsOrFrequencyBlank History
Integration Test 8 secs
java.io.IOException: liquibase.exception.MigrationFailedException: Migration failed for change set liquibase-update-to-latest.xml::TRUNK-4936-20160930-1000::teleivo:
     Reason: liquibase.exception.DatabaseException: Error executing SQL ALTER TABLE concept_reference_source ADD unique_id VARCHAR(250) UNIQUE: Syntax error in SQL statement "ALTER TABLE CONCEPT_REFERENCE_SOURCE ADD UNIQUE_ID VARCHAR(250) UNIQUE[*] "; SQL statement:
ALTER TABLE concept_reference_source ADD unique_id VARCHAR(250) UNIQUE [42000-187]:
          Caused By: Error executing SQL ALTER TABLE concept_reference_source ADD unique_id VARCHAR(250) UNIQUE: Syntax error in SQL statement "ALTER TABLE CONCEPT_REFERENCE_SOURCE ADD UNIQUE_ID VARCHAR(250) UNIQUE[*] "; SQL statement:
ALTER TABLE concept_reference_source ADD unique_id VARCHAR(250) UNIQUE [42000-187]:
          Caused By: Syntax error in SQL statement "ALTER TABLE CONCEPT_REFERENCE_SOURCE ADD UNIQUE_ID VARCHAR(250) UNIQUE[*] "; SQL statement:
ALTER TABLE concept_reference_source ADD unique_id VARCHAR(250) UNIQUE [42000-187]
	at org.h2.message.DbException.getJdbcSQLException(DbException.java:345)
(21 more lines...)
Collapse Failed Database1_9_7UpgradeIT shouldPassIfAllExistingDrugOrderUnitsAndFrequenciesAreMappedToConcepts History
Integration Test 9 secs
java.io.IOException: liquibase.exception.MigrationFailedException: Migration failed for change set liquibase-update-to-latest.xml::TRUNK-4936-20160930-1000::teleivo:
     Reason: liquibase.exception.DatabaseException: Error executing SQL ALTER TABLE concept_reference_source ADD unique_id VARCHAR(250) UNIQUE: Syntax error in SQL statement "ALTER TABLE CONCEPT_REFERENCE_SOURCE ADD UNIQUE_ID VARCHAR(250) UNIQUE[*] "; SQL statement:
ALTER TABLE concept_reference_source ADD unique_id VARCHAR(250) UNIQUE [42000-187]:
          Caused By: Error executing SQL ALTER TABLE concept_reference_source ADD unique_id VARCHAR(250) UNIQUE: Syntax error in SQL statement "ALTER TABLE CONCEPT_REFERENCE_SOURCE ADD UNIQUE_ID VARCHAR(250) UNIQUE[*] "; SQL statement:
ALTER TABLE concept_reference_source ADD unique_id VARCHAR(250) UNIQUE [42000-187]:
          Caused By: Syntax error in SQL statement "ALTER TABLE CONCEPT_REFERENCE_SOURCE ADD UNIQUE_ID VARCHAR(250) UNIQUE[*] "; SQL statement:
ALTER TABLE concept_reference_source ADD unique_id VARCHAR(250) UNIQUE [42000-187]
	at org.h2.message.DbException.getJdbcSQLException(DbException.java:345)
(21 more lines...)
Collapse Failed Database1_9_7UpgradeIT shouldPassIfThereAreAnyOrderTypesInTheDatabaseOtherThanDrugOrderTypeAndTheNewColumnsExist History
Integration Test 8 secs
java.io.IOException: liquibase.exception.MigrationFailedException: Migration failed for change set liquibase-update-to-latest.xml::TRUNK-4936-20160930-1000::teleivo:
     Reason: liquibase.exception.DatabaseException: Error executing SQL ALTER TABLE concept_reference_source ADD unique_id VARCHAR(250) UNIQUE: Syntax error in SQL statement "ALTER TABLE CONCEPT_REFERENCE_SOURCE ADD UNIQUE_ID VARCHAR(250) UNIQUE[*] "; SQL statement:
ALTER TABLE concept_reference_source ADD unique_id VARCHAR(250) UNIQUE [42000-187]:
          Caused By: Error executing SQL ALTER TABLE concept_reference_source ADD unique_id VARCHAR(250) UNIQUE: Syntax error in SQL statement "ALTER TABLE CONCEPT_REFERENCE_SOURCE ADD UNIQUE_ID VARCHAR(250) UNIQUE[*] "; SQL statement:
ALTER TABLE concept_reference_source ADD unique_id VARCHAR(250) UNIQUE [42000-187]:
          Caused By: Syntax error in SQL statement "ALTER TABLE CONCEPT_REFERENCE_SOURCE ADD UNIQUE_ID VARCHAR(250) UNIQUE[*] "; SQL statement:
ALTER TABLE concept_reference_source ADD unique_id VARCHAR(250) UNIQUE [42000-187]
	at org.h2.message.DbException.getJdbcSQLException(DbException.java:345)
(21 more lines...)
Collapse Failed Database1_9_7UpgradeIT shouldConvertOrderersToBeingProvidersInsteadOfUsers History
Integration Test 12 secs
java.io.IOException: liquibase.exception.MigrationFailedException: Migration failed for change set liquibase-update-to-latest.xml::TRUNK-4936-20160930-1000::teleivo:
     Reason: liquibase.exception.DatabaseException: Error executing SQL ALTER TABLE concept_reference_source ADD unique_id VARCHAR(250) UNIQUE: Syntax error in SQL statement "ALTER TABLE CONCEPT_REFERENCE_SOURCE ADD UNIQUE_ID VARCHAR(250) UNIQUE[*] "; SQL statement:
ALTER TABLE concept_reference_source ADD unique_id VARCHAR(250) UNIQUE [42000-187]:
          Caused By: Error executing SQL ALTER TABLE concept_reference_source ADD unique_id VARCHAR(250) UNIQUE: Syntax error in SQL statement "ALTER TABLE CONCEPT_REFERENCE_SOURCE ADD UNIQUE_ID VARCHAR(250) UNIQUE[*] "; SQL statement:
ALTER TABLE concept_reference_source ADD unique_id VARCHAR(250) UNIQUE [42000-187]:
          Caused By: Syntax error in SQL statement "ALTER TABLE CONCEPT_REFERENCE_SOURCE ADD UNIQUE_ID VARCHAR(250) UNIQUE[*] "; SQL statement:
ALTER TABLE concept_reference_source ADD unique_id VARCHAR(250) UNIQUE [42000-187]
	at org.h2.message.DbException.getJdbcSQLException(DbException.java:345)
(21 more lines...)
Collapse Failed Database1_9_7UpgradeIT shouldAddTheNecessaryPrivilegesAndAssignThemToSpecificRoles History
Integration Test 8 secs
java.io.IOException: liquibase.exception.MigrationFailedException: Migration failed for change set liquibase-update-to-latest.xml::TRUNK-4936-20160930-1000::teleivo:
     Reason: liquibase.exception.DatabaseException: Error executing SQL ALTER TABLE concept_reference_source ADD unique_id VARCHAR(250) UNIQUE: Syntax error in SQL statement "ALTER TABLE CONCEPT_REFERENCE_SOURCE ADD UNIQUE_ID VARCHAR(250) UNIQUE[*] "; SQL statement:
ALTER TABLE concept_reference_source ADD unique_id VARCHAR(250) UNIQUE [42000-187]:
          Caused By: Error executing SQL ALTER TABLE concept_reference_source ADD unique_id VARCHAR(250) UNIQUE: Syntax error in SQL statement "ALTER TABLE CONCEPT_REFERENCE_SOURCE ADD UNIQUE_ID VARCHAR(250) UNIQUE[*] "; SQL statement:
ALTER TABLE concept_reference_source ADD unique_id VARCHAR(250) UNIQUE [42000-187]:
          Caused By: Syntax error in SQL statement "ALTER TABLE CONCEPT_REFERENCE_SOURCE ADD UNIQUE_ID VARCHAR(250) UNIQUE[*] "; SQL statement:
ALTER TABLE concept_reference_source ADD unique_id VARCHAR(250) UNIQUE [42000-187]
	at org.h2.message.DbException.getJdbcSQLException(DbException.java:345)
(21 more lines...)
Collapse Failed Database1_9_7UpgradeIT shouldConcatenateDoseStrengthAndUnits History
Integration Test 10 secs
java.io.IOException: liquibase.exception.MigrationFailedException: Migration failed for change set liquibase-update-to-latest.xml::TRUNK-4936-20160930-1000::teleivo:
     Reason: liquibase.exception.DatabaseException: Error executing SQL ALTER TABLE concept_reference_source ADD unique_id VARCHAR(250) UNIQUE: Syntax error in SQL statement "ALTER TABLE CONCEPT_REFERENCE_SOURCE ADD UNIQUE_ID VARCHAR(250) UNIQUE[*] "; SQL statement:
ALTER TABLE concept_reference_source ADD unique_id VARCHAR(250) UNIQUE [42000-187]:
          Caused By: Error executing SQL ALTER TABLE concept_reference_source ADD unique_id VARCHAR(250) UNIQUE: Syntax error in SQL statement "ALTER TABLE CONCEPT_REFERENCE_SOURCE ADD UNIQUE_ID VARCHAR(250) UNIQUE[*] "; SQL statement:
ALTER TABLE concept_reference_source ADD unique_id VARCHAR(250) UNIQUE [42000-187]:
          Caused By: Syntax error in SQL statement "ALTER TABLE CONCEPT_REFERENCE_SOURCE ADD UNIQUE_ID VARCHAR(250) UNIQUE[*] "; SQL statement:
ALTER TABLE concept_reference_source ADD unique_id VARCHAR(250) UNIQUE [42000-187]
	at org.h2.message.DbException.getJdbcSQLException(DbException.java:345)
(21 more lines...)
Collapse Failed Database1_9_7UpgradeIT shouldCreateDiscontinuationOrderForStoppedOrders History
Integration Test 8 secs
java.io.IOException: liquibase.exception.MigrationFailedException: Migration failed for change set liquibase-update-to-latest.xml::TRUNK-4936-20160930-1000::teleivo:
     Reason: liquibase.exception.DatabaseException: Error executing SQL ALTER TABLE concept_reference_source ADD unique_id VARCHAR(250) UNIQUE: Syntax error in SQL statement "ALTER TABLE CONCEPT_REFERENCE_SOURCE ADD UNIQUE_ID VARCHAR(250) UNIQUE[*] "; SQL statement:
ALTER TABLE concept_reference_source ADD unique_id VARCHAR(250) UNIQUE [42000-187]:
          Caused By: Error executing SQL ALTER TABLE concept_reference_source ADD unique_id VARCHAR(250) UNIQUE: Syntax error in SQL statement "ALTER TABLE CONCEPT_REFERENCE_SOURCE ADD UNIQUE_ID VARCHAR(250) UNIQUE[*] "; SQL statement:
ALTER TABLE concept_reference_source ADD unique_id VARCHAR(250) UNIQUE [42000-187]:
          Caused By: Syntax error in SQL statement "ALTER TABLE CONCEPT_REFERENCE_SOURCE ADD UNIQUE_ID VARCHAR(250) UNIQUE[*] "; SQL statement:
ALTER TABLE concept_reference_source ADD unique_id VARCHAR(250) UNIQUE [42000-187]
	at org.h2.message.DbException.getJdbcSQLException(DbException.java:345)
(21 more lines...)
Skipped tests 41
Status Test Failing since View job
Skipped ObsBehaviorTest shouldVoidAndReplaceOnlyEditedUnvoidedObsWhenTheyAreFlushedToTheDatabase History
Build and Test
Skipped OpenmrsProfileExcludeFilterTest shouldBeIgnoredIfOpenmrsVersionDoesNotMatch History
Build and Test
Skipped OpenmrsProfileExcludeFilterTest shouldBeIgnoredIfModuleDoesNotMatch History
Build and Test
Skipped AdministrationServiceTest setImplementationId_shouldOverwriteImplementationIdInDatabaseIfExists History
Build and Test
Skipped AdministrationServiceTest setImplementationId_shouldSetUuidOnImplementationIdGlobalProperty History
Build and Test
Skipped AdministrationServiceTest getPresentationLocales_shouldReturnAtLeastOneLocaleIfNoLocalesDefinedInDatabaseYet History
Build and Test
Skipped AdministrationServiceTest setImplementationId_shouldCreateImplementationIdInDatabase History
Build and Test
Skipped ConceptServiceTest saveConcept_shouldNotSetAuditInfoIfTheConceptIsNotEdited History
Build and Test
Skipped EncounterServiceTest getEncounters_shouldGetAllTheUniqueEncountersThatMatchTheSpecifiedParameterValues History
Build and Test
Skipped EncounterServiceTest getEncounters_shouldNotReturnVoidedEncountersIfIncludeVoidedIsSetToTrue History
Build and Test
Skipped OpenmrsServiceTest shouldCheckThatAMethodIsNotRolledBackInCaseOfAnErrorInAnotherInvokedInsideIt History
Build and Test
Skipped OrderServiceTest saveOrder_shouldFailForRevisionOrderIfAnActiveDrugOrderForTheSameConceptAndCareSettingsExists History
Build and Test
Skipped OrderServiceTest saveOrder_shouldSaveRevisionOrderScheduledOnDateNotOverlappingWithAnActiveOrderForTheSameConceptAndCareSetting History
Build and Test
Skipped OrderServiceTest saveOrder_shouldPassForRevisionOrderIfAnActiveTestOrderForTheSameConceptAndCareSettingsExists History
Build and Test
Skipped PatientServiceTest voidPatient_shouldReturnNullWhenPatientIsNull History
Build and Test
Skipped ProviderServiceTest getCountOfProviders_shouldExcludeRetiredProviders History
Build and Test
Skipped ProviderServiceTest getCountOfProviders_shouldIncludeRetiredProvidersIfIncludeRetiredIsSetToTrue History
Build and Test
Skipped UserServiceTest changeQuestionAnswer_shouldChangeTheSecretQuestionAndAnswerForGivenUser History
Build and Test
Skipped ConceptDAOTest getConcepts_shouldReturnCorrectResultsIfAConceptNameContainsSameWordMoreThanOnce History
Build and Test
Skipped ConceptDAOTest getConcepts_shouldReturnCorrectResultsForConceptWithNamesThatContainsWordsWithMoreWeight History
Build and Test
Skipped SerializedObjectDAOTest org.openmrs.api.db.SerializedObjectDAOTest History
Build and Test
Skipped HL7ServiceTest processHL7InQueue_shouldParseOruR01MessageUsingOverriddenParserProvidedByAModule History
Build and Test
Skipped HL7ServiceTest processHL7Message_shouldParseMessageTypeSuppliedByModule History
Build and Test
Skipped ModuleUtilIT getURL_shouldReturnAnUpdateRdfPageForModuleUrls History
Integration Test
Skipped ModuleUtilIT getURL_shouldReturnAnUpdateRdfPageForOldHttpsModuleUrls History
Integration Test
Skipped ModuleUtilIT getURL_shouldReturnAnUpdateRdfPageForOldHttpsDevUrls History
Integration Test
Skipped SchedulerServiceTest org.openmrs.scheduler.SchedulerServiceTest History
Build and Test
Skipped ConceptReferenceTermValidatorTest validate_shouldFailIfTheNameIsAnEmptyString History
Build and Test
Skipped ConceptReferenceTermValidatorTest validate_shouldFailIfTheNameIsNull History
Build and Test
Skipped ConceptReferenceTermValidatorTest validate_shouldFailIfTheNameIsAWhiteSpaceCharacter History
Build and Test
Skipped PersonNameValidatorTest validate_shouldFailValidationIfPersonNameFamilyNameHasTrailingSpaces History
Build and Test
Skipped PersonNameValidatorTest validate_shouldFailValidationIfPersonNameMiddleNameHasTrailingSpaces History
Build and Test
Skipped PersonNameValidatorTest validate_shouldFailValidationIfPersonNameGivenNameHasTrailingSpaces History
Build and Test
Skipped PersonNameValidatorTest validate_shouldFailValidationIfPersonNameFamilyNameHasLeadingSpaces History
Build and Test
Skipped PersonNameValidatorTest validate_shouldFailValidationIfPersonNameMiddleNameHasLeadingSpaces History
Build and Test
Skipped PersonNameValidatorTest validate_shouldFailValidationIfPersonNameFamilyName2HasTrailingSpaces History
Build and Test
Skipped PersonNameValidatorTest validate_shouldFailValidationIfPersonNameFamilyName2HasLeadingSpaces History
Build and Test
Skipped PersonNameValidatorTest validate_shouldFailValidationIfPersonNameGivenNameHasLeadingSpaces History
Build and Test
Skipped VisitValidatorTest validate_shouldFailIfAnAttributeIsBad History
Build and Test
Skipped FilterUtilTest storeLocale_shouldStoreLocale History
Build and Test
Skipped FilterUtilTest storeLocale_shouldRestoreLocale History
Build and Test