Build: #271 failed Changes by Daniel Kayiwa

Build result summary

Details

Completed
Duration
37 minutes
Labels
None
Revision
c057f4e12e93db21d477a76b80610aa4bbcd277d c057f4e12e93db21d477a76b80610aa4bbcd277d
Total tests
2648
Fixed in
#272 (Rebuilt once)

Tests

Code commits

Author Commit Message Commit date
Daniel Kayiwa Daniel Kayiwa c057f4e12e93db21d477a76b80610aa4bbcd277d c057f4e12e93db21d477a76b80610aa4bbcd277d Merge pull request #552 from mszukalski/TRUNK-4223
TRUNK-4223: SonarQube - instanceof will always return true[d31bfa5_BAM_file_list]
[d31bfa5_BAM_hash]709df1844b5890abce5a6e2eb4a8e28b21df6e65
[d31bfa5_BAM_commiter_name]Marek Szukalski
[d31bfa5_BAM_commiter_email]mszukalski@soldevelo.com
[d31bfa5_BAM_timestamp]1389963943
[d31bfa5_BAM_commit_message]TRUNK-4223: SonarQube - instanceof will always return true

Configuration changes

Some of the jobs or stages referenced by this result no longer exist.

Restarting failed/incomplete builds only is not possible as some of the affected jobs no longer exist.

Tests

New test failures 234
Status Test View job Duration
Collapse Failed SchedulerFormControllerTest onSubmit_shouldNotRescheduleAnExecutingTask History
Build and Test < 1 sec
org.dbunit.dataset.NoSuchTableException: person
	at org.dbunit.database.DatabaseDataSet.getTableMetaData(DatabaseDataSet.java:282)
	at org.dbunit.operation.AbstractOperation.getOperationMetaData(AbstractOperation.java:80)
	at org.dbunit.operation.RefreshOperation.execute(RefreshOperation.java:98)
	at org.openmrs.test.BaseContextSensitiveTest.executeDataSet(BaseContextSensitiveTest.java:682)
	at org.openmrs.test.BaseContextSensitiveTest.executeDataSet(BaseContextSensitiveTest.java:577)
	at org.openmrs.test.BaseContextSensitiveTest.initializeInMemoryDatabase(BaseContextSensitiveTest.java:489)
	at org.openmrs.test.BaseContextSensitiveTest.baseSetupWithStandardDataAndAuthentication(BaseContextSensitiveTest.java:778)
(33 more lines...)
Collapse Failed SchedulerFormControllerTest onSubmit_shouldRescheduleACurrentlyScheduledTask History
Build and Test 2 secs
org.dbunit.dataset.NoSuchTableException: person
	at org.dbunit.database.DatabaseDataSet.getTableMetaData(DatabaseDataSet.java:282)
	at org.dbunit.operation.AbstractOperation.getOperationMetaData(AbstractOperation.java:80)
	at org.dbunit.operation.RefreshOperation.execute(RefreshOperation.java:98)
	at org.openmrs.test.BaseContextSensitiveTest.executeDataSet(BaseContextSensitiveTest.java:682)
	at org.openmrs.test.BaseContextSensitiveTest.executeDataSet(BaseContextSensitiveTest.java:577)
	at org.openmrs.test.BaseContextSensitiveTest.initializeInMemoryDatabase(BaseContextSensitiveTest.java:489)
	at org.openmrs.test.BaseContextSensitiveTest.baseSetupWithStandardDataAndAuthentication(BaseContextSensitiveTest.java:778)
(33 more lines...)
Collapse Failed SchedulerFormControllerTest onSubmit_shouldNotRescheduleATaskThatIsNotCurrentlyScheduled History
Build and Test < 1 sec
org.dbunit.dataset.NoSuchTableException: person
	at org.dbunit.database.DatabaseDataSet.getTableMetaData(DatabaseDataSet.java:282)
	at org.dbunit.operation.AbstractOperation.getOperationMetaData(AbstractOperation.java:80)
	at org.dbunit.operation.RefreshOperation.execute(RefreshOperation.java:98)
	at org.openmrs.test.BaseContextSensitiveTest.executeDataSet(BaseContextSensitiveTest.java:682)
	at org.openmrs.test.BaseContextSensitiveTest.executeDataSet(BaseContextSensitiveTest.java:577)
	at org.openmrs.test.BaseContextSensitiveTest.initializeInMemoryDatabase(BaseContextSensitiveTest.java:489)
	at org.openmrs.test.BaseContextSensitiveTest.baseSetupWithStandardDataAndAuthentication(BaseContextSensitiveTest.java:778)
(33 more lines...)
Collapse Failed SchedulerFormTest addANewTaskShouldNotError History
Build and Test < 1 sec
org.dbunit.dataset.NoSuchTableException: person
	at org.dbunit.database.DatabaseDataSet.getTableMetaData(DatabaseDataSet.java:282)
	at org.dbunit.operation.AbstractOperation.getOperationMetaData(AbstractOperation.java:80)
	at org.dbunit.operation.RefreshOperation.execute(RefreshOperation.java:98)
	at org.openmrs.test.BaseContextSensitiveTest.executeDataSet(BaseContextSensitiveTest.java:682)
	at org.openmrs.test.BaseContextSensitiveTest.executeDataSet(BaseContextSensitiveTest.java:577)
	at org.openmrs.test.BaseContextSensitiveTest.initializeInMemoryDatabase(BaseContextSensitiveTest.java:489)
	at org.openmrs.test.BaseContextSensitiveTest.baseSetupWithStandardDataAndAuthentication(BaseContextSensitiveTest.java:778)
(33 more lines...)
Collapse Failed TaskHelperTest waitUntilTaskIsExecuting_shouldRaiseATimeoutExceptionWhenTheTimeoutIsExceeded History
Build and Test < 1 sec
org.dbunit.dataset.NoSuchTableException: person
	at org.dbunit.database.DatabaseDataSet.getTableMetaData(DatabaseDataSet.java:282)
	at org.dbunit.operation.AbstractOperation.getOperationMetaData(AbstractOperation.java:80)
	at org.dbunit.operation.RefreshOperation.execute(RefreshOperation.java:98)
	at org.openmrs.test.BaseContextSensitiveTest.executeDataSet(BaseContextSensitiveTest.java:682)
	at org.openmrs.test.BaseContextSensitiveTest.executeDataSet(BaseContextSensitiveTest.java:577)
	at org.openmrs.test.BaseContextSensitiveTest.initializeInMemoryDatabase(BaseContextSensitiveTest.java:489)
	at org.openmrs.test.BaseContextSensitiveTest.baseSetupWithStandardDataAndAuthentication(BaseContextSensitiveTest.java:778)
(33 more lines...)
Collapse Failed TaskHelperTest getTime_shouldGetATimeInTheFuture History
Build and Test < 1 sec
org.dbunit.dataset.NoSuchTableException: person
	at org.dbunit.database.DatabaseDataSet.getTableMetaData(DatabaseDataSet.java:282)
	at org.dbunit.operation.AbstractOperation.getOperationMetaData(AbstractOperation.java:80)
	at org.dbunit.operation.RefreshOperation.execute(RefreshOperation.java:98)
	at org.openmrs.test.BaseContextSensitiveTest.executeDataSet(BaseContextSensitiveTest.java:682)
	at org.openmrs.test.BaseContextSensitiveTest.executeDataSet(BaseContextSensitiveTest.java:577)
	at org.openmrs.test.BaseContextSensitiveTest.initializeInMemoryDatabase(BaseContextSensitiveTest.java:489)
	at org.openmrs.test.BaseContextSensitiveTest.baseSetupWithStandardDataAndAuthentication(BaseContextSensitiveTest.java:778)
(33 more lines...)
Collapse Failed TaskHelperTest getUnscheduledTaskDefinition_shouldReturnATaskThatHasNotBeenStarted History
Build and Test < 1 sec
org.dbunit.dataset.NoSuchTableException: person
	at org.dbunit.database.DatabaseDataSet.getTableMetaData(DatabaseDataSet.java:282)
	at org.dbunit.operation.AbstractOperation.getOperationMetaData(AbstractOperation.java:80)
	at org.dbunit.operation.RefreshOperation.execute(RefreshOperation.java:98)
	at org.openmrs.test.BaseContextSensitiveTest.executeDataSet(BaseContextSensitiveTest.java:682)
	at org.openmrs.test.BaseContextSensitiveTest.executeDataSet(BaseContextSensitiveTest.java:577)
	at org.openmrs.test.BaseContextSensitiveTest.initializeInMemoryDatabase(BaseContextSensitiveTest.java:489)
	at org.openmrs.test.BaseContextSensitiveTest.baseSetupWithStandardDataAndAuthentication(BaseContextSensitiveTest.java:778)
(33 more lines...)
Collapse Failed TaskHelperTest getTime_shouldGetATimeInThePast History
Build and Test < 1 sec
org.dbunit.dataset.NoSuchTableException: person
	at org.dbunit.database.DatabaseDataSet.getTableMetaData(DatabaseDataSet.java:282)
	at org.dbunit.operation.AbstractOperation.getOperationMetaData(AbstractOperation.java:80)
	at org.dbunit.operation.RefreshOperation.execute(RefreshOperation.java:98)
	at org.openmrs.test.BaseContextSensitiveTest.executeDataSet(BaseContextSensitiveTest.java:682)
	at org.openmrs.test.BaseContextSensitiveTest.executeDataSet(BaseContextSensitiveTest.java:577)
	at org.openmrs.test.BaseContextSensitiveTest.initializeInMemoryDatabase(BaseContextSensitiveTest.java:489)
	at org.openmrs.test.BaseContextSensitiveTest.baseSetupWithStandardDataAndAuthentication(BaseContextSensitiveTest.java:778)
(33 more lines...)
Collapse Failed TaskHelperTest getScheduledTaskDefinition_shouldReturnATaskThatHasBeenStarted History
Build and Test < 1 sec
org.dbunit.dataset.NoSuchTableException: person
	at org.dbunit.database.DatabaseDataSet.getTableMetaData(DatabaseDataSet.java:282)
	at org.dbunit.operation.AbstractOperation.getOperationMetaData(AbstractOperation.java:80)
	at org.dbunit.operation.RefreshOperation.execute(RefreshOperation.java:98)
	at org.openmrs.test.BaseContextSensitiveTest.executeDataSet(BaseContextSensitiveTest.java:682)
	at org.openmrs.test.BaseContextSensitiveTest.executeDataSet(BaseContextSensitiveTest.java:577)
	at org.openmrs.test.BaseContextSensitiveTest.initializeInMemoryDatabase(BaseContextSensitiveTest.java:489)
	at org.openmrs.test.BaseContextSensitiveTest.baseSetupWithStandardDataAndAuthentication(BaseContextSensitiveTest.java:778)
(33 more lines...)
Collapse Failed TaskHelperTest waitUntilTaskIsExecuting_shouldWaitUntilTaskIsExecuting History
Build and Test < 1 sec
org.dbunit.dataset.NoSuchTableException: person
	at org.dbunit.database.DatabaseDataSet.getTableMetaData(DatabaseDataSet.java:282)
	at org.dbunit.operation.AbstractOperation.getOperationMetaData(AbstractOperation.java:80)
	at org.dbunit.operation.RefreshOperation.execute(RefreshOperation.java:98)
	at org.openmrs.test.BaseContextSensitiveTest.executeDataSet(BaseContextSensitiveTest.java:682)
	at org.openmrs.test.BaseContextSensitiveTest.executeDataSet(BaseContextSensitiveTest.java:577)
	at org.openmrs.test.BaseContextSensitiveTest.initializeInMemoryDatabase(BaseContextSensitiveTest.java:489)
	at org.openmrs.test.BaseContextSensitiveTest.baseSetupWithStandardDataAndAuthentication(BaseContextSensitiveTest.java:778)
(33 more lines...)
Collapse Failed ForgotPasswordFormControllerTest shouldNotAuthenticateAsUserWithValidSecretQuestion History
Build and Test < 1 sec
org.dbunit.dataset.NoSuchTableException: person
	at org.dbunit.database.DatabaseDataSet.getTableMetaData(DatabaseDataSet.java:282)
	at org.dbunit.operation.AbstractOperation.getOperationMetaData(AbstractOperation.java:80)
	at org.dbunit.operation.RefreshOperation.execute(RefreshOperation.java:98)
	at org.openmrs.test.BaseContextSensitiveTest.executeDataSet(BaseContextSensitiveTest.java:682)
	at org.openmrs.test.BaseContextSensitiveTest.executeDataSet(BaseContextSensitiveTest.java:577)
	at org.openmrs.test.BaseContextSensitiveTest.initializeInMemoryDatabase(BaseContextSensitiveTest.java:489)
	at org.openmrs.test.BaseContextSensitiveTest.baseSetupWithStandardDataAndAuthentication(BaseContextSensitiveTest.java:778)
(34 more lines...)
Collapse Failed ForgotPasswordFormControllerTest shouldLoadPageNormallyWithNoInput History
Build and Test < 1 sec
org.dbunit.dataset.NoSuchTableException: person
	at org.dbunit.database.DatabaseDataSet.getTableMetaData(DatabaseDataSet.java:282)
	at org.dbunit.operation.AbstractOperation.getOperationMetaData(AbstractOperation.java:80)
	at org.dbunit.operation.RefreshOperation.execute(RefreshOperation.java:98)
	at org.openmrs.test.BaseContextSensitiveTest.executeDataSet(BaseContextSensitiveTest.java:682)
	at org.openmrs.test.BaseContextSensitiveTest.executeDataSet(BaseContextSensitiveTest.java:577)
	at org.openmrs.test.BaseContextSensitiveTest.initializeInMemoryDatabase(BaseContextSensitiveTest.java:489)
	at org.openmrs.test.BaseContextSensitiveTest.baseSetupWithStandardDataAndAuthentication(BaseContextSensitiveTest.java:778)
(34 more lines...)
Collapse Failed ForgotPasswordFormControllerTest shouldGiveUserFiveSecretAnswerAttemptsAfterLessThanFiveFailedUsernameAttempts History
Build and Test < 1 sec
org.dbunit.dataset.NoSuchTableException: person
	at org.dbunit.database.DatabaseDataSet.getTableMetaData(DatabaseDataSet.java:282)
	at org.dbunit.operation.AbstractOperation.getOperationMetaData(AbstractOperation.java:80)
	at org.dbunit.operation.RefreshOperation.execute(RefreshOperation.java:98)
	at org.openmrs.test.BaseContextSensitiveTest.executeDataSet(BaseContextSensitiveTest.java:682)
	at org.openmrs.test.BaseContextSensitiveTest.executeDataSet(BaseContextSensitiveTest.java:577)
	at org.openmrs.test.BaseContextSensitiveTest.initializeInMemoryDatabase(BaseContextSensitiveTest.java:489)
	at org.openmrs.test.BaseContextSensitiveTest.baseSetupWithStandardDataAndAuthentication(BaseContextSensitiveTest.java:778)
(34 more lines...)
Collapse Failed ForgotPasswordFormControllerTest shouldAuthenticateAsUserWithValidSecretQuestion History
Build and Test < 1 sec
org.dbunit.dataset.NoSuchTableException: person
	at org.dbunit.database.DatabaseDataSet.getTableMetaData(DatabaseDataSet.java:282)
	at org.dbunit.operation.AbstractOperation.getOperationMetaData(AbstractOperation.java:80)
	at org.dbunit.operation.RefreshOperation.execute(RefreshOperation.java:98)
	at org.openmrs.test.BaseContextSensitiveTest.executeDataSet(BaseContextSensitiveTest.java:682)
	at org.openmrs.test.BaseContextSensitiveTest.executeDataSet(BaseContextSensitiveTest.java:577)
	at org.openmrs.test.BaseContextSensitiveTest.initializeInMemoryDatabase(BaseContextSensitiveTest.java:489)
	at org.openmrs.test.BaseContextSensitiveTest.baseSetupWithStandardDataAndAuthentication(BaseContextSensitiveTest.java:778)
(34 more lines...)
Collapse Failed ForgotPasswordFormControllerTest shouldNotAuthenticateAfterFiveFailedInvalidUsernames History
Build and Test < 1 sec
org.dbunit.dataset.NoSuchTableException: person
	at org.dbunit.database.DatabaseDataSet.getTableMetaData(DatabaseDataSet.java:282)
	at org.dbunit.operation.AbstractOperation.getOperationMetaData(AbstractOperation.java:80)
	at org.dbunit.operation.RefreshOperation.execute(RefreshOperation.java:98)
	at org.openmrs.test.BaseContextSensitiveTest.executeDataSet(BaseContextSensitiveTest.java:682)
	at org.openmrs.test.BaseContextSensitiveTest.executeDataSet(BaseContextSensitiveTest.java:577)
	at org.openmrs.test.BaseContextSensitiveTest.initializeInMemoryDatabase(BaseContextSensitiveTest.java:489)
	at org.openmrs.test.BaseContextSensitiveTest.baseSetupWithStandardDataAndAuthentication(BaseContextSensitiveTest.java:778)
(34 more lines...)
Collapse Failed ForgotPasswordFormControllerTest shouldNotNotFailOnNotFoundUsername History
Build and Test < 1 sec
org.dbunit.dataset.NoSuchTableException: person
	at org.dbunit.database.DatabaseDataSet.getTableMetaData(DatabaseDataSet.java:282)
	at org.dbunit.operation.AbstractOperation.getOperationMetaData(AbstractOperation.java:80)
	at org.dbunit.operation.RefreshOperation.execute(RefreshOperation.java:98)
	at org.openmrs.test.BaseContextSensitiveTest.executeDataSet(BaseContextSensitiveTest.java:682)
	at org.openmrs.test.BaseContextSensitiveTest.executeDataSet(BaseContextSensitiveTest.java:577)
	at org.openmrs.test.BaseContextSensitiveTest.initializeInMemoryDatabase(BaseContextSensitiveTest.java:489)
	at org.openmrs.test.BaseContextSensitiveTest.baseSetupWithStandardDataAndAuthentication(BaseContextSensitiveTest.java:778)
(34 more lines...)
Collapse Failed ForgotPasswordFormControllerTest shouldLockOutAfterFiveFailedInvalidSecretAnswers History
Build and Test < 1 sec
org.dbunit.dataset.NoSuchTableException: person
	at org.dbunit.database.DatabaseDataSet.getTableMetaData(DatabaseDataSet.java:282)
	at org.dbunit.operation.AbstractOperation.getOperationMetaData(AbstractOperation.java:80)
	at org.dbunit.operation.RefreshOperation.execute(RefreshOperation.java:98)
	at org.openmrs.test.BaseContextSensitiveTest.executeDataSet(BaseContextSensitiveTest.java:682)
	at org.openmrs.test.BaseContextSensitiveTest.executeDataSet(BaseContextSensitiveTest.java:577)
	at org.openmrs.test.BaseContextSensitiveTest.initializeInMemoryDatabase(BaseContextSensitiveTest.java:489)
	at org.openmrs.test.BaseContextSensitiveTest.baseSetupWithStandardDataAndAuthentication(BaseContextSensitiveTest.java:778)
(34 more lines...)
Collapse Failed ForgotPasswordFormControllerTest shouldLockOutAfterFiveFailedInvalidUsernames History
Build and Test < 1 sec
org.dbunit.dataset.NoSuchTableException: person
	at org.dbunit.database.DatabaseDataSet.getTableMetaData(DatabaseDataSet.java:282)
	at org.dbunit.operation.AbstractOperation.getOperationMetaData(AbstractOperation.java:80)
	at org.dbunit.operation.RefreshOperation.execute(RefreshOperation.java:98)
	at org.openmrs.test.BaseContextSensitiveTest.executeDataSet(BaseContextSensitiveTest.java:682)
	at org.openmrs.test.BaseContextSensitiveTest.executeDataSet(BaseContextSensitiveTest.java:577)
	at org.openmrs.test.BaseContextSensitiveTest.initializeInMemoryDatabase(BaseContextSensitiveTest.java:489)
	at org.openmrs.test.BaseContextSensitiveTest.baseSetupWithStandardDataAndAuthentication(BaseContextSensitiveTest.java:778)
(34 more lines...)
Collapse Failed ConceptFormControllerTest shouldRemoveConceptAnswer History
Build and Test < 1 sec
org.dbunit.dataset.NoSuchTableException: person
	at org.dbunit.database.DatabaseDataSet.getTableMetaData(DatabaseDataSet.java:282)
	at org.dbunit.operation.AbstractOperation.getOperationMetaData(AbstractOperation.java:80)
	at org.dbunit.operation.RefreshOperation.execute(RefreshOperation.java:98)
	at org.openmrs.test.BaseContextSensitiveTest.executeDataSet(BaseContextSensitiveTest.java:682)
	at org.openmrs.test.BaseContextSensitiveTest.executeDataSet(BaseContextSensitiveTest.java:577)
	at org.openmrs.test.BaseContextSensitiveTest.initializeInMemoryDatabase(BaseContextSensitiveTest.java:489)
	at org.openmrs.test.BaseContextSensitiveTest.baseSetupWithStandardDataAndAuthentication(BaseContextSensitiveTest.java:778)
(33 more lines...)
Collapse Failed ConceptFormControllerTest onSubmit_shouldReturnAConceptWithANullIdIfNoMatchIsFound History
Build and Test < 1 sec
org.dbunit.dataset.NoSuchTableException: person
	at org.dbunit.database.DatabaseDataSet.getTableMetaData(DatabaseDataSet.java:282)
	at org.dbunit.operation.AbstractOperation.getOperationMetaData(AbstractOperation.java:80)
	at org.dbunit.operation.RefreshOperation.execute(RefreshOperation.java:98)
	at org.openmrs.test.BaseContextSensitiveTest.executeDataSet(BaseContextSensitiveTest.java:682)
	at org.openmrs.test.BaseContextSensitiveTest.executeDataSet(BaseContextSensitiveTest.java:577)
	at org.openmrs.test.BaseContextSensitiveTest.initializeInMemoryDatabase(BaseContextSensitiveTest.java:489)
	at org.openmrs.test.BaseContextSensitiveTest.baseSetupWithStandardDataAndAuthentication(BaseContextSensitiveTest.java:778)
(33 more lines...)
Collapse Failed ConceptFormControllerTest onSubmit_shouldVoidASynonymMarkedAsPreferredWhenItIsRemoved History
Build and Test < 1 sec
org.dbunit.dataset.NoSuchTableException: person
	at org.dbunit.database.DatabaseDataSet.getTableMetaData(DatabaseDataSet.java:282)
	at org.dbunit.operation.AbstractOperation.getOperationMetaData(AbstractOperation.java:80)
	at org.dbunit.operation.RefreshOperation.execute(RefreshOperation.java:98)
	at org.openmrs.test.BaseContextSensitiveTest.executeDataSet(BaseContextSensitiveTest.java:682)
	at org.openmrs.test.BaseContextSensitiveTest.executeDataSet(BaseContextSensitiveTest.java:577)
	at org.openmrs.test.BaseContextSensitiveTest.initializeInMemoryDatabase(BaseContextSensitiveTest.java:489)
	at org.openmrs.test.BaseContextSensitiveTest.baseSetupWithStandardDataAndAuthentication(BaseContextSensitiveTest.java:778)
(33 more lines...)
Collapse Failed ConceptFormControllerTest onSubmit_shouldSetTheLocalPreferredName History
Build and Test < 1 sec
org.dbunit.dataset.NoSuchTableException: person
	at org.dbunit.database.DatabaseDataSet.getTableMetaData(DatabaseDataSet.java:282)
	at org.dbunit.operation.AbstractOperation.getOperationMetaData(AbstractOperation.java:80)
	at org.dbunit.operation.RefreshOperation.execute(RefreshOperation.java:98)
	at org.openmrs.test.BaseContextSensitiveTest.executeDataSet(BaseContextSensitiveTest.java:682)
	at org.openmrs.test.BaseContextSensitiveTest.executeDataSet(BaseContextSensitiveTest.java:577)
	at org.openmrs.test.BaseContextSensitiveTest.initializeInMemoryDatabase(BaseContextSensitiveTest.java:489)
	at org.openmrs.test.BaseContextSensitiveTest.baseSetupWithStandardDataAndAuthentication(BaseContextSensitiveTest.java:778)
(33 more lines...)
Collapse Failed ConceptFormControllerTest shouldUpdateConceptWithNameAlreadyInSynonymList History
Build and Test < 1 sec
org.dbunit.dataset.NoSuchTableException: person
	at org.dbunit.database.DatabaseDataSet.getTableMetaData(DatabaseDataSet.java:282)
	at org.dbunit.operation.AbstractOperation.getOperationMetaData(AbstractOperation.java:80)
	at org.dbunit.operation.RefreshOperation.execute(RefreshOperation.java:98)
	at org.openmrs.test.BaseContextSensitiveTest.executeDataSet(BaseContextSensitiveTest.java:682)
	at org.openmrs.test.BaseContextSensitiveTest.executeDataSet(BaseContextSensitiveTest.java:577)
	at org.openmrs.test.BaseContextSensitiveTest.initializeInMemoryDatabase(BaseContextSensitiveTest.java:489)
	at org.openmrs.test.BaseContextSensitiveTest.baseSetupWithStandardDataAndAuthentication(BaseContextSensitiveTest.java:778)
(33 more lines...)
Collapse Failed ConceptFormControllerTest shouldRemoveConceptSet History
Build and Test < 1 sec
org.dbunit.dataset.NoSuchTableException: person
	at org.dbunit.database.DatabaseDataSet.getTableMetaData(DatabaseDataSet.java:282)
	at org.dbunit.operation.AbstractOperation.getOperationMetaData(AbstractOperation.java:80)
	at org.dbunit.operation.RefreshOperation.execute(RefreshOperation.java:98)
	at org.openmrs.test.BaseContextSensitiveTest.executeDataSet(BaseContextSensitiveTest.java:682)
	at org.openmrs.test.BaseContextSensitiveTest.executeDataSet(BaseContextSensitiveTest.java:577)
	at org.openmrs.test.BaseContextSensitiveTest.initializeInMemoryDatabase(BaseContextSensitiveTest.java:489)
	at org.openmrs.test.BaseContextSensitiveTest.baseSetupWithStandardDataAndAuthentication(BaseContextSensitiveTest.java:778)
(33 more lines...)
Collapse Failed ConceptFormControllerTest validateConceptReferenceTermUsesPersistedObjects_shouldAddErrorIfSourceIsNotSaved History
Build and Test < 1 sec
org.dbunit.dataset.NoSuchTableException: person
	at org.dbunit.database.DatabaseDataSet.getTableMetaData(DatabaseDataSet.java:282)
	at org.dbunit.operation.AbstractOperation.getOperationMetaData(AbstractOperation.java:80)
	at org.dbunit.operation.RefreshOperation.execute(RefreshOperation.java:98)
	at org.openmrs.test.BaseContextSensitiveTest.executeDataSet(BaseContextSensitiveTest.java:682)
	at org.openmrs.test.BaseContextSensitiveTest.executeDataSet(BaseContextSensitiveTest.java:577)
	at org.openmrs.test.BaseContextSensitiveTest.initializeInMemoryDatabase(BaseContextSensitiveTest.java:489)
	at org.openmrs.test.BaseContextSensitiveTest.baseSetupWithStandardDataAndAuthentication(BaseContextSensitiveTest.java:778)
(33 more lines...)
Collapse Failed ConceptFormControllerTest onSubmit_shouldAddANewConceptMapWhenCreatingAConcept History
Build and Test < 1 sec
org.dbunit.dataset.NoSuchTableException: person
	at org.dbunit.database.DatabaseDataSet.getTableMetaData(DatabaseDataSet.java:282)
	at org.dbunit.operation.AbstractOperation.getOperationMetaData(AbstractOperation.java:80)
	at org.dbunit.operation.RefreshOperation.execute(RefreshOperation.java:98)
	at org.openmrs.test.BaseContextSensitiveTest.executeDataSet(BaseContextSensitiveTest.java:682)
	at org.openmrs.test.BaseContextSensitiveTest.executeDataSet(BaseContextSensitiveTest.java:577)
	at org.openmrs.test.BaseContextSensitiveTest.initializeInMemoryDatabase(BaseContextSensitiveTest.java:489)
	at org.openmrs.test.BaseContextSensitiveTest.baseSetupWithStandardDataAndAuthentication(BaseContextSensitiveTest.java:778)
(33 more lines...)
Collapse Failed ConceptFormControllerTest shouldReplacePreviousDescription History
Build and Test < 1 sec
org.dbunit.dataset.NoSuchTableException: person
	at org.dbunit.database.DatabaseDataSet.getTableMetaData(DatabaseDataSet.java:282)
	at org.dbunit.operation.AbstractOperation.getOperationMetaData(AbstractOperation.java:80)
	at org.dbunit.operation.RefreshOperation.execute(RefreshOperation.java:98)
	at org.openmrs.test.BaseContextSensitiveTest.executeDataSet(BaseContextSensitiveTest.java:682)
	at org.openmrs.test.BaseContextSensitiveTest.executeDataSet(BaseContextSensitiveTest.java:577)
	at org.openmrs.test.BaseContextSensitiveTest.initializeInMemoryDatabase(BaseContextSensitiveTest.java:489)
	at org.openmrs.test.BaseContextSensitiveTest.baseSetupWithStandardDataAndAuthentication(BaseContextSensitiveTest.java:778)
(33 more lines...)
Collapse Failed ConceptFormControllerTest shouldGetConcept History
Build and Test < 1 sec
org.dbunit.dataset.NoSuchTableException: person
	at org.dbunit.database.DatabaseDataSet.getTableMetaData(DatabaseDataSet.java:282)
	at org.dbunit.operation.AbstractOperation.getOperationMetaData(AbstractOperation.java:80)
	at org.dbunit.operation.RefreshOperation.execute(RefreshOperation.java:98)
	at org.openmrs.test.BaseContextSensitiveTest.executeDataSet(BaseContextSensitiveTest.java:682)
	at org.openmrs.test.BaseContextSensitiveTest.executeDataSet(BaseContextSensitiveTest.java:577)
	at org.openmrs.test.BaseContextSensitiveTest.initializeInMemoryDatabase(BaseContextSensitiveTest.java:489)
	at org.openmrs.test.BaseContextSensitiveTest.baseSetupWithStandardDataAndAuthentication(BaseContextSensitiveTest.java:778)
(33 more lines...)
Collapse Failed ConceptFormControllerTest shouldVoidShortName History
Build and Test < 1 sec
org.dbunit.dataset.NoSuchTableException: person
	at org.dbunit.database.DatabaseDataSet.getTableMetaData(DatabaseDataSet.java:282)
	at org.dbunit.operation.AbstractOperation.getOperationMetaData(AbstractOperation.java:80)
	at org.dbunit.operation.RefreshOperation.execute(RefreshOperation.java:98)
	at org.openmrs.test.BaseContextSensitiveTest.executeDataSet(BaseContextSensitiveTest.java:682)
	at org.openmrs.test.BaseContextSensitiveTest.executeDataSet(BaseContextSensitiveTest.java:577)
	at org.openmrs.test.BaseContextSensitiveTest.initializeInMemoryDatabase(BaseContextSensitiveTest.java:489)
	at org.openmrs.test.BaseContextSensitiveTest.baseSetupWithStandardDataAndAuthentication(BaseContextSensitiveTest.java:778)
(33 more lines...)
Collapse Failed ConceptFormControllerTest onSubmit_shouldAddANewConceptMapToAnExistingConcept History
Build and Test < 1 sec
org.dbunit.dataset.NoSuchTableException: person
	at org.dbunit.database.DatabaseDataSet.getTableMetaData(DatabaseDataSet.java:282)
	at org.dbunit.operation.AbstractOperation.getOperationMetaData(AbstractOperation.java:80)
	at org.dbunit.operation.RefreshOperation.execute(RefreshOperation.java:98)
	at org.openmrs.test.BaseContextSensitiveTest.executeDataSet(BaseContextSensitiveTest.java:682)
	at org.openmrs.test.BaseContextSensitiveTest.executeDataSet(BaseContextSensitiveTest.java:577)
	at org.openmrs.test.BaseContextSensitiveTest.initializeInMemoryDatabase(BaseContextSensitiveTest.java:489)
	at org.openmrs.test.BaseContextSensitiveTest.baseSetupWithStandardDataAndAuthentication(BaseContextSensitiveTest.java:778)
(33 more lines...)
Collapse Failed ConceptFormControllerTest onSubmit_shouldDisplayNumericValuesFromTable History
Build and Test < 1 sec
org.dbunit.dataset.NoSuchTableException: person
	at org.dbunit.database.DatabaseDataSet.getTableMetaData(DatabaseDataSet.java:282)
	at org.dbunit.operation.AbstractOperation.getOperationMetaData(AbstractOperation.java:80)
	at org.dbunit.operation.RefreshOperation.execute(RefreshOperation.java:98)
	at org.openmrs.test.BaseContextSensitiveTest.executeDataSet(BaseContextSensitiveTest.java:682)
	at org.openmrs.test.BaseContextSensitiveTest.executeDataSet(BaseContextSensitiveTest.java:577)
	at org.openmrs.test.BaseContextSensitiveTest.initializeInMemoryDatabase(BaseContextSensitiveTest.java:489)
	at org.openmrs.test.BaseContextSensitiveTest.baseSetupWithStandardDataAndAuthentication(BaseContextSensitiveTest.java:778)
(33 more lines...)
Collapse Failed ConceptFormControllerTest onSubmit_shouldNotSaveChangesIfThereAreValidationErrors History
Build and Test < 1 sec
org.dbunit.dataset.NoSuchTableException: person
	at org.dbunit.database.DatabaseDataSet.getTableMetaData(DatabaseDataSet.java:282)
	at org.dbunit.operation.AbstractOperation.getOperationMetaData(AbstractOperation.java:80)
	at org.dbunit.operation.RefreshOperation.execute(RefreshOperation.java:98)
	at org.openmrs.test.BaseContextSensitiveTest.executeDataSet(BaseContextSensitiveTest.java:682)
	at org.openmrs.test.BaseContextSensitiveTest.executeDataSet(BaseContextSensitiveTest.java:577)
	at org.openmrs.test.BaseContextSensitiveTest.initializeInMemoryDatabase(BaseContextSensitiveTest.java:489)
	at org.openmrs.test.BaseContextSensitiveTest.baseSetupWithStandardDataAndAuthentication(BaseContextSensitiveTest.java:778)
(33 more lines...)
Collapse Failed ConceptFormControllerTest shouldUpdateConceptWithShortNameAlreadyInSynonymList History
Build and Test < 1 sec
org.dbunit.dataset.NoSuchTableException: person
	at org.dbunit.database.DatabaseDataSet.getTableMetaData(DatabaseDataSet.java:282)
	at org.dbunit.operation.AbstractOperation.getOperationMetaData(AbstractOperation.java:80)
	at org.dbunit.operation.RefreshOperation.execute(RefreshOperation.java:98)
	at org.openmrs.test.BaseContextSensitiveTest.executeDataSet(BaseContextSensitiveTest.java:682)
	at org.openmrs.test.BaseContextSensitiveTest.executeDataSet(BaseContextSensitiveTest.java:577)
	at org.openmrs.test.BaseContextSensitiveTest.initializeInMemoryDatabase(BaseContextSensitiveTest.java:489)
	at org.openmrs.test.BaseContextSensitiveTest.baseSetupWithStandardDataAndAuthentication(BaseContextSensitiveTest.java:778)
(33 more lines...)
Collapse Failed ConceptFormControllerTest shouldAddConceptWithNameAndShortNameAndDescriptionSpecifiedToCodeConcepts History
Build and Test < 1 sec
org.dbunit.dataset.NoSuchTableException: person
	at org.dbunit.database.DatabaseDataSet.getTableMetaData(DatabaseDataSet.java:282)
	at org.dbunit.operation.AbstractOperation.getOperationMetaData(AbstractOperation.java:80)
	at org.dbunit.operation.RefreshOperation.execute(RefreshOperation.java:98)
	at org.openmrs.test.BaseContextSensitiveTest.executeDataSet(BaseContextSensitiveTest.java:682)
	at org.openmrs.test.BaseContextSensitiveTest.executeDataSet(BaseContextSensitiveTest.java:577)
	at org.openmrs.test.BaseContextSensitiveTest.initializeInMemoryDatabase(BaseContextSensitiveTest.java:489)
	at org.openmrs.test.BaseContextSensitiveTest.baseSetupWithStandardDataAndAuthentication(BaseContextSensitiveTest.java:778)
(33 more lines...)
Collapse Failed ConceptFormControllerTest shouldEditConceptComplex History
Build and Test 4 secs
org.dbunit.dataset.NoSuchTableException: person
	at org.dbunit.database.DatabaseDataSet.getTableMetaData(DatabaseDataSet.java:282)
	at org.dbunit.operation.AbstractOperation.getOperationMetaData(AbstractOperation.java:80)
	at org.dbunit.operation.RefreshOperation.execute(RefreshOperation.java:98)
	at org.openmrs.test.BaseContextSensitiveTest.executeDataSet(BaseContextSensitiveTest.java:682)
	at org.openmrs.test.BaseContextSensitiveTest.executeDataSet(BaseContextSensitiveTest.java:577)
	at org.openmrs.test.BaseContextSensitiveTest.initializeInMemoryDatabase(BaseContextSensitiveTest.java:489)
	at org.openmrs.test.BaseContextSensitiveTest.baseSetupWithStandardDataAndAuthentication(BaseContextSensitiveTest.java:778)
(33 more lines...)
Collapse Failed ConceptFormControllerTest onSubmit_shouldIgnoreNewConceptMapRowIfTheUserDidNotSelectATerm History
Build and Test < 1 sec
org.dbunit.dataset.NoSuchTableException: person
	at org.dbunit.database.DatabaseDataSet.getTableMetaData(DatabaseDataSet.java:282)
	at org.dbunit.operation.AbstractOperation.getOperationMetaData(AbstractOperation.java:80)
	at org.dbunit.operation.RefreshOperation.execute(RefreshOperation.java:98)
	at org.openmrs.test.BaseContextSensitiveTest.executeDataSet(BaseContextSensitiveTest.java:682)
	at org.openmrs.test.BaseContextSensitiveTest.executeDataSet(BaseContextSensitiveTest.java:577)
	at org.openmrs.test.BaseContextSensitiveTest.initializeInMemoryDatabase(BaseContextSensitiveTest.java:489)
	at org.openmrs.test.BaseContextSensitiveTest.baseSetupWithStandardDataAndAuthentication(BaseContextSensitiveTest.java:778)
(33 more lines...)
Collapse Failed ConceptFormControllerTest shouldAddConceptWithAllNamingSpecified History
Build and Test < 1 sec
org.dbunit.dataset.NoSuchTableException: person
	at org.dbunit.database.DatabaseDataSet.getTableMetaData(DatabaseDataSet.java:282)
	at org.dbunit.operation.AbstractOperation.getOperationMetaData(AbstractOperation.java:80)
	at org.dbunit.operation.RefreshOperation.execute(RefreshOperation.java:98)
	at org.openmrs.test.BaseContextSensitiveTest.executeDataSet(BaseContextSensitiveTest.java:682)
	at org.openmrs.test.BaseContextSensitiveTest.executeDataSet(BaseContextSensitiveTest.java:577)
	at org.openmrs.test.BaseContextSensitiveTest.initializeInMemoryDatabase(BaseContextSensitiveTest.java:489)
	at org.openmrs.test.BaseContextSensitiveTest.baseSetupWithStandardDataAndAuthentication(BaseContextSensitiveTest.java:778)
(33 more lines...)
Collapse Failed ConceptFormControllerTest onSubmit_shouldRemoveAConceptMapFromAnExistingConcept History
Build and Test < 1 sec
org.dbunit.dataset.NoSuchTableException: person
	at org.dbunit.database.DatabaseDataSet.getTableMetaData(DatabaseDataSet.java:282)
	at org.dbunit.operation.AbstractOperation.getOperationMetaData(AbstractOperation.java:80)
	at org.dbunit.operation.RefreshOperation.execute(RefreshOperation.java:98)
	at org.openmrs.test.BaseContextSensitiveTest.executeDataSet(BaseContextSensitiveTest.java:682)
	at org.openmrs.test.BaseContextSensitiveTest.executeDataSet(BaseContextSensitiveTest.java:577)
	at org.openmrs.test.BaseContextSensitiveTest.initializeInMemoryDatabase(BaseContextSensitiveTest.java:489)
	at org.openmrs.test.BaseContextSensitiveTest.baseSetupWithStandardDataAndAuthentication(BaseContextSensitiveTest.java:778)
(33 more lines...)
Collapse Failed ConceptFormControllerTest shouldUpdateConceptByAddingName History
Build and Test < 1 sec
org.dbunit.dataset.NoSuchTableException: person
	at org.dbunit.database.DatabaseDataSet.getTableMetaData(DatabaseDataSet.java:282)
	at org.dbunit.operation.AbstractOperation.getOperationMetaData(AbstractOperation.java:80)
	at org.dbunit.operation.RefreshOperation.execute(RefreshOperation.java:98)
	at org.openmrs.test.BaseContextSensitiveTest.executeDataSet(BaseContextSensitiveTest.java:682)
	at org.openmrs.test.BaseContextSensitiveTest.executeDataSet(BaseContextSensitiveTest.java:577)
	at org.openmrs.test.BaseContextSensitiveTest.initializeInMemoryDatabase(BaseContextSensitiveTest.java:489)
	at org.openmrs.test.BaseContextSensitiveTest.baseSetupWithStandardDataAndAuthentication(BaseContextSensitiveTest.java:778)
(33 more lines...)
Collapse Failed ConceptFormControllerTest onSubmit_shouldCopyNumericValuesIntoNumericConcepts History
Build and Test < 1 sec
org.dbunit.dataset.NoSuchTableException: person
	at org.dbunit.database.DatabaseDataSet.getTableMetaData(DatabaseDataSet.java:282)
	at org.dbunit.operation.AbstractOperation.getOperationMetaData(AbstractOperation.java:80)
	at org.dbunit.operation.RefreshOperation.execute(RefreshOperation.java:98)
	at org.openmrs.test.BaseContextSensitiveTest.executeDataSet(BaseContextSensitiveTest.java:682)
	at org.openmrs.test.BaseContextSensitiveTest.executeDataSet(BaseContextSensitiveTest.java:577)
	at org.openmrs.test.BaseContextSensitiveTest.initializeInMemoryDatabase(BaseContextSensitiveTest.java:489)
	at org.openmrs.test.BaseContextSensitiveTest.baseSetupWithStandardDataAndAuthentication(BaseContextSensitiveTest.java:778)
(33 more lines...)
Collapse Failed ConceptFormControllerTest shouldAddConceptWithOnlyNameSpecified History
Build and Test < 1 sec
org.dbunit.dataset.NoSuchTableException: person
	at org.dbunit.database.DatabaseDataSet.getTableMetaData(DatabaseDataSet.java:282)
	at org.dbunit.operation.AbstractOperation.getOperationMetaData(AbstractOperation.java:80)
	at org.dbunit.operation.RefreshOperation.execute(RefreshOperation.java:98)
	at org.openmrs.test.BaseContextSensitiveTest.executeDataSet(BaseContextSensitiveTest.java:682)
	at org.openmrs.test.BaseContextSensitiveTest.executeDataSet(BaseContextSensitiveTest.java:577)
	at org.openmrs.test.BaseContextSensitiveTest.initializeInMemoryDatabase(BaseContextSensitiveTest.java:489)
	at org.openmrs.test.BaseContextSensitiveTest.baseSetupWithStandardDataAndAuthentication(BaseContextSensitiveTest.java:778)
(33 more lines...)
Collapse Failed ConceptFormControllerTest validateConceptReferenceTermUsesPersistedObjects_shouldAddErrorIfMapTypeIsNotSaved History
Build and Test < 1 sec
org.dbunit.dataset.NoSuchTableException: person
	at org.dbunit.database.DatabaseDataSet.getTableMetaData(DatabaseDataSet.java:282)
	at org.dbunit.operation.AbstractOperation.getOperationMetaData(AbstractOperation.java:80)
	at org.dbunit.operation.RefreshOperation.execute(RefreshOperation.java:98)
	at org.openmrs.test.BaseContextSensitiveTest.executeDataSet(BaseContextSensitiveTest.java:682)
	at org.openmrs.test.BaseContextSensitiveTest.executeDataSet(BaseContextSensitiveTest.java:577)
	at org.openmrs.test.BaseContextSensitiveTest.initializeInMemoryDatabase(BaseContextSensitiveTest.java:489)
	at org.openmrs.test.BaseContextSensitiveTest.baseSetupWithStandardDataAndAuthentication(BaseContextSensitiveTest.java:778)
(33 more lines...)
Collapse Failed ConceptFormControllerTest shouldAddConceptWithNameAndShortNameSpecified History
Build and Test < 1 sec
org.dbunit.dataset.NoSuchTableException: person
	at org.dbunit.database.DatabaseDataSet.getTableMetaData(DatabaseDataSet.java:282)
	at org.dbunit.operation.AbstractOperation.getOperationMetaData(AbstractOperation.java:80)
	at org.dbunit.operation.RefreshOperation.execute(RefreshOperation.java:98)
	at org.openmrs.test.BaseContextSensitiveTest.executeDataSet(BaseContextSensitiveTest.java:682)
	at org.openmrs.test.BaseContextSensitiveTest.executeDataSet(BaseContextSensitiveTest.java:577)
	at org.openmrs.test.BaseContextSensitiveTest.initializeInMemoryDatabase(BaseContextSensitiveTest.java:489)
	at org.openmrs.test.BaseContextSensitiveTest.baseSetupWithStandardDataAndAuthentication(BaseContextSensitiveTest.java:778)
(33 more lines...)
Collapse Failed ConceptFormControllerTest validateConceptReferenceTermUsesPersistedObjects_shouldAddErrorIfTermBIsNotSaved History
Build and Test < 1 sec
org.dbunit.dataset.NoSuchTableException: person
	at org.dbunit.database.DatabaseDataSet.getTableMetaData(DatabaseDataSet.java:282)
	at org.dbunit.operation.AbstractOperation.getOperationMetaData(AbstractOperation.java:80)
	at org.dbunit.operation.RefreshOperation.execute(RefreshOperation.java:98)
	at org.openmrs.test.BaseContextSensitiveTest.executeDataSet(BaseContextSensitiveTest.java:682)
	at org.openmrs.test.BaseContextSensitiveTest.executeDataSet(BaseContextSensitiveTest.java:577)
	at org.openmrs.test.BaseContextSensitiveTest.initializeInMemoryDatabase(BaseContextSensitiveTest.java:489)
	at org.openmrs.test.BaseContextSensitiveTest.baseSetupWithStandardDataAndAuthentication(BaseContextSensitiveTest.java:778)
(33 more lines...)
Collapse Failed ConceptFormControllerTest shouldNotDeleteConceptsWhenConceptsAreLocked History
Build and Test < 1 sec
org.dbunit.dataset.NoSuchTableException: person
	at org.dbunit.database.DatabaseDataSet.getTableMetaData(DatabaseDataSet.java:282)
	at org.dbunit.operation.AbstractOperation.getOperationMetaData(AbstractOperation.java:80)
	at org.dbunit.operation.RefreshOperation.execute(RefreshOperation.java:98)
	at org.openmrs.test.BaseContextSensitiveTest.executeDataSet(BaseContextSensitiveTest.java:682)
	at org.openmrs.test.BaseContextSensitiveTest.executeDataSet(BaseContextSensitiveTest.java:577)
	at org.openmrs.test.BaseContextSensitiveTest.initializeInMemoryDatabase(BaseContextSensitiveTest.java:489)
	at org.openmrs.test.BaseContextSensitiveTest.baseSetupWithStandardDataAndAuthentication(BaseContextSensitiveTest.java:778)
(33 more lines...)
Collapse Failed ConceptFormControllerTest shouldAddConceptWithNameAndShortNameAndDescriptionSpecifiedToNumericConcepts History
Build and Test < 1 sec
org.dbunit.dataset.NoSuchTableException: person
	at org.dbunit.database.DatabaseDataSet.getTableMetaData(DatabaseDataSet.java:282)
	at org.dbunit.operation.AbstractOperation.getOperationMetaData(AbstractOperation.java:80)
	at org.dbunit.operation.RefreshOperation.execute(RefreshOperation.java:98)
	at org.openmrs.test.BaseContextSensitiveTest.executeDataSet(BaseContextSensitiveTest.java:682)
	at org.openmrs.test.BaseContextSensitiveTest.executeDataSet(BaseContextSensitiveTest.java:577)
	at org.openmrs.test.BaseContextSensitiveTest.initializeInMemoryDatabase(BaseContextSensitiveTest.java:489)
	at org.openmrs.test.BaseContextSensitiveTest.baseSetupWithStandardDataAndAuthentication(BaseContextSensitiveTest.java:778)
(33 more lines...)
Collapse Failed ConceptFormControllerTest shouldRemoveConceptAnswersIfDatatypeChangedFromCoded History
Build and Test < 1 sec
org.dbunit.dataset.NoSuchTableException: person
	at org.dbunit.database.DatabaseDataSet.getTableMetaData(DatabaseDataSet.java:282)
	at org.dbunit.operation.AbstractOperation.getOperationMetaData(AbstractOperation.java:80)
	at org.dbunit.operation.RefreshOperation.execute(RefreshOperation.java:98)
	at org.openmrs.test.BaseContextSensitiveTest.executeDataSet(BaseContextSensitiveTest.java:682)
	at org.openmrs.test.BaseContextSensitiveTest.executeDataSet(BaseContextSensitiveTest.java:577)
	at org.openmrs.test.BaseContextSensitiveTest.initializeInMemoryDatabase(BaseContextSensitiveTest.java:489)
	at org.openmrs.test.BaseContextSensitiveTest.baseSetupWithStandardDataAndAuthentication(BaseContextSensitiveTest.java:778)
(33 more lines...)
Collapse Failed GlobalPropertyPortletControllerTest setupModelForModule_shouldChangeModelIfForModuleIsPresent History
Build and Test < 1 sec
org.dbunit.dataset.NoSuchTableException: person
	at org.dbunit.database.DatabaseDataSet.getTableMetaData(DatabaseDataSet.java:282)
	at org.dbunit.operation.AbstractOperation.getOperationMetaData(AbstractOperation.java:80)
	at org.dbunit.operation.RefreshOperation.execute(RefreshOperation.java:98)
	at org.openmrs.test.BaseContextSensitiveTest.executeDataSet(BaseContextSensitiveTest.java:682)
	at org.openmrs.test.BaseContextSensitiveTest.executeDataSet(BaseContextSensitiveTest.java:577)
	at org.openmrs.test.BaseContextSensitiveTest.initializeInMemoryDatabase(BaseContextSensitiveTest.java:489)
	at org.openmrs.test.BaseContextSensitiveTest.baseSetupWithStandardDataAndAuthentication(BaseContextSensitiveTest.java:778)
(33 more lines...)
Collapse Failed GlobalPropertyPortletControllerTest populateModel_shouldExcludeMultiplePrefixes History
Build and Test < 1 sec
org.dbunit.dataset.NoSuchTableException: person
	at org.dbunit.database.DatabaseDataSet.getTableMetaData(DatabaseDataSet.java:282)
	at org.dbunit.operation.AbstractOperation.getOperationMetaData(AbstractOperation.java:80)
	at org.dbunit.operation.RefreshOperation.execute(RefreshOperation.java:98)
	at org.openmrs.test.BaseContextSensitiveTest.executeDataSet(BaseContextSensitiveTest.java:682)
	at org.openmrs.test.BaseContextSensitiveTest.executeDataSet(BaseContextSensitiveTest.java:577)
	at org.openmrs.test.BaseContextSensitiveTest.initializeInMemoryDatabase(BaseContextSensitiveTest.java:489)
	at org.openmrs.test.BaseContextSensitiveTest.baseSetupWithStandardDataAndAuthentication(BaseContextSensitiveTest.java:778)
(33 more lines...)
Collapse Failed GlobalPropertyPortletControllerTest setupModelForModule_shouldNotChangeModeIfForModuleIsNotPresent History
Build and Test < 1 sec
org.dbunit.dataset.NoSuchTableException: person
	at org.dbunit.database.DatabaseDataSet.getTableMetaData(DatabaseDataSet.java:282)
	at org.dbunit.operation.AbstractOperation.getOperationMetaData(AbstractOperation.java:80)
	at org.dbunit.operation.RefreshOperation.execute(RefreshOperation.java:98)
	at org.openmrs.test.BaseContextSensitiveTest.executeDataSet(BaseContextSensitiveTest.java:682)
	at org.openmrs.test.BaseContextSensitiveTest.executeDataSet(BaseContextSensitiveTest.java:577)
	at org.openmrs.test.BaseContextSensitiveTest.initializeInMemoryDatabase(BaseContextSensitiveTest.java:489)
	at org.openmrs.test.BaseContextSensitiveTest.baseSetupWithStandardDataAndAuthentication(BaseContextSensitiveTest.java:778)
(33 more lines...)

Jira issues

IssueDescriptionStatus
Unknown Issue TypeTRUNK-4223Could not obtain issue details from Jira