Build: #271 failed Changes by Daniel Kayiwa

Test results

  • 2,648 tests in total
  • 234 tests failed
  • 234 failures are new
  • 27 minutes taken in total.
New test failures 234
Status Test View job Duration
Collapse Failed SchedulerFormControllerTest onSubmit_shouldNotRescheduleAnExecutingTask History
Build and Test < 1 sec
org.dbunit.dataset.NoSuchTableException: person
	at org.dbunit.database.DatabaseDataSet.getTableMetaData(DatabaseDataSet.java:282)
	at org.dbunit.operation.AbstractOperation.getOperationMetaData(AbstractOperation.java:80)
	at org.dbunit.operation.RefreshOperation.execute(RefreshOperation.java:98)
	at org.openmrs.test.BaseContextSensitiveTest.executeDataSet(BaseContextSensitiveTest.java:682)
	at org.openmrs.test.BaseContextSensitiveTest.executeDataSet(BaseContextSensitiveTest.java:577)
	at org.openmrs.test.BaseContextSensitiveTest.initializeInMemoryDatabase(BaseContextSensitiveTest.java:489)
	at org.openmrs.test.BaseContextSensitiveTest.baseSetupWithStandardDataAndAuthentication(BaseContextSensitiveTest.java:778)
(33 more lines...)
Collapse Failed SchedulerFormControllerTest onSubmit_shouldRescheduleACurrentlyScheduledTask History
Build and Test 2 secs
org.dbunit.dataset.NoSuchTableException: person
	at org.dbunit.database.DatabaseDataSet.getTableMetaData(DatabaseDataSet.java:282)
	at org.dbunit.operation.AbstractOperation.getOperationMetaData(AbstractOperation.java:80)
	at org.dbunit.operation.RefreshOperation.execute(RefreshOperation.java:98)
	at org.openmrs.test.BaseContextSensitiveTest.executeDataSet(BaseContextSensitiveTest.java:682)
	at org.openmrs.test.BaseContextSensitiveTest.executeDataSet(BaseContextSensitiveTest.java:577)
	at org.openmrs.test.BaseContextSensitiveTest.initializeInMemoryDatabase(BaseContextSensitiveTest.java:489)
	at org.openmrs.test.BaseContextSensitiveTest.baseSetupWithStandardDataAndAuthentication(BaseContextSensitiveTest.java:778)
(33 more lines...)
Collapse Failed SchedulerFormControllerTest onSubmit_shouldNotRescheduleATaskThatIsNotCurrentlyScheduled History
Build and Test < 1 sec
org.dbunit.dataset.NoSuchTableException: person
	at org.dbunit.database.DatabaseDataSet.getTableMetaData(DatabaseDataSet.java:282)
	at org.dbunit.operation.AbstractOperation.getOperationMetaData(AbstractOperation.java:80)
	at org.dbunit.operation.RefreshOperation.execute(RefreshOperation.java:98)
	at org.openmrs.test.BaseContextSensitiveTest.executeDataSet(BaseContextSensitiveTest.java:682)
	at org.openmrs.test.BaseContextSensitiveTest.executeDataSet(BaseContextSensitiveTest.java:577)
	at org.openmrs.test.BaseContextSensitiveTest.initializeInMemoryDatabase(BaseContextSensitiveTest.java:489)
	at org.openmrs.test.BaseContextSensitiveTest.baseSetupWithStandardDataAndAuthentication(BaseContextSensitiveTest.java:778)
(33 more lines...)
Collapse Failed SchedulerFormTest addANewTaskShouldNotError History
Build and Test < 1 sec
org.dbunit.dataset.NoSuchTableException: person
	at org.dbunit.database.DatabaseDataSet.getTableMetaData(DatabaseDataSet.java:282)
	at org.dbunit.operation.AbstractOperation.getOperationMetaData(AbstractOperation.java:80)
	at org.dbunit.operation.RefreshOperation.execute(RefreshOperation.java:98)
	at org.openmrs.test.BaseContextSensitiveTest.executeDataSet(BaseContextSensitiveTest.java:682)
	at org.openmrs.test.BaseContextSensitiveTest.executeDataSet(BaseContextSensitiveTest.java:577)
	at org.openmrs.test.BaseContextSensitiveTest.initializeInMemoryDatabase(BaseContextSensitiveTest.java:489)
	at org.openmrs.test.BaseContextSensitiveTest.baseSetupWithStandardDataAndAuthentication(BaseContextSensitiveTest.java:778)
(33 more lines...)
Collapse Failed TaskHelperTest waitUntilTaskIsExecuting_shouldRaiseATimeoutExceptionWhenTheTimeoutIsExceeded History
Build and Test < 1 sec
org.dbunit.dataset.NoSuchTableException: person
	at org.dbunit.database.DatabaseDataSet.getTableMetaData(DatabaseDataSet.java:282)
	at org.dbunit.operation.AbstractOperation.getOperationMetaData(AbstractOperation.java:80)
	at org.dbunit.operation.RefreshOperation.execute(RefreshOperation.java:98)
	at org.openmrs.test.BaseContextSensitiveTest.executeDataSet(BaseContextSensitiveTest.java:682)
	at org.openmrs.test.BaseContextSensitiveTest.executeDataSet(BaseContextSensitiveTest.java:577)
	at org.openmrs.test.BaseContextSensitiveTest.initializeInMemoryDatabase(BaseContextSensitiveTest.java:489)
	at org.openmrs.test.BaseContextSensitiveTest.baseSetupWithStandardDataAndAuthentication(BaseContextSensitiveTest.java:778)
(33 more lines...)
Collapse Failed TaskHelperTest getTime_shouldGetATimeInTheFuture History
Build and Test < 1 sec
org.dbunit.dataset.NoSuchTableException: person
	at org.dbunit.database.DatabaseDataSet.getTableMetaData(DatabaseDataSet.java:282)
	at org.dbunit.operation.AbstractOperation.getOperationMetaData(AbstractOperation.java:80)
	at org.dbunit.operation.RefreshOperation.execute(RefreshOperation.java:98)
	at org.openmrs.test.BaseContextSensitiveTest.executeDataSet(BaseContextSensitiveTest.java:682)
	at org.openmrs.test.BaseContextSensitiveTest.executeDataSet(BaseContextSensitiveTest.java:577)
	at org.openmrs.test.BaseContextSensitiveTest.initializeInMemoryDatabase(BaseContextSensitiveTest.java:489)
	at org.openmrs.test.BaseContextSensitiveTest.baseSetupWithStandardDataAndAuthentication(BaseContextSensitiveTest.java:778)
(33 more lines...)
Collapse Failed TaskHelperTest getUnscheduledTaskDefinition_shouldReturnATaskThatHasNotBeenStarted History
Build and Test < 1 sec
org.dbunit.dataset.NoSuchTableException: person
	at org.dbunit.database.DatabaseDataSet.getTableMetaData(DatabaseDataSet.java:282)
	at org.dbunit.operation.AbstractOperation.getOperationMetaData(AbstractOperation.java:80)
	at org.dbunit.operation.RefreshOperation.execute(RefreshOperation.java:98)
	at org.openmrs.test.BaseContextSensitiveTest.executeDataSet(BaseContextSensitiveTest.java:682)
	at org.openmrs.test.BaseContextSensitiveTest.executeDataSet(BaseContextSensitiveTest.java:577)
	at org.openmrs.test.BaseContextSensitiveTest.initializeInMemoryDatabase(BaseContextSensitiveTest.java:489)
	at org.openmrs.test.BaseContextSensitiveTest.baseSetupWithStandardDataAndAuthentication(BaseContextSensitiveTest.java:778)
(33 more lines...)
Collapse Failed TaskHelperTest getTime_shouldGetATimeInThePast History
Build and Test < 1 sec
org.dbunit.dataset.NoSuchTableException: person
	at org.dbunit.database.DatabaseDataSet.getTableMetaData(DatabaseDataSet.java:282)
	at org.dbunit.operation.AbstractOperation.getOperationMetaData(AbstractOperation.java:80)
	at org.dbunit.operation.RefreshOperation.execute(RefreshOperation.java:98)
	at org.openmrs.test.BaseContextSensitiveTest.executeDataSet(BaseContextSensitiveTest.java:682)
	at org.openmrs.test.BaseContextSensitiveTest.executeDataSet(BaseContextSensitiveTest.java:577)
	at org.openmrs.test.BaseContextSensitiveTest.initializeInMemoryDatabase(BaseContextSensitiveTest.java:489)
	at org.openmrs.test.BaseContextSensitiveTest.baseSetupWithStandardDataAndAuthentication(BaseContextSensitiveTest.java:778)
(33 more lines...)
Collapse Failed TaskHelperTest getScheduledTaskDefinition_shouldReturnATaskThatHasBeenStarted History
Build and Test < 1 sec
org.dbunit.dataset.NoSuchTableException: person
	at org.dbunit.database.DatabaseDataSet.getTableMetaData(DatabaseDataSet.java:282)
	at org.dbunit.operation.AbstractOperation.getOperationMetaData(AbstractOperation.java:80)
	at org.dbunit.operation.RefreshOperation.execute(RefreshOperation.java:98)
	at org.openmrs.test.BaseContextSensitiveTest.executeDataSet(BaseContextSensitiveTest.java:682)
	at org.openmrs.test.BaseContextSensitiveTest.executeDataSet(BaseContextSensitiveTest.java:577)
	at org.openmrs.test.BaseContextSensitiveTest.initializeInMemoryDatabase(BaseContextSensitiveTest.java:489)
	at org.openmrs.test.BaseContextSensitiveTest.baseSetupWithStandardDataAndAuthentication(BaseContextSensitiveTest.java:778)
(33 more lines...)
Collapse Failed TaskHelperTest waitUntilTaskIsExecuting_shouldWaitUntilTaskIsExecuting History
Build and Test < 1 sec
org.dbunit.dataset.NoSuchTableException: person
	at org.dbunit.database.DatabaseDataSet.getTableMetaData(DatabaseDataSet.java:282)
	at org.dbunit.operation.AbstractOperation.getOperationMetaData(AbstractOperation.java:80)
	at org.dbunit.operation.RefreshOperation.execute(RefreshOperation.java:98)
	at org.openmrs.test.BaseContextSensitiveTest.executeDataSet(BaseContextSensitiveTest.java:682)
	at org.openmrs.test.BaseContextSensitiveTest.executeDataSet(BaseContextSensitiveTest.java:577)
	at org.openmrs.test.BaseContextSensitiveTest.initializeInMemoryDatabase(BaseContextSensitiveTest.java:489)
	at org.openmrs.test.BaseContextSensitiveTest.baseSetupWithStandardDataAndAuthentication(BaseContextSensitiveTest.java:778)
(33 more lines...)
Collapse Failed ForgotPasswordFormControllerTest shouldNotAuthenticateAsUserWithValidSecretQuestion History
Build and Test < 1 sec
org.dbunit.dataset.NoSuchTableException: person
	at org.dbunit.database.DatabaseDataSet.getTableMetaData(DatabaseDataSet.java:282)
	at org.dbunit.operation.AbstractOperation.getOperationMetaData(AbstractOperation.java:80)
	at org.dbunit.operation.RefreshOperation.execute(RefreshOperation.java:98)
	at org.openmrs.test.BaseContextSensitiveTest.executeDataSet(BaseContextSensitiveTest.java:682)
	at org.openmrs.test.BaseContextSensitiveTest.executeDataSet(BaseContextSensitiveTest.java:577)
	at org.openmrs.test.BaseContextSensitiveTest.initializeInMemoryDatabase(BaseContextSensitiveTest.java:489)
	at org.openmrs.test.BaseContextSensitiveTest.baseSetupWithStandardDataAndAuthentication(BaseContextSensitiveTest.java:778)
(34 more lines...)
Collapse Failed ForgotPasswordFormControllerTest shouldLoadPageNormallyWithNoInput History
Build and Test < 1 sec
org.dbunit.dataset.NoSuchTableException: person
	at org.dbunit.database.DatabaseDataSet.getTableMetaData(DatabaseDataSet.java:282)
	at org.dbunit.operation.AbstractOperation.getOperationMetaData(AbstractOperation.java:80)
	at org.dbunit.operation.RefreshOperation.execute(RefreshOperation.java:98)
	at org.openmrs.test.BaseContextSensitiveTest.executeDataSet(BaseContextSensitiveTest.java:682)
	at org.openmrs.test.BaseContextSensitiveTest.executeDataSet(BaseContextSensitiveTest.java:577)
	at org.openmrs.test.BaseContextSensitiveTest.initializeInMemoryDatabase(BaseContextSensitiveTest.java:489)
	at org.openmrs.test.BaseContextSensitiveTest.baseSetupWithStandardDataAndAuthentication(BaseContextSensitiveTest.java:778)
(34 more lines...)
Collapse Failed ForgotPasswordFormControllerTest shouldGiveUserFiveSecretAnswerAttemptsAfterLessThanFiveFailedUsernameAttempts History
Build and Test < 1 sec
org.dbunit.dataset.NoSuchTableException: person
	at org.dbunit.database.DatabaseDataSet.getTableMetaData(DatabaseDataSet.java:282)
	at org.dbunit.operation.AbstractOperation.getOperationMetaData(AbstractOperation.java:80)
	at org.dbunit.operation.RefreshOperation.execute(RefreshOperation.java:98)
	at org.openmrs.test.BaseContextSensitiveTest.executeDataSet(BaseContextSensitiveTest.java:682)
	at org.openmrs.test.BaseContextSensitiveTest.executeDataSet(BaseContextSensitiveTest.java:577)
	at org.openmrs.test.BaseContextSensitiveTest.initializeInMemoryDatabase(BaseContextSensitiveTest.java:489)
	at org.openmrs.test.BaseContextSensitiveTest.baseSetupWithStandardDataAndAuthentication(BaseContextSensitiveTest.java:778)
(34 more lines...)
Collapse Failed ForgotPasswordFormControllerTest shouldAuthenticateAsUserWithValidSecretQuestion History
Build and Test < 1 sec
org.dbunit.dataset.NoSuchTableException: person
	at org.dbunit.database.DatabaseDataSet.getTableMetaData(DatabaseDataSet.java:282)
	at org.dbunit.operation.AbstractOperation.getOperationMetaData(AbstractOperation.java:80)
	at org.dbunit.operation.RefreshOperation.execute(RefreshOperation.java:98)
	at org.openmrs.test.BaseContextSensitiveTest.executeDataSet(BaseContextSensitiveTest.java:682)
	at org.openmrs.test.BaseContextSensitiveTest.executeDataSet(BaseContextSensitiveTest.java:577)
	at org.openmrs.test.BaseContextSensitiveTest.initializeInMemoryDatabase(BaseContextSensitiveTest.java:489)
	at org.openmrs.test.BaseContextSensitiveTest.baseSetupWithStandardDataAndAuthentication(BaseContextSensitiveTest.java:778)
(34 more lines...)
Collapse Failed ForgotPasswordFormControllerTest shouldNotAuthenticateAfterFiveFailedInvalidUsernames History
Build and Test < 1 sec
org.dbunit.dataset.NoSuchTableException: person
	at org.dbunit.database.DatabaseDataSet.getTableMetaData(DatabaseDataSet.java:282)
	at org.dbunit.operation.AbstractOperation.getOperationMetaData(AbstractOperation.java:80)
	at org.dbunit.operation.RefreshOperation.execute(RefreshOperation.java:98)
	at org.openmrs.test.BaseContextSensitiveTest.executeDataSet(BaseContextSensitiveTest.java:682)
	at org.openmrs.test.BaseContextSensitiveTest.executeDataSet(BaseContextSensitiveTest.java:577)
	at org.openmrs.test.BaseContextSensitiveTest.initializeInMemoryDatabase(BaseContextSensitiveTest.java:489)
	at org.openmrs.test.BaseContextSensitiveTest.baseSetupWithStandardDataAndAuthentication(BaseContextSensitiveTest.java:778)
(34 more lines...)
Collapse Failed ForgotPasswordFormControllerTest shouldNotNotFailOnNotFoundUsername History
Build and Test < 1 sec
org.dbunit.dataset.NoSuchTableException: person
	at org.dbunit.database.DatabaseDataSet.getTableMetaData(DatabaseDataSet.java:282)
	at org.dbunit.operation.AbstractOperation.getOperationMetaData(AbstractOperation.java:80)
	at org.dbunit.operation.RefreshOperation.execute(RefreshOperation.java:98)
	at org.openmrs.test.BaseContextSensitiveTest.executeDataSet(BaseContextSensitiveTest.java:682)
	at org.openmrs.test.BaseContextSensitiveTest.executeDataSet(BaseContextSensitiveTest.java:577)
	at org.openmrs.test.BaseContextSensitiveTest.initializeInMemoryDatabase(BaseContextSensitiveTest.java:489)
	at org.openmrs.test.BaseContextSensitiveTest.baseSetupWithStandardDataAndAuthentication(BaseContextSensitiveTest.java:778)
(34 more lines...)
Collapse Failed ForgotPasswordFormControllerTest shouldLockOutAfterFiveFailedInvalidSecretAnswers History
Build and Test < 1 sec
org.dbunit.dataset.NoSuchTableException: person
	at org.dbunit.database.DatabaseDataSet.getTableMetaData(DatabaseDataSet.java:282)
	at org.dbunit.operation.AbstractOperation.getOperationMetaData(AbstractOperation.java:80)
	at org.dbunit.operation.RefreshOperation.execute(RefreshOperation.java:98)
	at org.openmrs.test.BaseContextSensitiveTest.executeDataSet(BaseContextSensitiveTest.java:682)
	at org.openmrs.test.BaseContextSensitiveTest.executeDataSet(BaseContextSensitiveTest.java:577)
	at org.openmrs.test.BaseContextSensitiveTest.initializeInMemoryDatabase(BaseContextSensitiveTest.java:489)
	at org.openmrs.test.BaseContextSensitiveTest.baseSetupWithStandardDataAndAuthentication(BaseContextSensitiveTest.java:778)
(34 more lines...)
Collapse Failed ForgotPasswordFormControllerTest shouldLockOutAfterFiveFailedInvalidUsernames History
Build and Test < 1 sec
org.dbunit.dataset.NoSuchTableException: person
	at org.dbunit.database.DatabaseDataSet.getTableMetaData(DatabaseDataSet.java:282)
	at org.dbunit.operation.AbstractOperation.getOperationMetaData(AbstractOperation.java:80)
	at org.dbunit.operation.RefreshOperation.execute(RefreshOperation.java:98)
	at org.openmrs.test.BaseContextSensitiveTest.executeDataSet(BaseContextSensitiveTest.java:682)
	at org.openmrs.test.BaseContextSensitiveTest.executeDataSet(BaseContextSensitiveTest.java:577)
	at org.openmrs.test.BaseContextSensitiveTest.initializeInMemoryDatabase(BaseContextSensitiveTest.java:489)
	at org.openmrs.test.BaseContextSensitiveTest.baseSetupWithStandardDataAndAuthentication(BaseContextSensitiveTest.java:778)
(34 more lines...)
Collapse Failed ConceptFormControllerTest onSubmit_shouldDisplayNumericValuesFromTable History
Build and Test < 1 sec
org.dbunit.dataset.NoSuchTableException: person
	at org.dbunit.database.DatabaseDataSet.getTableMetaData(DatabaseDataSet.java:282)
	at org.dbunit.operation.AbstractOperation.getOperationMetaData(AbstractOperation.java:80)
	at org.dbunit.operation.RefreshOperation.execute(RefreshOperation.java:98)
	at org.openmrs.test.BaseContextSensitiveTest.executeDataSet(BaseContextSensitiveTest.java:682)
	at org.openmrs.test.BaseContextSensitiveTest.executeDataSet(BaseContextSensitiveTest.java:577)
	at org.openmrs.test.BaseContextSensitiveTest.initializeInMemoryDatabase(BaseContextSensitiveTest.java:489)
	at org.openmrs.test.BaseContextSensitiveTest.baseSetupWithStandardDataAndAuthentication(BaseContextSensitiveTest.java:778)
(33 more lines...)
Collapse Failed ConceptFormControllerTest onSubmit_shouldNotSaveChangesIfThereAreValidationErrors History
Build and Test < 1 sec
org.dbunit.dataset.NoSuchTableException: person
	at org.dbunit.database.DatabaseDataSet.getTableMetaData(DatabaseDataSet.java:282)
	at org.dbunit.operation.AbstractOperation.getOperationMetaData(AbstractOperation.java:80)
	at org.dbunit.operation.RefreshOperation.execute(RefreshOperation.java:98)
	at org.openmrs.test.BaseContextSensitiveTest.executeDataSet(BaseContextSensitiveTest.java:682)
	at org.openmrs.test.BaseContextSensitiveTest.executeDataSet(BaseContextSensitiveTest.java:577)
	at org.openmrs.test.BaseContextSensitiveTest.initializeInMemoryDatabase(BaseContextSensitiveTest.java:489)
	at org.openmrs.test.BaseContextSensitiveTest.baseSetupWithStandardDataAndAuthentication(BaseContextSensitiveTest.java:778)
(33 more lines...)
Collapse Failed ConceptFormControllerTest shouldUpdateConceptWithShortNameAlreadyInSynonymList History
Build and Test < 1 sec
org.dbunit.dataset.NoSuchTableException: person
	at org.dbunit.database.DatabaseDataSet.getTableMetaData(DatabaseDataSet.java:282)
	at org.dbunit.operation.AbstractOperation.getOperationMetaData(AbstractOperation.java:80)
	at org.dbunit.operation.RefreshOperation.execute(RefreshOperation.java:98)
	at org.openmrs.test.BaseContextSensitiveTest.executeDataSet(BaseContextSensitiveTest.java:682)
	at org.openmrs.test.BaseContextSensitiveTest.executeDataSet(BaseContextSensitiveTest.java:577)
	at org.openmrs.test.BaseContextSensitiveTest.initializeInMemoryDatabase(BaseContextSensitiveTest.java:489)
	at org.openmrs.test.BaseContextSensitiveTest.baseSetupWithStandardDataAndAuthentication(BaseContextSensitiveTest.java:778)
(33 more lines...)
Collapse Failed ConceptFormControllerTest shouldAddConceptWithNameAndShortNameAndDescriptionSpecifiedToCodeConcepts History
Build and Test < 1 sec
org.dbunit.dataset.NoSuchTableException: person
	at org.dbunit.database.DatabaseDataSet.getTableMetaData(DatabaseDataSet.java:282)
	at org.dbunit.operation.AbstractOperation.getOperationMetaData(AbstractOperation.java:80)
	at org.dbunit.operation.RefreshOperation.execute(RefreshOperation.java:98)
	at org.openmrs.test.BaseContextSensitiveTest.executeDataSet(BaseContextSensitiveTest.java:682)
	at org.openmrs.test.BaseContextSensitiveTest.executeDataSet(BaseContextSensitiveTest.java:577)
	at org.openmrs.test.BaseContextSensitiveTest.initializeInMemoryDatabase(BaseContextSensitiveTest.java:489)
	at org.openmrs.test.BaseContextSensitiveTest.baseSetupWithStandardDataAndAuthentication(BaseContextSensitiveTest.java:778)
(33 more lines...)
Collapse Failed ConceptFormControllerTest shouldEditConceptComplex History
Build and Test 4 secs
org.dbunit.dataset.NoSuchTableException: person
	at org.dbunit.database.DatabaseDataSet.getTableMetaData(DatabaseDataSet.java:282)
	at org.dbunit.operation.AbstractOperation.getOperationMetaData(AbstractOperation.java:80)
	at org.dbunit.operation.RefreshOperation.execute(RefreshOperation.java:98)
	at org.openmrs.test.BaseContextSensitiveTest.executeDataSet(BaseContextSensitiveTest.java:682)
	at org.openmrs.test.BaseContextSensitiveTest.executeDataSet(BaseContextSensitiveTest.java:577)
	at org.openmrs.test.BaseContextSensitiveTest.initializeInMemoryDatabase(BaseContextSensitiveTest.java:489)
	at org.openmrs.test.BaseContextSensitiveTest.baseSetupWithStandardDataAndAuthentication(BaseContextSensitiveTest.java:778)
(33 more lines...)
Collapse Failed ConceptFormControllerTest onSubmit_shouldIgnoreNewConceptMapRowIfTheUserDidNotSelectATerm History
Build and Test < 1 sec
org.dbunit.dataset.NoSuchTableException: person
	at org.dbunit.database.DatabaseDataSet.getTableMetaData(DatabaseDataSet.java:282)
	at org.dbunit.operation.AbstractOperation.getOperationMetaData(AbstractOperation.java:80)
	at org.dbunit.operation.RefreshOperation.execute(RefreshOperation.java:98)
	at org.openmrs.test.BaseContextSensitiveTest.executeDataSet(BaseContextSensitiveTest.java:682)
	at org.openmrs.test.BaseContextSensitiveTest.executeDataSet(BaseContextSensitiveTest.java:577)
	at org.openmrs.test.BaseContextSensitiveTest.initializeInMemoryDatabase(BaseContextSensitiveTest.java:489)
	at org.openmrs.test.BaseContextSensitiveTest.baseSetupWithStandardDataAndAuthentication(BaseContextSensitiveTest.java:778)
(33 more lines...)
Collapse Failed ConceptFormControllerTest shouldAddConceptWithAllNamingSpecified History
Build and Test < 1 sec
org.dbunit.dataset.NoSuchTableException: person
	at org.dbunit.database.DatabaseDataSet.getTableMetaData(DatabaseDataSet.java:282)
	at org.dbunit.operation.AbstractOperation.getOperationMetaData(AbstractOperation.java:80)
	at org.dbunit.operation.RefreshOperation.execute(RefreshOperation.java:98)
	at org.openmrs.test.BaseContextSensitiveTest.executeDataSet(BaseContextSensitiveTest.java:682)
	at org.openmrs.test.BaseContextSensitiveTest.executeDataSet(BaseContextSensitiveTest.java:577)
	at org.openmrs.test.BaseContextSensitiveTest.initializeInMemoryDatabase(BaseContextSensitiveTest.java:489)
	at org.openmrs.test.BaseContextSensitiveTest.baseSetupWithStandardDataAndAuthentication(BaseContextSensitiveTest.java:778)
(33 more lines...)
Collapse Failed ConceptFormControllerTest onSubmit_shouldRemoveAConceptMapFromAnExistingConcept History
Build and Test < 1 sec
org.dbunit.dataset.NoSuchTableException: person
	at org.dbunit.database.DatabaseDataSet.getTableMetaData(DatabaseDataSet.java:282)
	at org.dbunit.operation.AbstractOperation.getOperationMetaData(AbstractOperation.java:80)
	at org.dbunit.operation.RefreshOperation.execute(RefreshOperation.java:98)
	at org.openmrs.test.BaseContextSensitiveTest.executeDataSet(BaseContextSensitiveTest.java:682)
	at org.openmrs.test.BaseContextSensitiveTest.executeDataSet(BaseContextSensitiveTest.java:577)
	at org.openmrs.test.BaseContextSensitiveTest.initializeInMemoryDatabase(BaseContextSensitiveTest.java:489)
	at org.openmrs.test.BaseContextSensitiveTest.baseSetupWithStandardDataAndAuthentication(BaseContextSensitiveTest.java:778)
(33 more lines...)
Collapse Failed ConceptFormControllerTest shouldUpdateConceptByAddingName History
Build and Test < 1 sec
org.dbunit.dataset.NoSuchTableException: person
	at org.dbunit.database.DatabaseDataSet.getTableMetaData(DatabaseDataSet.java:282)
	at org.dbunit.operation.AbstractOperation.getOperationMetaData(AbstractOperation.java:80)
	at org.dbunit.operation.RefreshOperation.execute(RefreshOperation.java:98)
	at org.openmrs.test.BaseContextSensitiveTest.executeDataSet(BaseContextSensitiveTest.java:682)
	at org.openmrs.test.BaseContextSensitiveTest.executeDataSet(BaseContextSensitiveTest.java:577)
	at org.openmrs.test.BaseContextSensitiveTest.initializeInMemoryDatabase(BaseContextSensitiveTest.java:489)
	at org.openmrs.test.BaseContextSensitiveTest.baseSetupWithStandardDataAndAuthentication(BaseContextSensitiveTest.java:778)
(33 more lines...)
Collapse Failed ConceptFormControllerTest onSubmit_shouldCopyNumericValuesIntoNumericConcepts History
Build and Test < 1 sec
org.dbunit.dataset.NoSuchTableException: person
	at org.dbunit.database.DatabaseDataSet.getTableMetaData(DatabaseDataSet.java:282)
	at org.dbunit.operation.AbstractOperation.getOperationMetaData(AbstractOperation.java:80)
	at org.dbunit.operation.RefreshOperation.execute(RefreshOperation.java:98)
	at org.openmrs.test.BaseContextSensitiveTest.executeDataSet(BaseContextSensitiveTest.java:682)
	at org.openmrs.test.BaseContextSensitiveTest.executeDataSet(BaseContextSensitiveTest.java:577)
	at org.openmrs.test.BaseContextSensitiveTest.initializeInMemoryDatabase(BaseContextSensitiveTest.java:489)
	at org.openmrs.test.BaseContextSensitiveTest.baseSetupWithStandardDataAndAuthentication(BaseContextSensitiveTest.java:778)
(33 more lines...)
Collapse Failed ConceptFormControllerTest shouldAddConceptWithOnlyNameSpecified History
Build and Test < 1 sec
org.dbunit.dataset.NoSuchTableException: person
	at org.dbunit.database.DatabaseDataSet.getTableMetaData(DatabaseDataSet.java:282)
	at org.dbunit.operation.AbstractOperation.getOperationMetaData(AbstractOperation.java:80)
	at org.dbunit.operation.RefreshOperation.execute(RefreshOperation.java:98)
	at org.openmrs.test.BaseContextSensitiveTest.executeDataSet(BaseContextSensitiveTest.java:682)
	at org.openmrs.test.BaseContextSensitiveTest.executeDataSet(BaseContextSensitiveTest.java:577)
	at org.openmrs.test.BaseContextSensitiveTest.initializeInMemoryDatabase(BaseContextSensitiveTest.java:489)
	at org.openmrs.test.BaseContextSensitiveTest.baseSetupWithStandardDataAndAuthentication(BaseContextSensitiveTest.java:778)
(33 more lines...)
Collapse Failed ConceptFormControllerTest validateConceptReferenceTermUsesPersistedObjects_shouldAddErrorIfMapTypeIsNotSaved History
Build and Test < 1 sec
org.dbunit.dataset.NoSuchTableException: person
	at org.dbunit.database.DatabaseDataSet.getTableMetaData(DatabaseDataSet.java:282)
	at org.dbunit.operation.AbstractOperation.getOperationMetaData(AbstractOperation.java:80)
	at org.dbunit.operation.RefreshOperation.execute(RefreshOperation.java:98)
	at org.openmrs.test.BaseContextSensitiveTest.executeDataSet(BaseContextSensitiveTest.java:682)
	at org.openmrs.test.BaseContextSensitiveTest.executeDataSet(BaseContextSensitiveTest.java:577)
	at org.openmrs.test.BaseContextSensitiveTest.initializeInMemoryDatabase(BaseContextSensitiveTest.java:489)
	at org.openmrs.test.BaseContextSensitiveTest.baseSetupWithStandardDataAndAuthentication(BaseContextSensitiveTest.java:778)
(33 more lines...)
Collapse Failed ConceptFormControllerTest shouldAddConceptWithNameAndShortNameSpecified History
Build and Test < 1 sec
org.dbunit.dataset.NoSuchTableException: person
	at org.dbunit.database.DatabaseDataSet.getTableMetaData(DatabaseDataSet.java:282)
	at org.dbunit.operation.AbstractOperation.getOperationMetaData(AbstractOperation.java:80)
	at org.dbunit.operation.RefreshOperation.execute(RefreshOperation.java:98)
	at org.openmrs.test.BaseContextSensitiveTest.executeDataSet(BaseContextSensitiveTest.java:682)
	at org.openmrs.test.BaseContextSensitiveTest.executeDataSet(BaseContextSensitiveTest.java:577)
	at org.openmrs.test.BaseContextSensitiveTest.initializeInMemoryDatabase(BaseContextSensitiveTest.java:489)
	at org.openmrs.test.BaseContextSensitiveTest.baseSetupWithStandardDataAndAuthentication(BaseContextSensitiveTest.java:778)
(33 more lines...)
Collapse Failed ConceptFormControllerTest validateConceptReferenceTermUsesPersistedObjects_shouldAddErrorIfTermBIsNotSaved History
Build and Test < 1 sec
org.dbunit.dataset.NoSuchTableException: person
	at org.dbunit.database.DatabaseDataSet.getTableMetaData(DatabaseDataSet.java:282)
	at org.dbunit.operation.AbstractOperation.getOperationMetaData(AbstractOperation.java:80)
	at org.dbunit.operation.RefreshOperation.execute(RefreshOperation.java:98)
	at org.openmrs.test.BaseContextSensitiveTest.executeDataSet(BaseContextSensitiveTest.java:682)
	at org.openmrs.test.BaseContextSensitiveTest.executeDataSet(BaseContextSensitiveTest.java:577)
	at org.openmrs.test.BaseContextSensitiveTest.initializeInMemoryDatabase(BaseContextSensitiveTest.java:489)
	at org.openmrs.test.BaseContextSensitiveTest.baseSetupWithStandardDataAndAuthentication(BaseContextSensitiveTest.java:778)
(33 more lines...)
Collapse Failed ConceptFormControllerTest shouldNotDeleteConceptsWhenConceptsAreLocked History
Build and Test < 1 sec
org.dbunit.dataset.NoSuchTableException: person
	at org.dbunit.database.DatabaseDataSet.getTableMetaData(DatabaseDataSet.java:282)
	at org.dbunit.operation.AbstractOperation.getOperationMetaData(AbstractOperation.java:80)
	at org.dbunit.operation.RefreshOperation.execute(RefreshOperation.java:98)
	at org.openmrs.test.BaseContextSensitiveTest.executeDataSet(BaseContextSensitiveTest.java:682)
	at org.openmrs.test.BaseContextSensitiveTest.executeDataSet(BaseContextSensitiveTest.java:577)
	at org.openmrs.test.BaseContextSensitiveTest.initializeInMemoryDatabase(BaseContextSensitiveTest.java:489)
	at org.openmrs.test.BaseContextSensitiveTest.baseSetupWithStandardDataAndAuthentication(BaseContextSensitiveTest.java:778)
(33 more lines...)
Collapse Failed ConceptFormControllerTest shouldAddConceptWithNameAndShortNameAndDescriptionSpecifiedToNumericConcepts History
Build and Test < 1 sec
org.dbunit.dataset.NoSuchTableException: person
	at org.dbunit.database.DatabaseDataSet.getTableMetaData(DatabaseDataSet.java:282)
	at org.dbunit.operation.AbstractOperation.getOperationMetaData(AbstractOperation.java:80)
	at org.dbunit.operation.RefreshOperation.execute(RefreshOperation.java:98)
	at org.openmrs.test.BaseContextSensitiveTest.executeDataSet(BaseContextSensitiveTest.java:682)
	at org.openmrs.test.BaseContextSensitiveTest.executeDataSet(BaseContextSensitiveTest.java:577)
	at org.openmrs.test.BaseContextSensitiveTest.initializeInMemoryDatabase(BaseContextSensitiveTest.java:489)
	at org.openmrs.test.BaseContextSensitiveTest.baseSetupWithStandardDataAndAuthentication(BaseContextSensitiveTest.java:778)
(33 more lines...)
Collapse Failed ConceptFormControllerTest shouldRemoveConceptAnswersIfDatatypeChangedFromCoded History
Build and Test < 1 sec
org.dbunit.dataset.NoSuchTableException: person
	at org.dbunit.database.DatabaseDataSet.getTableMetaData(DatabaseDataSet.java:282)
	at org.dbunit.operation.AbstractOperation.getOperationMetaData(AbstractOperation.java:80)
	at org.dbunit.operation.RefreshOperation.execute(RefreshOperation.java:98)
	at org.openmrs.test.BaseContextSensitiveTest.executeDataSet(BaseContextSensitiveTest.java:682)
	at org.openmrs.test.BaseContextSensitiveTest.executeDataSet(BaseContextSensitiveTest.java:577)
	at org.openmrs.test.BaseContextSensitiveTest.initializeInMemoryDatabase(BaseContextSensitiveTest.java:489)
	at org.openmrs.test.BaseContextSensitiveTest.baseSetupWithStandardDataAndAuthentication(BaseContextSensitiveTest.java:778)
(33 more lines...)
Collapse Failed ConceptFormControllerTest shouldRemoveConceptAnswer History
Build and Test < 1 sec
org.dbunit.dataset.NoSuchTableException: person
	at org.dbunit.database.DatabaseDataSet.getTableMetaData(DatabaseDataSet.java:282)
	at org.dbunit.operation.AbstractOperation.getOperationMetaData(AbstractOperation.java:80)
	at org.dbunit.operation.RefreshOperation.execute(RefreshOperation.java:98)
	at org.openmrs.test.BaseContextSensitiveTest.executeDataSet(BaseContextSensitiveTest.java:682)
	at org.openmrs.test.BaseContextSensitiveTest.executeDataSet(BaseContextSensitiveTest.java:577)
	at org.openmrs.test.BaseContextSensitiveTest.initializeInMemoryDatabase(BaseContextSensitiveTest.java:489)
	at org.openmrs.test.BaseContextSensitiveTest.baseSetupWithStandardDataAndAuthentication(BaseContextSensitiveTest.java:778)
(33 more lines...)
Collapse Failed ConceptFormControllerTest onSubmit_shouldReturnAConceptWithANullIdIfNoMatchIsFound History
Build and Test < 1 sec
org.dbunit.dataset.NoSuchTableException: person
	at org.dbunit.database.DatabaseDataSet.getTableMetaData(DatabaseDataSet.java:282)
	at org.dbunit.operation.AbstractOperation.getOperationMetaData(AbstractOperation.java:80)
	at org.dbunit.operation.RefreshOperation.execute(RefreshOperation.java:98)
	at org.openmrs.test.BaseContextSensitiveTest.executeDataSet(BaseContextSensitiveTest.java:682)
	at org.openmrs.test.BaseContextSensitiveTest.executeDataSet(BaseContextSensitiveTest.java:577)
	at org.openmrs.test.BaseContextSensitiveTest.initializeInMemoryDatabase(BaseContextSensitiveTest.java:489)
	at org.openmrs.test.BaseContextSensitiveTest.baseSetupWithStandardDataAndAuthentication(BaseContextSensitiveTest.java:778)
(33 more lines...)
Collapse Failed ConceptFormControllerTest onSubmit_shouldVoidASynonymMarkedAsPreferredWhenItIsRemoved History
Build and Test < 1 sec
org.dbunit.dataset.NoSuchTableException: person
	at org.dbunit.database.DatabaseDataSet.getTableMetaData(DatabaseDataSet.java:282)
	at org.dbunit.operation.AbstractOperation.getOperationMetaData(AbstractOperation.java:80)
	at org.dbunit.operation.RefreshOperation.execute(RefreshOperation.java:98)
	at org.openmrs.test.BaseContextSensitiveTest.executeDataSet(BaseContextSensitiveTest.java:682)
	at org.openmrs.test.BaseContextSensitiveTest.executeDataSet(BaseContextSensitiveTest.java:577)
	at org.openmrs.test.BaseContextSensitiveTest.initializeInMemoryDatabase(BaseContextSensitiveTest.java:489)
	at org.openmrs.test.BaseContextSensitiveTest.baseSetupWithStandardDataAndAuthentication(BaseContextSensitiveTest.java:778)
(33 more lines...)
Collapse Failed ConceptFormControllerTest onSubmit_shouldSetTheLocalPreferredName History
Build and Test < 1 sec
org.dbunit.dataset.NoSuchTableException: person
	at org.dbunit.database.DatabaseDataSet.getTableMetaData(DatabaseDataSet.java:282)
	at org.dbunit.operation.AbstractOperation.getOperationMetaData(AbstractOperation.java:80)
	at org.dbunit.operation.RefreshOperation.execute(RefreshOperation.java:98)
	at org.openmrs.test.BaseContextSensitiveTest.executeDataSet(BaseContextSensitiveTest.java:682)
	at org.openmrs.test.BaseContextSensitiveTest.executeDataSet(BaseContextSensitiveTest.java:577)
	at org.openmrs.test.BaseContextSensitiveTest.initializeInMemoryDatabase(BaseContextSensitiveTest.java:489)
	at org.openmrs.test.BaseContextSensitiveTest.baseSetupWithStandardDataAndAuthentication(BaseContextSensitiveTest.java:778)
(33 more lines...)
Collapse Failed ConceptFormControllerTest shouldUpdateConceptWithNameAlreadyInSynonymList History
Build and Test < 1 sec
org.dbunit.dataset.NoSuchTableException: person
	at org.dbunit.database.DatabaseDataSet.getTableMetaData(DatabaseDataSet.java:282)
	at org.dbunit.operation.AbstractOperation.getOperationMetaData(AbstractOperation.java:80)
	at org.dbunit.operation.RefreshOperation.execute(RefreshOperation.java:98)
	at org.openmrs.test.BaseContextSensitiveTest.executeDataSet(BaseContextSensitiveTest.java:682)
	at org.openmrs.test.BaseContextSensitiveTest.executeDataSet(BaseContextSensitiveTest.java:577)
	at org.openmrs.test.BaseContextSensitiveTest.initializeInMemoryDatabase(BaseContextSensitiveTest.java:489)
	at org.openmrs.test.BaseContextSensitiveTest.baseSetupWithStandardDataAndAuthentication(BaseContextSensitiveTest.java:778)
(33 more lines...)
Collapse Failed ConceptFormControllerTest shouldRemoveConceptSet History
Build and Test < 1 sec
org.dbunit.dataset.NoSuchTableException: person
	at org.dbunit.database.DatabaseDataSet.getTableMetaData(DatabaseDataSet.java:282)
	at org.dbunit.operation.AbstractOperation.getOperationMetaData(AbstractOperation.java:80)
	at org.dbunit.operation.RefreshOperation.execute(RefreshOperation.java:98)
	at org.openmrs.test.BaseContextSensitiveTest.executeDataSet(BaseContextSensitiveTest.java:682)
	at org.openmrs.test.BaseContextSensitiveTest.executeDataSet(BaseContextSensitiveTest.java:577)
	at org.openmrs.test.BaseContextSensitiveTest.initializeInMemoryDatabase(BaseContextSensitiveTest.java:489)
	at org.openmrs.test.BaseContextSensitiveTest.baseSetupWithStandardDataAndAuthentication(BaseContextSensitiveTest.java:778)
(33 more lines...)
Collapse Failed ConceptFormControllerTest validateConceptReferenceTermUsesPersistedObjects_shouldAddErrorIfSourceIsNotSaved History
Build and Test < 1 sec
org.dbunit.dataset.NoSuchTableException: person
	at org.dbunit.database.DatabaseDataSet.getTableMetaData(DatabaseDataSet.java:282)
	at org.dbunit.operation.AbstractOperation.getOperationMetaData(AbstractOperation.java:80)
	at org.dbunit.operation.RefreshOperation.execute(RefreshOperation.java:98)
	at org.openmrs.test.BaseContextSensitiveTest.executeDataSet(BaseContextSensitiveTest.java:682)
	at org.openmrs.test.BaseContextSensitiveTest.executeDataSet(BaseContextSensitiveTest.java:577)
	at org.openmrs.test.BaseContextSensitiveTest.initializeInMemoryDatabase(BaseContextSensitiveTest.java:489)
	at org.openmrs.test.BaseContextSensitiveTest.baseSetupWithStandardDataAndAuthentication(BaseContextSensitiveTest.java:778)
(33 more lines...)
Collapse Failed ConceptFormControllerTest onSubmit_shouldAddANewConceptMapWhenCreatingAConcept History
Build and Test < 1 sec
org.dbunit.dataset.NoSuchTableException: person
	at org.dbunit.database.DatabaseDataSet.getTableMetaData(DatabaseDataSet.java:282)
	at org.dbunit.operation.AbstractOperation.getOperationMetaData(AbstractOperation.java:80)
	at org.dbunit.operation.RefreshOperation.execute(RefreshOperation.java:98)
	at org.openmrs.test.BaseContextSensitiveTest.executeDataSet(BaseContextSensitiveTest.java:682)
	at org.openmrs.test.BaseContextSensitiveTest.executeDataSet(BaseContextSensitiveTest.java:577)
	at org.openmrs.test.BaseContextSensitiveTest.initializeInMemoryDatabase(BaseContextSensitiveTest.java:489)
	at org.openmrs.test.BaseContextSensitiveTest.baseSetupWithStandardDataAndAuthentication(BaseContextSensitiveTest.java:778)
(33 more lines...)
Collapse Failed ConceptFormControllerTest shouldReplacePreviousDescription History
Build and Test < 1 sec
org.dbunit.dataset.NoSuchTableException: person
	at org.dbunit.database.DatabaseDataSet.getTableMetaData(DatabaseDataSet.java:282)
	at org.dbunit.operation.AbstractOperation.getOperationMetaData(AbstractOperation.java:80)
	at org.dbunit.operation.RefreshOperation.execute(RefreshOperation.java:98)
	at org.openmrs.test.BaseContextSensitiveTest.executeDataSet(BaseContextSensitiveTest.java:682)
	at org.openmrs.test.BaseContextSensitiveTest.executeDataSet(BaseContextSensitiveTest.java:577)
	at org.openmrs.test.BaseContextSensitiveTest.initializeInMemoryDatabase(BaseContextSensitiveTest.java:489)
	at org.openmrs.test.BaseContextSensitiveTest.baseSetupWithStandardDataAndAuthentication(BaseContextSensitiveTest.java:778)
(33 more lines...)
Collapse Failed ConceptFormControllerTest shouldGetConcept History
Build and Test < 1 sec
org.dbunit.dataset.NoSuchTableException: person
	at org.dbunit.database.DatabaseDataSet.getTableMetaData(DatabaseDataSet.java:282)
	at org.dbunit.operation.AbstractOperation.getOperationMetaData(AbstractOperation.java:80)
	at org.dbunit.operation.RefreshOperation.execute(RefreshOperation.java:98)
	at org.openmrs.test.BaseContextSensitiveTest.executeDataSet(BaseContextSensitiveTest.java:682)
	at org.openmrs.test.BaseContextSensitiveTest.executeDataSet(BaseContextSensitiveTest.java:577)
	at org.openmrs.test.BaseContextSensitiveTest.initializeInMemoryDatabase(BaseContextSensitiveTest.java:489)
	at org.openmrs.test.BaseContextSensitiveTest.baseSetupWithStandardDataAndAuthentication(BaseContextSensitiveTest.java:778)
(33 more lines...)
Collapse Failed ConceptFormControllerTest shouldVoidShortName History
Build and Test < 1 sec
org.dbunit.dataset.NoSuchTableException: person
	at org.dbunit.database.DatabaseDataSet.getTableMetaData(DatabaseDataSet.java:282)
	at org.dbunit.operation.AbstractOperation.getOperationMetaData(AbstractOperation.java:80)
	at org.dbunit.operation.RefreshOperation.execute(RefreshOperation.java:98)
	at org.openmrs.test.BaseContextSensitiveTest.executeDataSet(BaseContextSensitiveTest.java:682)
	at org.openmrs.test.BaseContextSensitiveTest.executeDataSet(BaseContextSensitiveTest.java:577)
	at org.openmrs.test.BaseContextSensitiveTest.initializeInMemoryDatabase(BaseContextSensitiveTest.java:489)
	at org.openmrs.test.BaseContextSensitiveTest.baseSetupWithStandardDataAndAuthentication(BaseContextSensitiveTest.java:778)
(33 more lines...)
Collapse Failed ConceptFormControllerTest onSubmit_shouldAddANewConceptMapToAnExistingConcept History
Build and Test < 1 sec
org.dbunit.dataset.NoSuchTableException: person
	at org.dbunit.database.DatabaseDataSet.getTableMetaData(DatabaseDataSet.java:282)
	at org.dbunit.operation.AbstractOperation.getOperationMetaData(AbstractOperation.java:80)
	at org.dbunit.operation.RefreshOperation.execute(RefreshOperation.java:98)
	at org.openmrs.test.BaseContextSensitiveTest.executeDataSet(BaseContextSensitiveTest.java:682)
	at org.openmrs.test.BaseContextSensitiveTest.executeDataSet(BaseContextSensitiveTest.java:577)
	at org.openmrs.test.BaseContextSensitiveTest.initializeInMemoryDatabase(BaseContextSensitiveTest.java:489)
	at org.openmrs.test.BaseContextSensitiveTest.baseSetupWithStandardDataAndAuthentication(BaseContextSensitiveTest.java:778)
(33 more lines...)
Collapse Failed GlobalPropertyPortletControllerTest setupModelForModule_shouldNotChangeModeIfForModuleIsNotPresent History
Build and Test < 1 sec
org.dbunit.dataset.NoSuchTableException: person
	at org.dbunit.database.DatabaseDataSet.getTableMetaData(DatabaseDataSet.java:282)
	at org.dbunit.operation.AbstractOperation.getOperationMetaData(AbstractOperation.java:80)
	at org.dbunit.operation.RefreshOperation.execute(RefreshOperation.java:98)
	at org.openmrs.test.BaseContextSensitiveTest.executeDataSet(BaseContextSensitiveTest.java:682)
	at org.openmrs.test.BaseContextSensitiveTest.executeDataSet(BaseContextSensitiveTest.java:577)
	at org.openmrs.test.BaseContextSensitiveTest.initializeInMemoryDatabase(BaseContextSensitiveTest.java:489)
	at org.openmrs.test.BaseContextSensitiveTest.baseSetupWithStandardDataAndAuthentication(BaseContextSensitiveTest.java:778)
(33 more lines...)
Collapse Failed GlobalPropertyPortletControllerTest setupModelForModule_shouldNotOverrideExcludePrefixButConcatenate History
Build and Test < 1 sec
org.dbunit.dataset.NoSuchTableException: person
	at org.dbunit.database.DatabaseDataSet.getTableMetaData(DatabaseDataSet.java:282)
	at org.dbunit.operation.AbstractOperation.getOperationMetaData(AbstractOperation.java:80)
	at org.dbunit.operation.RefreshOperation.execute(RefreshOperation.java:98)
	at org.openmrs.test.BaseContextSensitiveTest.executeDataSet(BaseContextSensitiveTest.java:682)
	at org.openmrs.test.BaseContextSensitiveTest.executeDataSet(BaseContextSensitiveTest.java:577)
	at org.openmrs.test.BaseContextSensitiveTest.initializeInMemoryDatabase(BaseContextSensitiveTest.java:489)
	at org.openmrs.test.BaseContextSensitiveTest.baseSetupWithStandardDataAndAuthentication(BaseContextSensitiveTest.java:778)
(33 more lines...)
Collapse Failed GlobalPropertyPortletControllerTest setupModelForModule_shouldChangeModelIfForModuleIsPresent History
Build and Test < 1 sec
org.dbunit.dataset.NoSuchTableException: person
	at org.dbunit.database.DatabaseDataSet.getTableMetaData(DatabaseDataSet.java:282)
	at org.dbunit.operation.AbstractOperation.getOperationMetaData(AbstractOperation.java:80)
	at org.dbunit.operation.RefreshOperation.execute(RefreshOperation.java:98)
	at org.openmrs.test.BaseContextSensitiveTest.executeDataSet(BaseContextSensitiveTest.java:682)
	at org.openmrs.test.BaseContextSensitiveTest.executeDataSet(BaseContextSensitiveTest.java:577)
	at org.openmrs.test.BaseContextSensitiveTest.initializeInMemoryDatabase(BaseContextSensitiveTest.java:489)
	at org.openmrs.test.BaseContextSensitiveTest.baseSetupWithStandardDataAndAuthentication(BaseContextSensitiveTest.java:778)
(33 more lines...)
Collapse Failed GlobalPropertyPortletControllerTest populateModel_shouldExcludeMultiplePrefixes History
Build and Test < 1 sec
org.dbunit.dataset.NoSuchTableException: person
	at org.dbunit.database.DatabaseDataSet.getTableMetaData(DatabaseDataSet.java:282)
	at org.dbunit.operation.AbstractOperation.getOperationMetaData(AbstractOperation.java:80)
	at org.dbunit.operation.RefreshOperation.execute(RefreshOperation.java:98)
	at org.openmrs.test.BaseContextSensitiveTest.executeDataSet(BaseContextSensitiveTest.java:682)
	at org.openmrs.test.BaseContextSensitiveTest.executeDataSet(BaseContextSensitiveTest.java:577)
	at org.openmrs.test.BaseContextSensitiveTest.initializeInMemoryDatabase(BaseContextSensitiveTest.java:489)
	at org.openmrs.test.BaseContextSensitiveTest.baseSetupWithStandardDataAndAuthentication(BaseContextSensitiveTest.java:778)
(33 more lines...)
Collapse Failed OptionsFormControllerTest shouldRejectEmptySecretQuestion History
Build and Test < 1 sec
org.dbunit.dataset.NoSuchTableException: person
	at org.dbunit.database.DatabaseDataSet.getTableMetaData(DatabaseDataSet.java:282)
	at org.dbunit.operation.AbstractOperation.getOperationMetaData(AbstractOperation.java:80)
	at org.dbunit.operation.RefreshOperation.execute(RefreshOperation.java:98)
	at org.openmrs.test.BaseContextSensitiveTest.executeDataSet(BaseContextSensitiveTest.java:682)
	at org.openmrs.test.BaseContextSensitiveTest.executeDataSet(BaseContextSensitiveTest.java:577)
	at org.openmrs.test.BaseContextSensitiveTest.initializeInMemoryDatabase(BaseContextSensitiveTest.java:489)
	at org.openmrs.test.BaseContextSensitiveTest.baseSetupWithStandardDataAndAuthentication(BaseContextSensitiveTest.java:778)
(33 more lines...)
Collapse Failed OptionsFormControllerTest shouldRejectEmptyNotificationAddress History
Build and Test < 1 sec
org.dbunit.dataset.NoSuchTableException: person
	at org.dbunit.database.DatabaseDataSet.getTableMetaData(DatabaseDataSet.java:282)
	at org.dbunit.operation.AbstractOperation.getOperationMetaData(AbstractOperation.java:80)
	at org.dbunit.operation.RefreshOperation.execute(RefreshOperation.java:98)
	at org.openmrs.test.BaseContextSensitiveTest.executeDataSet(BaseContextSensitiveTest.java:682)
	at org.openmrs.test.BaseContextSensitiveTest.executeDataSet(BaseContextSensitiveTest.java:577)
	at org.openmrs.test.BaseContextSensitiveTest.initializeInMemoryDatabase(BaseContextSensitiveTest.java:489)
	at org.openmrs.test.BaseContextSensitiveTest.baseSetupWithStandardDataAndAuthentication(BaseContextSensitiveTest.java:778)
(33 more lines...)
Collapse Failed OptionsFormControllerTest shouldRejectInvalidNotificationAddress History
Build and Test < 1 sec
org.dbunit.dataset.NoSuchTableException: person
	at org.dbunit.database.DatabaseDataSet.getTableMetaData(DatabaseDataSet.java:282)
	at org.dbunit.operation.AbstractOperation.getOperationMetaData(AbstractOperation.java:80)
	at org.dbunit.operation.RefreshOperation.execute(RefreshOperation.java:98)
	at org.openmrs.test.BaseContextSensitiveTest.executeDataSet(BaseContextSensitiveTest.java:682)
	at org.openmrs.test.BaseContextSensitiveTest.executeDataSet(BaseContextSensitiveTest.java:577)
	at org.openmrs.test.BaseContextSensitiveTest.initializeInMemoryDatabase(BaseContextSensitiveTest.java:489)
	at org.openmrs.test.BaseContextSensitiveTest.baseSetupWithStandardDataAndAuthentication(BaseContextSensitiveTest.java:778)
(33 more lines...)
Collapse Failed OptionsFormControllerTest shouldAcceptValidNotificationAddress History
Build and Test < 1 sec
org.dbunit.dataset.NoSuchTableException: person
	at org.dbunit.database.DatabaseDataSet.getTableMetaData(DatabaseDataSet.java:282)
	at org.dbunit.operation.AbstractOperation.getOperationMetaData(AbstractOperation.java:80)
	at org.dbunit.operation.RefreshOperation.execute(RefreshOperation.java:98)
	at org.openmrs.test.BaseContextSensitiveTest.executeDataSet(BaseContextSensitiveTest.java:682)
	at org.openmrs.test.BaseContextSensitiveTest.executeDataSet(BaseContextSensitiveTest.java:577)
	at org.openmrs.test.BaseContextSensitiveTest.initializeInMemoryDatabase(BaseContextSensitiveTest.java:489)
	at org.openmrs.test.BaseContextSensitiveTest.baseSetupWithStandardDataAndAuthentication(BaseContextSensitiveTest.java:778)
(33 more lines...)
Collapse Failed OptionsFormControllerTest onSubmit_shouldRejectInvalidEmailAddressAsUsernameIfEnabled History
Build and Test < 1 sec
org.dbunit.dataset.NoSuchTableException: person
	at org.dbunit.database.DatabaseDataSet.getTableMetaData(DatabaseDataSet.java:282)
	at org.dbunit.operation.AbstractOperation.getOperationMetaData(AbstractOperation.java:80)
	at org.dbunit.operation.RefreshOperation.execute(RefreshOperation.java:98)
	at org.openmrs.test.BaseContextSensitiveTest.executeDataSet(BaseContextSensitiveTest.java:682)
	at org.openmrs.test.BaseContextSensitiveTest.executeDataSet(BaseContextSensitiveTest.java:577)
	at org.openmrs.test.BaseContextSensitiveTest.initializeInMemoryDatabase(BaseContextSensitiveTest.java:489)
	at org.openmrs.test.BaseContextSensitiveTest.baseSetupWithStandardDataAndAuthentication(BaseContextSensitiveTest.java:778)
(33 more lines...)
Collapse Failed OptionsFormControllerTest onSubmit_shouldReject1CharacterAsUsername History
Build and Test < 1 sec
org.dbunit.dataset.NoSuchTableException: person
	at org.dbunit.database.DatabaseDataSet.getTableMetaData(DatabaseDataSet.java:282)
	at org.dbunit.operation.AbstractOperation.getOperationMetaData(AbstractOperation.java:80)
	at org.dbunit.operation.RefreshOperation.execute(RefreshOperation.java:98)
	at org.openmrs.test.BaseContextSensitiveTest.executeDataSet(BaseContextSensitiveTest.java:682)
	at org.openmrs.test.BaseContextSensitiveTest.executeDataSet(BaseContextSensitiveTest.java:577)
	at org.openmrs.test.BaseContextSensitiveTest.initializeInMemoryDatabase(BaseContextSensitiveTest.java:489)
	at org.openmrs.test.BaseContextSensitiveTest.baseSetupWithStandardDataAndAuthentication(BaseContextSensitiveTest.java:778)
(33 more lines...)
Collapse Failed OptionsFormControllerTest onSubmit_shouldAcceptEmailAddressAsUsernameIfEnabled History
Build and Test < 1 sec
org.dbunit.dataset.NoSuchTableException: person
	at org.dbunit.database.DatabaseDataSet.getTableMetaData(DatabaseDataSet.java:282)
	at org.dbunit.operation.AbstractOperation.getOperationMetaData(AbstractOperation.java:80)
	at org.dbunit.operation.RefreshOperation.execute(RefreshOperation.java:98)
	at org.openmrs.test.BaseContextSensitiveTest.executeDataSet(BaseContextSensitiveTest.java:682)
	at org.openmrs.test.BaseContextSensitiveTest.executeDataSet(BaseContextSensitiveTest.java:577)
	at org.openmrs.test.BaseContextSensitiveTest.initializeInMemoryDatabase(BaseContextSensitiveTest.java:489)
	at org.openmrs.test.BaseContextSensitiveTest.baseSetupWithStandardDataAndAuthentication(BaseContextSensitiveTest.java:778)
(33 more lines...)
Collapse Failed OptionsFormControllerTest onSubmit_shouldAccept2CharactersAsUsername History
Build and Test < 1 sec
org.dbunit.dataset.NoSuchTableException: person
	at org.dbunit.database.DatabaseDataSet.getTableMetaData(DatabaseDataSet.java:282)
	at org.dbunit.operation.AbstractOperation.getOperationMetaData(AbstractOperation.java:80)
	at org.dbunit.operation.RefreshOperation.execute(RefreshOperation.java:98)
	at org.openmrs.test.BaseContextSensitiveTest.executeDataSet(BaseContextSensitiveTest.java:682)
	at org.openmrs.test.BaseContextSensitiveTest.executeDataSet(BaseContextSensitiveTest.java:577)
	at org.openmrs.test.BaseContextSensitiveTest.initializeInMemoryDatabase(BaseContextSensitiveTest.java:489)
	at org.openmrs.test.BaseContextSensitiveTest.baseSetupWithStandardDataAndAuthentication(BaseContextSensitiveTest.java:778)
(33 more lines...)
Collapse Failed OptionsFormControllerTest shouldRejectEmptySecretAnswer History
Build and Test < 1 sec
org.dbunit.dataset.NoSuchTableException: person
	at org.dbunit.database.DatabaseDataSet.getTableMetaData(DatabaseDataSet.java:282)
	at org.dbunit.operation.AbstractOperation.getOperationMetaData(AbstractOperation.java:80)
	at org.dbunit.operation.RefreshOperation.execute(RefreshOperation.java:98)
	at org.openmrs.test.BaseContextSensitiveTest.executeDataSet(BaseContextSensitiveTest.java:682)
	at org.openmrs.test.BaseContextSensitiveTest.executeDataSet(BaseContextSensitiveTest.java:577)
	at org.openmrs.test.BaseContextSensitiveTest.initializeInMemoryDatabase(BaseContextSensitiveTest.java:489)
	at org.openmrs.test.BaseContextSensitiveTest.baseSetupWithStandardDataAndAuthentication(BaseContextSensitiveTest.java:778)
(33 more lines...)
Collapse Failed OptionsFormControllerTest shouldChangeSecretQuestionAndAnswer History
Build and Test < 1 sec
org.dbunit.dataset.NoSuchTableException: person
	at org.dbunit.database.DatabaseDataSet.getTableMetaData(DatabaseDataSet.java:282)
	at org.dbunit.operation.AbstractOperation.getOperationMetaData(AbstractOperation.java:80)
	at org.dbunit.operation.RefreshOperation.execute(RefreshOperation.java:98)
	at org.openmrs.test.BaseContextSensitiveTest.executeDataSet(BaseContextSensitiveTest.java:682)
	at org.openmrs.test.BaseContextSensitiveTest.executeDataSet(BaseContextSensitiveTest.java:577)
	at org.openmrs.test.BaseContextSensitiveTest.initializeInMemoryDatabase(BaseContextSensitiveTest.java:489)
	at org.openmrs.test.BaseContextSensitiveTest.baseSetupWithStandardDataAndAuthentication(BaseContextSensitiveTest.java:778)
(33 more lines...)
Collapse Failed PortletControllerTest handleRequest_shouldCalculateBmiIntoPatientBmiAsString History
Build and Test < 1 sec
org.dbunit.dataset.NoSuchTableException: person
	at org.dbunit.database.DatabaseDataSet.getTableMetaData(DatabaseDataSet.java:282)
	at org.dbunit.operation.AbstractOperation.getOperationMetaData(AbstractOperation.java:80)
	at org.dbunit.operation.RefreshOperation.execute(RefreshOperation.java:98)
	at org.openmrs.test.BaseContextSensitiveTest.executeDataSet(BaseContextSensitiveTest.java:682)
	at org.openmrs.test.BaseContextSensitiveTest.executeDataSet(BaseContextSensitiveTest.java:577)
	at org.openmrs.test.BaseContextSensitiveTest.initializeInMemoryDatabase(BaseContextSensitiveTest.java:489)
	at org.openmrs.test.BaseContextSensitiveTest.baseSetupWithStandardDataAndAuthentication(BaseContextSensitiveTest.java:778)
(33 more lines...)
Collapse Failed PortletControllerTest handleRequest_shouldNotFailWithEmptyHeightAndWeightProperties History
Build and Test < 1 sec
org.dbunit.dataset.NoSuchTableException: person
	at org.dbunit.database.DatabaseDataSet.getTableMetaData(DatabaseDataSet.java:282)
	at org.dbunit.operation.AbstractOperation.getOperationMetaData(AbstractOperation.java:80)
	at org.dbunit.operation.RefreshOperation.execute(RefreshOperation.java:98)
	at org.openmrs.test.BaseContextSensitiveTest.executeDataSet(BaseContextSensitiveTest.java:682)
	at org.openmrs.test.BaseContextSensitiveTest.executeDataSet(BaseContextSensitiveTest.java:577)
	at org.openmrs.test.BaseContextSensitiveTest.initializeInMemoryDatabase(BaseContextSensitiveTest.java:489)
	at org.openmrs.test.BaseContextSensitiveTest.baseSetupWithStandardDataAndAuthentication(BaseContextSensitiveTest.java:778)
(33 more lines...)
Collapse Failed ConceptFormControllerTest ConceptFormBackingObject_shouldCopyNumericAttributes History
Build and Test < 1 sec
org.dbunit.dataset.NoSuchTableException: person
	at org.dbunit.database.DatabaseDataSet.getTableMetaData(DatabaseDataSet.java:282)
	at org.dbunit.operation.AbstractOperation.getOperationMetaData(AbstractOperation.java:80)
	at org.dbunit.operation.RefreshOperation.execute(RefreshOperation.java:98)
	at org.openmrs.test.BaseContextSensitiveTest.executeDataSet(BaseContextSensitiveTest.java:682)
	at org.openmrs.test.BaseContextSensitiveTest.executeDataSet(BaseContextSensitiveTest.java:577)
	at org.openmrs.test.BaseContextSensitiveTest.initializeInMemoryDatabase(BaseContextSensitiveTest.java:489)
	at org.openmrs.test.BaseContextSensitiveTest.baseSetupWithStandardDataAndAuthentication(BaseContextSensitiveTest.java:778)
(33 more lines...)
Collapse Failed ConceptProposalFormControllerTest onSubmit_shouldCreateASingleUniqueSynonymAndObsForAllSimilarProposals History
Build and Test < 1 sec
org.dbunit.dataset.NoSuchTableException: person
	at org.dbunit.database.DatabaseDataSet.getTableMetaData(DatabaseDataSet.java:282)
	at org.dbunit.operation.AbstractOperation.getOperationMetaData(AbstractOperation.java:80)
	at org.dbunit.operation.RefreshOperation.execute(RefreshOperation.java:98)
	at org.openmrs.test.BaseContextSensitiveTest.executeDataSet(BaseContextSensitiveTest.java:682)
	at org.openmrs.test.BaseContextSensitiveTest.executeDataSet(BaseContextSensitiveTest.java:577)
	at org.openmrs.test.BaseContextSensitiveTest.initializeInMemoryDatabase(BaseContextSensitiveTest.java:489)
	at org.openmrs.test.BaseContextSensitiveTest.baseSetupWithStandardDataAndAuthentication(BaseContextSensitiveTest.java:778)
(33 more lines...)
Collapse Failed ConceptSourceFormControllerTest onSubmit_shouldRestoreRetiredConceptSource History
Build and Test < 1 sec
org.dbunit.dataset.NoSuchTableException: person
	at org.dbunit.database.DatabaseDataSet.getTableMetaData(DatabaseDataSet.java:282)
	at org.dbunit.operation.AbstractOperation.getOperationMetaData(AbstractOperation.java:80)
	at org.dbunit.operation.RefreshOperation.execute(RefreshOperation.java:98)
	at org.openmrs.test.BaseContextSensitiveTest.executeDataSet(BaseContextSensitiveTest.java:682)
	at org.openmrs.test.BaseContextSensitiveTest.executeDataSet(BaseContextSensitiveTest.java:577)
	at org.openmrs.test.BaseContextSensitiveTest.initializeInMemoryDatabase(BaseContextSensitiveTest.java:489)
	at org.openmrs.test.BaseContextSensitiveTest.baseSetupWithStandardDataAndAuthentication(BaseContextSensitiveTest.java:778)
(33 more lines...)
Collapse Failed ConceptSourceFormControllerTest onSubmit_shouldDeleteConceptSource History
Build and Test 1 sec
org.dbunit.dataset.NoSuchTableException: person
	at org.dbunit.database.DatabaseDataSet.getTableMetaData(DatabaseDataSet.java:282)
	at org.dbunit.operation.AbstractOperation.getOperationMetaData(AbstractOperation.java:80)
	at org.dbunit.operation.RefreshOperation.execute(RefreshOperation.java:98)
	at org.openmrs.test.BaseContextSensitiveTest.executeDataSet(BaseContextSensitiveTest.java:682)
	at org.openmrs.test.BaseContextSensitiveTest.executeDataSet(BaseContextSensitiveTest.java:577)
	at org.openmrs.test.BaseContextSensitiveTest.initializeInMemoryDatabase(BaseContextSensitiveTest.java:489)
	at org.openmrs.test.BaseContextSensitiveTest.baseSetupWithStandardDataAndAuthentication(BaseContextSensitiveTest.java:778)
(33 more lines...)
Collapse Failed ConceptSourceFormControllerTest onSubmit_shouldRetireConceptSource History
Build and Test < 1 sec
org.dbunit.dataset.NoSuchTableException: person
	at org.dbunit.database.DatabaseDataSet.getTableMetaData(DatabaseDataSet.java:282)
	at org.dbunit.operation.AbstractOperation.getOperationMetaData(AbstractOperation.java:80)
	at org.dbunit.operation.RefreshOperation.execute(RefreshOperation.java:98)
	at org.openmrs.test.BaseContextSensitiveTest.executeDataSet(BaseContextSensitiveTest.java:682)
	at org.openmrs.test.BaseContextSensitiveTest.executeDataSet(BaseContextSensitiveTest.java:577)
	at org.openmrs.test.BaseContextSensitiveTest.initializeInMemoryDatabase(BaseContextSensitiveTest.java:489)
	at org.openmrs.test.BaseContextSensitiveTest.baseSetupWithStandardDataAndAuthentication(BaseContextSensitiveTest.java:778)
(33 more lines...)
Collapse Failed ConceptStopWordFormControllerTest handleSubmission_shouldReturnErrorMessageForAnEmptyConceptStopWord History
Build and Test < 1 sec
org.dbunit.dataset.NoSuchTableException: person
	at org.dbunit.database.DatabaseDataSet.getTableMetaData(DatabaseDataSet.java:282)
	at org.dbunit.operation.AbstractOperation.getOperationMetaData(AbstractOperation.java:80)
	at org.dbunit.operation.RefreshOperation.execute(RefreshOperation.java:98)
	at org.openmrs.test.BaseContextSensitiveTest.executeDataSet(BaseContextSensitiveTest.java:682)
	at org.openmrs.test.BaseContextSensitiveTest.executeDataSet(BaseContextSensitiveTest.java:577)
	at org.openmrs.test.BaseContextSensitiveTest.initializeInMemoryDatabase(BaseContextSensitiveTest.java:489)
	at org.openmrs.test.BaseContextSensitiveTest.baseSetupWithStandardDataAndAuthentication(BaseContextSensitiveTest.java:778)
(33 more lines...)
Collapse Failed ConceptStopWordFormControllerTest handleSubmission_shouldAddNewConceptStopWord History
Build and Test < 1 sec
org.dbunit.dataset.NoSuchTableException: person
	at org.dbunit.database.DatabaseDataSet.getTableMetaData(DatabaseDataSet.java:282)
	at org.dbunit.operation.AbstractOperation.getOperationMetaData(AbstractOperation.java:80)
	at org.dbunit.operation.RefreshOperation.execute(RefreshOperation.java:98)
	at org.openmrs.test.BaseContextSensitiveTest.executeDataSet(BaseContextSensitiveTest.java:682)
	at org.openmrs.test.BaseContextSensitiveTest.executeDataSet(BaseContextSensitiveTest.java:577)
	at org.openmrs.test.BaseContextSensitiveTest.initializeInMemoryDatabase(BaseContextSensitiveTest.java:489)
	at org.openmrs.test.BaseContextSensitiveTest.baseSetupWithStandardDataAndAuthentication(BaseContextSensitiveTest.java:778)
(33 more lines...)
Collapse Failed ConceptStopWordListControllerTest handleSubmission_shouldAddTheDeleteSuccessMessageInSession History
Build and Test < 1 sec
org.dbunit.dataset.NoSuchTableException: person
	at org.dbunit.database.DatabaseDataSet.getTableMetaData(DatabaseDataSet.java:282)
	at org.dbunit.operation.AbstractOperation.getOperationMetaData(AbstractOperation.java:80)
	at org.dbunit.operation.RefreshOperation.execute(RefreshOperation.java:98)
	at org.openmrs.test.BaseContextSensitiveTest.executeDataSet(BaseContextSensitiveTest.java:682)
	at org.openmrs.test.BaseContextSensitiveTest.executeDataSet(BaseContextSensitiveTest.java:577)
	at org.openmrs.test.BaseContextSensitiveTest.initializeInMemoryDatabase(BaseContextSensitiveTest.java:489)
	at org.openmrs.test.BaseContextSensitiveTest.baseSetupWithStandardDataAndAuthentication(BaseContextSensitiveTest.java:778)
(33 more lines...)
Collapse Failed ConceptStopWordListControllerTest showForm_shouldReturnConceptStopWordListView History
Build and Test < 1 sec
org.dbunit.dataset.NoSuchTableException: person
	at org.dbunit.database.DatabaseDataSet.getTableMetaData(DatabaseDataSet.java:282)
	at org.dbunit.operation.AbstractOperation.getOperationMetaData(AbstractOperation.java:80)
	at org.dbunit.operation.RefreshOperation.execute(RefreshOperation.java:98)
	at org.openmrs.test.BaseContextSensitiveTest.executeDataSet(BaseContextSensitiveTest.java:682)
	at org.openmrs.test.BaseContextSensitiveTest.executeDataSet(BaseContextSensitiveTest.java:577)
	at org.openmrs.test.BaseContextSensitiveTest.initializeInMemoryDatabase(BaseContextSensitiveTest.java:489)
	at org.openmrs.test.BaseContextSensitiveTest.baseSetupWithStandardDataAndAuthentication(BaseContextSensitiveTest.java:778)
(33 more lines...)
Collapse Failed ConceptStopWordListControllerTest handleSubmission_shouldAddTheDeleteErrorMessageInSession History
Build and Test < 1 sec
org.dbunit.dataset.NoSuchTableException: person
	at org.dbunit.database.DatabaseDataSet.getTableMetaData(DatabaseDataSet.java:282)
	at org.dbunit.operation.AbstractOperation.getOperationMetaData(AbstractOperation.java:80)
	at org.dbunit.operation.RefreshOperation.execute(RefreshOperation.java:98)
	at org.openmrs.test.BaseContextSensitiveTest.executeDataSet(BaseContextSensitiveTest.java:682)
	at org.openmrs.test.BaseContextSensitiveTest.executeDataSet(BaseContextSensitiveTest.java:577)
	at org.openmrs.test.BaseContextSensitiveTest.initializeInMemoryDatabase(BaseContextSensitiveTest.java:489)
	at org.openmrs.test.BaseContextSensitiveTest.baseSetupWithStandardDataAndAuthentication(BaseContextSensitiveTest.java:778)
(33 more lines...)
Collapse Failed ConceptStopWordListControllerTest handleSubmission_shouldDeleteGivenConceptStopWordFromDB History
Build and Test < 1 sec
org.dbunit.dataset.NoSuchTableException: person
	at org.dbunit.database.DatabaseDataSet.getTableMetaData(DatabaseDataSet.java:282)
	at org.dbunit.operation.AbstractOperation.getOperationMetaData(AbstractOperation.java:80)
	at org.dbunit.operation.RefreshOperation.execute(RefreshOperation.java:98)
	at org.openmrs.test.BaseContextSensitiveTest.executeDataSet(BaseContextSensitiveTest.java:682)
	at org.openmrs.test.BaseContextSensitiveTest.executeDataSet(BaseContextSensitiveTest.java:577)
	at org.openmrs.test.BaseContextSensitiveTest.initializeInMemoryDatabase(BaseContextSensitiveTest.java:489)
	at org.openmrs.test.BaseContextSensitiveTest.baseSetupWithStandardDataAndAuthentication(BaseContextSensitiveTest.java:778)
(33 more lines...)
Collapse Failed ConceptStopWordListControllerTest showForm_shouldAddAllConceptStopWordsInSessionAttribute History
Build and Test < 1 sec
org.dbunit.dataset.NoSuchTableException: person
	at org.dbunit.database.DatabaseDataSet.getTableMetaData(DatabaseDataSet.java:282)
	at org.dbunit.operation.AbstractOperation.getOperationMetaData(AbstractOperation.java:80)
	at org.dbunit.operation.RefreshOperation.execute(RefreshOperation.java:98)
	at org.openmrs.test.BaseContextSensitiveTest.executeDataSet(BaseContextSensitiveTest.java:682)
	at org.openmrs.test.BaseContextSensitiveTest.executeDataSet(BaseContextSensitiveTest.java:577)
	at org.openmrs.test.BaseContextSensitiveTest.initializeInMemoryDatabase(BaseContextSensitiveTest.java:489)
	at org.openmrs.test.BaseContextSensitiveTest.baseSetupWithStandardDataAndAuthentication(BaseContextSensitiveTest.java:778)
(33 more lines...)
Collapse Failed EncounterRoleFormControllerTest saveEncounterRole_shouldRaiseAnErrorIfValidationOfEncounterRoleFails History
Build and Test < 1 sec
org.dbunit.dataset.NoSuchTableException: person
	at org.dbunit.database.DatabaseDataSet.getTableMetaData(DatabaseDataSet.java:282)
	at org.dbunit.operation.AbstractOperation.getOperationMetaData(AbstractOperation.java:80)
	at org.dbunit.operation.RefreshOperation.execute(RefreshOperation.java:98)
	at org.openmrs.test.BaseContextSensitiveTest.executeDataSet(BaseContextSensitiveTest.java:682)
	at org.openmrs.test.BaseContextSensitiveTest.executeDataSet(BaseContextSensitiveTest.java:577)
	at org.openmrs.test.BaseContextSensitiveTest.initializeInMemoryDatabase(BaseContextSensitiveTest.java:489)
	at org.openmrs.test.BaseContextSensitiveTest.baseSetupWithStandardDataAndAuthentication(BaseContextSensitiveTest.java:778)
(33 more lines...)
Collapse Failed EncounterRoleFormControllerTest retire_shouldRetireAnExistingEncounter History
Build and Test < 1 sec
org.dbunit.dataset.NoSuchTableException: person
	at org.dbunit.database.DatabaseDataSet.getTableMetaData(DatabaseDataSet.java:282)
	at org.dbunit.operation.AbstractOperation.getOperationMetaData(AbstractOperation.java:80)
	at org.dbunit.operation.RefreshOperation.execute(RefreshOperation.java:98)
	at org.openmrs.test.BaseContextSensitiveTest.executeDataSet(BaseContextSensitiveTest.java:682)
	at org.openmrs.test.BaseContextSensitiveTest.executeDataSet(BaseContextSensitiveTest.java:577)
	at org.openmrs.test.BaseContextSensitiveTest.initializeInMemoryDatabase(BaseContextSensitiveTest.java:489)
	at org.openmrs.test.BaseContextSensitiveTest.baseSetupWithStandardDataAndAuthentication(BaseContextSensitiveTest.java:778)
(33 more lines...)
Collapse Failed EncounterRoleFormControllerTest saveEncounterRole_shouldEditAndSaveAnExistingEncounter History
Build and Test < 1 sec
org.dbunit.dataset.NoSuchTableException: person
	at org.dbunit.database.DatabaseDataSet.getTableMetaData(DatabaseDataSet.java:282)
	at org.dbunit.operation.AbstractOperation.getOperationMetaData(AbstractOperation.java:80)
	at org.dbunit.operation.RefreshOperation.execute(RefreshOperation.java:98)
	at org.openmrs.test.BaseContextSensitiveTest.executeDataSet(BaseContextSensitiveTest.java:682)
	at org.openmrs.test.BaseContextSensitiveTest.executeDataSet(BaseContextSensitiveTest.java:577)
	at org.openmrs.test.BaseContextSensitiveTest.initializeInMemoryDatabase(BaseContextSensitiveTest.java:489)
	at org.openmrs.test.BaseContextSensitiveTest.baseSetupWithStandardDataAndAuthentication(BaseContextSensitiveTest.java:778)
(33 more lines...)
Collapse Failed EncounterRoleFormControllerTest purge_shouldPurgeAnExistingEncounter History
Build and Test < 1 sec
org.dbunit.dataset.NoSuchTableException: person
	at org.dbunit.database.DatabaseDataSet.getTableMetaData(DatabaseDataSet.java:282)
	at org.dbunit.operation.AbstractOperation.getOperationMetaData(AbstractOperation.java:80)
	at org.dbunit.operation.RefreshOperation.execute(RefreshOperation.java:98)
	at org.openmrs.test.BaseContextSensitiveTest.executeDataSet(BaseContextSensitiveTest.java:682)
	at org.openmrs.test.BaseContextSensitiveTest.executeDataSet(BaseContextSensitiveTest.java:577)
	at org.openmrs.test.BaseContextSensitiveTest.initializeInMemoryDatabase(BaseContextSensitiveTest.java:489)
	at org.openmrs.test.BaseContextSensitiveTest.baseSetupWithStandardDataAndAuthentication(BaseContextSensitiveTest.java:778)
(33 more lines...)
Collapse Failed EncounterRoleFormControllerTest saveEncounterRole_shouldSaveANewEncounterRoleObject History
Build and Test < 1 sec
org.dbunit.dataset.NoSuchTableException: person
	at org.dbunit.database.DatabaseDataSet.getTableMetaData(DatabaseDataSet.java:282)
	at org.dbunit.operation.AbstractOperation.getOperationMetaData(AbstractOperation.java:80)
	at org.dbunit.operation.RefreshOperation.execute(RefreshOperation.java:98)
	at org.openmrs.test.BaseContextSensitiveTest.executeDataSet(BaseContextSensitiveTest.java:682)
	at org.openmrs.test.BaseContextSensitiveTest.executeDataSet(BaseContextSensitiveTest.java:577)
	at org.openmrs.test.BaseContextSensitiveTest.initializeInMemoryDatabase(BaseContextSensitiveTest.java:489)
	at org.openmrs.test.BaseContextSensitiveTest.baseSetupWithStandardDataAndAuthentication(BaseContextSensitiveTest.java:778)
(33 more lines...)
Collapse Failed EncounterRoleFormControllerTest showEncounterList_shouldAddListOfEncounterRoleObjectsToTheModel History
Build and Test < 1 sec
org.dbunit.dataset.NoSuchTableException: person
	at org.dbunit.database.DatabaseDataSet.getTableMetaData(DatabaseDataSet.java:282)
	at org.dbunit.operation.AbstractOperation.getOperationMetaData(AbstractOperation.java:80)
	at org.dbunit.operation.RefreshOperation.execute(RefreshOperation.java:98)
	at org.openmrs.test.BaseContextSensitiveTest.executeDataSet(BaseContextSensitiveTest.java:682)
	at org.openmrs.test.BaseContextSensitiveTest.executeDataSet(BaseContextSensitiveTest.java:577)
	at org.openmrs.test.BaseContextSensitiveTest.initializeInMemoryDatabase(BaseContextSensitiveTest.java:489)
	at org.openmrs.test.BaseContextSensitiveTest.baseSetupWithStandardDataAndAuthentication(BaseContextSensitiveTest.java:778)
(33 more lines...)
Collapse Failed EncounterRoleFormControllerTest retire_shouldRaiseAnErrorIfRetireReasonIsNotFilled History
Build and Test < 1 sec
org.dbunit.dataset.NoSuchTableException: person
	at org.dbunit.database.DatabaseDataSet.getTableMetaData(DatabaseDataSet.java:282)
	at org.dbunit.operation.AbstractOperation.getOperationMetaData(AbstractOperation.java:80)
	at org.dbunit.operation.RefreshOperation.execute(RefreshOperation.java:98)
	at org.openmrs.test.BaseContextSensitiveTest.executeDataSet(BaseContextSensitiveTest.java:682)
	at org.openmrs.test.BaseContextSensitiveTest.executeDataSet(BaseContextSensitiveTest.java:577)
	at org.openmrs.test.BaseContextSensitiveTest.initializeInMemoryDatabase(BaseContextSensitiveTest.java:489)
	at org.openmrs.test.BaseContextSensitiveTest.baseSetupWithStandardDataAndAuthentication(BaseContextSensitiveTest.java:778)
(33 more lines...)
Collapse Failed EncounterRoleFormControllerTest unretire_shouldRetireAnExistingEncounter History
Build and Test < 1 sec
org.dbunit.dataset.NoSuchTableException: person
	at org.dbunit.database.DatabaseDataSet.getTableMetaData(DatabaseDataSet.java:282)
	at org.dbunit.operation.AbstractOperation.getOperationMetaData(AbstractOperation.java:80)
	at org.dbunit.operation.RefreshOperation.execute(RefreshOperation.java:98)
	at org.openmrs.test.BaseContextSensitiveTest.executeDataSet(BaseContextSensitiveTest.java:682)
	at org.openmrs.test.BaseContextSensitiveTest.executeDataSet(BaseContextSensitiveTest.java:577)
	at org.openmrs.test.BaseContextSensitiveTest.initializeInMemoryDatabase(BaseContextSensitiveTest.java:489)
	at org.openmrs.test.BaseContextSensitiveTest.baseSetupWithStandardDataAndAuthentication(BaseContextSensitiveTest.java:778)
(33 more lines...)
Collapse Failed EncounterTypeFormControllerTest shouldSaveEncounterTypeWhenEncounterTypesAreNotLocked History
Build and Test 1 sec
org.dbunit.dataset.NoSuchTableException: person
	at org.dbunit.database.DatabaseDataSet.getTableMetaData(DatabaseDataSet.java:282)
	at org.dbunit.operation.AbstractOperation.getOperationMetaData(AbstractOperation.java:80)
	at org.dbunit.operation.RefreshOperation.execute(RefreshOperation.java:98)
	at org.openmrs.test.BaseContextSensitiveTest.executeDataSet(BaseContextSensitiveTest.java:682)
	at org.openmrs.test.BaseContextSensitiveTest.executeDataSet(BaseContextSensitiveTest.java:577)
	at org.openmrs.test.BaseContextSensitiveTest.initializeInMemoryDatabase(BaseContextSensitiveTest.java:489)
	at org.openmrs.test.BaseContextSensitiveTest.baseSetupWithStandardDataAndAuthentication(BaseContextSensitiveTest.java:778)
(33 more lines...)
Collapse Failed EncounterTypeFormControllerTest shouldNotDeleteEncounterTypeWhenEncounterTypesAreLocked History
Build and Test < 1 sec
org.dbunit.dataset.NoSuchTableException: person
	at org.dbunit.database.DatabaseDataSet.getTableMetaData(DatabaseDataSet.java:282)
	at org.dbunit.operation.AbstractOperation.getOperationMetaData(AbstractOperation.java:80)
	at org.dbunit.operation.RefreshOperation.execute(RefreshOperation.java:98)
	at org.openmrs.test.BaseContextSensitiveTest.executeDataSet(BaseContextSensitiveTest.java:682)
	at org.openmrs.test.BaseContextSensitiveTest.executeDataSet(BaseContextSensitiveTest.java:577)
	at org.openmrs.test.BaseContextSensitiveTest.initializeInMemoryDatabase(BaseContextSensitiveTest.java:489)
	at org.openmrs.test.BaseContextSensitiveTest.baseSetupWithStandardDataAndAuthentication(BaseContextSensitiveTest.java:778)
(33 more lines...)
Collapse Failed EncounterTypeListControllerTest onSubmit_shouldNotFailIfNoEncounterTypesAreSelected History
Build and Test < 1 sec
org.dbunit.dataset.NoSuchTableException: person
	at org.dbunit.database.DatabaseDataSet.getTableMetaData(DatabaseDataSet.java:282)
	at org.dbunit.operation.AbstractOperation.getOperationMetaData(AbstractOperation.java:80)
	at org.dbunit.operation.RefreshOperation.execute(RefreshOperation.java:98)
	at org.openmrs.test.BaseContextSensitiveTest.executeDataSet(BaseContextSensitiveTest.java:682)
	at org.openmrs.test.BaseContextSensitiveTest.executeDataSet(BaseContextSensitiveTest.java:577)
	at org.openmrs.test.BaseContextSensitiveTest.initializeInMemoryDatabase(BaseContextSensitiveTest.java:489)
	at org.openmrs.test.BaseContextSensitiveTest.baseSetupWithStandardDataAndAuthentication(BaseContextSensitiveTest.java:778)
(33 more lines...)
Collapse Failed LocationFormControllerTest formBackingObject_shouldReturnValidLocationGivenValidLocationId History
Build and Test 8 mins
org.dbunit.dataset.NoSuchTableException: person
	at org.dbunit.database.DatabaseDataSet.getTableMetaData(DatabaseDataSet.java:282)
	at org.dbunit.operation.AbstractOperation.getOperationMetaData(AbstractOperation.java:80)
	at org.dbunit.operation.RefreshOperation.execute(RefreshOperation.java:98)
	at org.openmrs.test.BaseContextSensitiveTest.executeDataSet(BaseContextSensitiveTest.java:682)
	at org.openmrs.test.BaseContextSensitiveTest.executeDataSet(BaseContextSensitiveTest.java:577)
	at org.openmrs.test.BaseContextSensitiveTest.initializeInMemoryDatabase(BaseContextSensitiveTest.java:489)
	at org.openmrs.test.BaseContextSensitiveTest.baseSetupWithStandardDataAndAuthentication(BaseContextSensitiveTest.java:778)
(34 more lines...)
Collapse Failed LocationFormControllerTest onSubmit_shouldNotRetireLocationIfReasonIsEmpty History
Build and Test < 1 sec
org.dbunit.dataset.NoSuchTableException: person
	at org.dbunit.database.DatabaseDataSet.getTableMetaData(DatabaseDataSet.java:282)
	at org.dbunit.operation.AbstractOperation.getOperationMetaData(AbstractOperation.java:80)
	at org.dbunit.operation.RefreshOperation.execute(RefreshOperation.java:98)
	at org.openmrs.test.BaseContextSensitiveTest.executeDataSet(BaseContextSensitiveTest.java:682)
	at org.openmrs.test.BaseContextSensitiveTest.executeDataSet(BaseContextSensitiveTest.java:577)
	at org.openmrs.test.BaseContextSensitiveTest.initializeInMemoryDatabase(BaseContextSensitiveTest.java:489)
	at org.openmrs.test.BaseContextSensitiveTest.baseSetupWithStandardDataAndAuthentication(BaseContextSensitiveTest.java:778)
(34 more lines...)
Collapse Failed LocationFormControllerTest onSubmit_shouldRetireLocation History
Build and Test < 1 sec
org.dbunit.dataset.NoSuchTableException: person
	at org.dbunit.database.DatabaseDataSet.getTableMetaData(DatabaseDataSet.java:282)
	at org.dbunit.operation.AbstractOperation.getOperationMetaData(AbstractOperation.java:80)
	at org.dbunit.operation.RefreshOperation.execute(RefreshOperation.java:98)
	at org.openmrs.test.BaseContextSensitiveTest.executeDataSet(BaseContextSensitiveTest.java:682)
	at org.openmrs.test.BaseContextSensitiveTest.executeDataSet(BaseContextSensitiveTest.java:577)
	at org.openmrs.test.BaseContextSensitiveTest.initializeInMemoryDatabase(BaseContextSensitiveTest.java:489)
	at org.openmrs.test.BaseContextSensitiveTest.baseSetupWithStandardDataAndAuthentication(BaseContextSensitiveTest.java:778)
(34 more lines...)
Collapse Failed FieldFormControllerTest onSubmit_shouldNotFailOnFieldAnswers History
Build and Test < 1 sec
org.dbunit.dataset.NoSuchTableException: person
	at org.dbunit.database.DatabaseDataSet.getTableMetaData(DatabaseDataSet.java:282)
	at org.dbunit.operation.AbstractOperation.getOperationMetaData(AbstractOperation.java:80)
	at org.dbunit.operation.RefreshOperation.execute(RefreshOperation.java:98)
	at org.openmrs.test.BaseContextSensitiveTest.executeDataSet(BaseContextSensitiveTest.java:682)
	at org.openmrs.test.BaseContextSensitiveTest.executeDataSet(BaseContextSensitiveTest.java:577)
	at org.openmrs.test.BaseContextSensitiveTest.initializeInMemoryDatabase(BaseContextSensitiveTest.java:489)
	at org.openmrs.test.BaseContextSensitiveTest.baseSetupWithStandardDataAndAuthentication(BaseContextSensitiveTest.java:778)
(33 more lines...)
Collapse Failed FieldFormControllerTest formBackingObject_shouldGetField History
Build and Test < 1 sec
org.dbunit.dataset.NoSuchTableException: person
	at org.dbunit.database.DatabaseDataSet.getTableMetaData(DatabaseDataSet.java:282)
	at org.dbunit.operation.AbstractOperation.getOperationMetaData(AbstractOperation.java:80)
	at org.dbunit.operation.RefreshOperation.execute(RefreshOperation.java:98)
	at org.openmrs.test.BaseContextSensitiveTest.executeDataSet(BaseContextSensitiveTest.java:682)
	at org.openmrs.test.BaseContextSensitiveTest.executeDataSet(BaseContextSensitiveTest.java:577)
	at org.openmrs.test.BaseContextSensitiveTest.initializeInMemoryDatabase(BaseContextSensitiveTest.java:489)
	at org.openmrs.test.BaseContextSensitiveTest.baseSetupWithStandardDataAndAuthentication(BaseContextSensitiveTest.java:778)
(33 more lines...)
Collapse Failed FieldTypeListControllerTest onSubmit_shouldDisplayAUserFriendlyErrorMessage History
Build and Test 1 sec
org.hibernate.HibernateException: No Hibernate Session bound to thread, and configuration does not allow creation of non-transactional one here
	at org.springframework.orm.hibernate3.SpringSessionContext.currentSession(SpringSessionContext.java:63)
	at org.hibernate.impl.SessionFactoryImpl.getCurrentSession(SessionFactoryImpl.java:687)
	at org.openmrs.test.BaseContextSensitiveTest.getConnection(BaseContextSensitiveTest.java:476)
	at org.openmrs.test.BaseContextSensitiveTest.executeDataSet(BaseContextSensitiveTest.java:676)
	at org.openmrs.test.BaseContextSensitiveTest.executeDataSet(BaseContextSensitiveTest.java:577)
	at org.openmrs.test.BaseContextSensitiveTest.initializeInMemoryDatabase(BaseContextSensitiveTest.java:489)
	at org.openmrs.test.BaseContextSensitiveTest.baseSetupWithStandardDataAndAuthentication(BaseContextSensitiveTest.java:778)
(33 more lines...)
Collapse Failed GlobalPropertyControllerTest onSubmit_shouldPurgeNotIncludedProperties History
Build and Test < 1 sec
org.dbunit.dataset.NoSuchTableException: person
	at org.dbunit.database.DatabaseDataSet.getTableMetaData(DatabaseDataSet.java:282)
	at org.dbunit.operation.AbstractOperation.getOperationMetaData(AbstractOperation.java:80)
	at org.dbunit.operation.RefreshOperation.execute(RefreshOperation.java:98)
	at org.openmrs.test.BaseContextSensitiveTest.executeDataSet(BaseContextSensitiveTest.java:682)
	at org.openmrs.test.BaseContextSensitiveTest.executeDataSet(BaseContextSensitiveTest.java:577)
	at org.openmrs.test.BaseContextSensitiveTest.initializeInMemoryDatabase(BaseContextSensitiveTest.java:489)
	at org.openmrs.test.BaseContextSensitiveTest.baseSetupWithStandardDataAndAuthentication(BaseContextSensitiveTest.java:778)
(33 more lines...)
Collapse Failed GlobalPropertyControllerTest onSubmit_shouldSaveOrUpdateIncludedProperties History
Build and Test < 1 sec
org.dbunit.dataset.NoSuchTableException: person
	at org.dbunit.database.DatabaseDataSet.getTableMetaData(DatabaseDataSet.java:282)
	at org.dbunit.operation.AbstractOperation.getOperationMetaData(AbstractOperation.java:80)
	at org.dbunit.operation.RefreshOperation.execute(RefreshOperation.java:98)
	at org.openmrs.test.BaseContextSensitiveTest.executeDataSet(BaseContextSensitiveTest.java:682)
	at org.openmrs.test.BaseContextSensitiveTest.executeDataSet(BaseContextSensitiveTest.java:577)
	at org.openmrs.test.BaseContextSensitiveTest.initializeInMemoryDatabase(BaseContextSensitiveTest.java:489)
	at org.openmrs.test.BaseContextSensitiveTest.baseSetupWithStandardDataAndAuthentication(BaseContextSensitiveTest.java:778)
(33 more lines...)
Collapse Failed SystemInformationControllerTest showPage_shouldReturnAllDatabaseInformation History
Build and Test 2 secs
org.dbunit.dataset.NoSuchTableException: person
	at org.dbunit.database.DatabaseDataSet.getTableMetaData(DatabaseDataSet.java:282)
	at org.dbunit.operation.AbstractOperation.getOperationMetaData(AbstractOperation.java:80)
	at org.dbunit.operation.RefreshOperation.execute(RefreshOperation.java:98)
	at org.openmrs.test.BaseContextSensitiveTest.executeDataSet(BaseContextSensitiveTest.java:682)
	at org.openmrs.test.BaseContextSensitiveTest.executeDataSet(BaseContextSensitiveTest.java:577)
	at org.openmrs.test.BaseContextSensitiveTest.initializeInMemoryDatabase(BaseContextSensitiveTest.java:489)
	at org.openmrs.test.BaseContextSensitiveTest.baseSetupWithStandardDataAndAuthentication(BaseContextSensitiveTest.java:778)
(33 more lines...)
Collapse Failed SystemInformationControllerTest showPage_shouldReturnAllJavaRuntimeInformation History
Build and Test < 1 sec
org.dbunit.dataset.NoSuchTableException: person
	at org.dbunit.database.DatabaseDataSet.getTableMetaData(DatabaseDataSet.java:282)
	at org.dbunit.operation.AbstractOperation.getOperationMetaData(AbstractOperation.java:80)
	at org.dbunit.operation.RefreshOperation.execute(RefreshOperation.java:98)
	at org.openmrs.test.BaseContextSensitiveTest.executeDataSet(BaseContextSensitiveTest.java:682)
	at org.openmrs.test.BaseContextSensitiveTest.executeDataSet(BaseContextSensitiveTest.java:577)
	at org.openmrs.test.BaseContextSensitiveTest.initializeInMemoryDatabase(BaseContextSensitiveTest.java:489)
	at org.openmrs.test.BaseContextSensitiveTest.baseSetupWithStandardDataAndAuthentication(BaseContextSensitiveTest.java:778)
(33 more lines...)
Collapse Failed SystemInformationControllerTest showPage_shouldReturnUserInformation History
Build and Test < 1 sec
org.dbunit.dataset.NoSuchTableException: person
	at org.dbunit.database.DatabaseDataSet.getTableMetaData(DatabaseDataSet.java:282)
	at org.dbunit.operation.AbstractOperation.getOperationMetaData(AbstractOperation.java:80)
	at org.dbunit.operation.RefreshOperation.execute(RefreshOperation.java:98)
	at org.openmrs.test.BaseContextSensitiveTest.executeDataSet(BaseContextSensitiveTest.java:682)
	at org.openmrs.test.BaseContextSensitiveTest.executeDataSet(BaseContextSensitiveTest.java:577)
	at org.openmrs.test.BaseContextSensitiveTest.initializeInMemoryDatabase(BaseContextSensitiveTest.java:489)
	at org.openmrs.test.BaseContextSensitiveTest.baseSetupWithStandardDataAndAuthentication(BaseContextSensitiveTest.java:778)
(33 more lines...)
Collapse Failed SystemInformationControllerTest getMemoryInformation_shouldReturnMemoryInformation History
Build and Test < 1 sec
org.dbunit.dataset.NoSuchTableException: person
	at org.dbunit.database.DatabaseDataSet.getTableMetaData(DatabaseDataSet.java:282)
	at org.dbunit.operation.AbstractOperation.getOperationMetaData(AbstractOperation.java:80)
	at org.dbunit.operation.RefreshOperation.execute(RefreshOperation.java:98)
	at org.openmrs.test.BaseContextSensitiveTest.executeDataSet(BaseContextSensitiveTest.java:682)
	at org.openmrs.test.BaseContextSensitiveTest.executeDataSet(BaseContextSensitiveTest.java:577)
	at org.openmrs.test.BaseContextSensitiveTest.initializeInMemoryDatabase(BaseContextSensitiveTest.java:489)
	at org.openmrs.test.BaseContextSensitiveTest.baseSetupWithStandardDataAndAuthentication(BaseContextSensitiveTest.java:778)
(33 more lines...)
Collapse Failed SystemInformationControllerTest showPage_shouldReturnOpenmrsInformation History
Build and Test < 1 sec
org.dbunit.dataset.NoSuchTableException: person
	at org.dbunit.database.DatabaseDataSet.getTableMetaData(DatabaseDataSet.java:282)
	at org.dbunit.operation.AbstractOperation.getOperationMetaData(AbstractOperation.java:80)
	at org.dbunit.operation.RefreshOperation.execute(RefreshOperation.java:98)
	at org.openmrs.test.BaseContextSensitiveTest.executeDataSet(BaseContextSensitiveTest.java:682)
	at org.openmrs.test.BaseContextSensitiveTest.executeDataSet(BaseContextSensitiveTest.java:577)
	at org.openmrs.test.BaseContextSensitiveTest.initializeInMemoryDatabase(BaseContextSensitiveTest.java:489)
	at org.openmrs.test.BaseContextSensitiveTest.baseSetupWithStandardDataAndAuthentication(BaseContextSensitiveTest.java:778)
(33 more lines...)
Collapse Failed ShortPatientFormControllerTest saveShortPatient_shouldIgnoreANewAddressThatWasAddedAndVoidedAtSameTime History
Build and Test < 1 sec
org.dbunit.dataset.NoSuchTableException: person
	at org.dbunit.database.DatabaseDataSet.getTableMetaData(DatabaseDataSet.java:282)
	at org.dbunit.operation.AbstractOperation.getOperationMetaData(AbstractOperation.java:80)
	at org.dbunit.operation.RefreshOperation.execute(RefreshOperation.java:98)
	at org.openmrs.test.BaseContextSensitiveTest.executeDataSet(BaseContextSensitiveTest.java:682)
	at org.openmrs.test.BaseContextSensitiveTest.executeDataSet(BaseContextSensitiveTest.java:577)
	at org.openmrs.test.BaseContextSensitiveTest.initializeInMemoryDatabase(BaseContextSensitiveTest.java:489)
	at org.openmrs.test.BaseContextSensitiveTest.baseSetupWithStandardDataAndAuthentication(BaseContextSensitiveTest.java:778)
(33 more lines...)