Build: #271 failed

Job: Build and Test failed

Stages & jobs

  1. Default Stage

Test results

  • 2,648 tests in total
  • 234 tests failed
  • 234 failures are new
  • 27 minutes taken in total.

Build 271 has the following 234 errors: 234 new failure(s) occurred since the previous build.

New test failures 234
Status Test Duration
Collapse Failed SchedulerFormControllerTest onSubmit_shouldNotRescheduleATaskThatIsNotCurrentlyScheduled History
< 1 sec
org.dbunit.dataset.NoSuchTableException: person
	at org.dbunit.database.DatabaseDataSet.getTableMetaData(DatabaseDataSet.java:282)
	at org.dbunit.operation.AbstractOperation.getOperationMetaData(AbstractOperation.java:80)
	at org.dbunit.operation.RefreshOperation.execute(RefreshOperation.java:98)
	at org.openmrs.test.BaseContextSensitiveTest.executeDataSet(BaseContextSensitiveTest.java:682)
	at org.openmrs.test.BaseContextSensitiveTest.executeDataSet(BaseContextSensitiveTest.java:577)
	at org.openmrs.test.BaseContextSensitiveTest.initializeInMemoryDatabase(BaseContextSensitiveTest.java:489)
	at org.openmrs.test.BaseContextSensitiveTest.baseSetupWithStandardDataAndAuthentication(BaseContextSensitiveTest.java:778)
(33 more lines...)
Collapse Failed SchedulerFormControllerTest onSubmit_shouldNotRescheduleAnExecutingTask History
< 1 sec
org.dbunit.dataset.NoSuchTableException: person
	at org.dbunit.database.DatabaseDataSet.getTableMetaData(DatabaseDataSet.java:282)
	at org.dbunit.operation.AbstractOperation.getOperationMetaData(AbstractOperation.java:80)
	at org.dbunit.operation.RefreshOperation.execute(RefreshOperation.java:98)
	at org.openmrs.test.BaseContextSensitiveTest.executeDataSet(BaseContextSensitiveTest.java:682)
	at org.openmrs.test.BaseContextSensitiveTest.executeDataSet(BaseContextSensitiveTest.java:577)
	at org.openmrs.test.BaseContextSensitiveTest.initializeInMemoryDatabase(BaseContextSensitiveTest.java:489)
	at org.openmrs.test.BaseContextSensitiveTest.baseSetupWithStandardDataAndAuthentication(BaseContextSensitiveTest.java:778)
(33 more lines...)
Collapse Failed SchedulerFormControllerTest onSubmit_shouldRescheduleACurrentlyScheduledTask History
2 secs
org.dbunit.dataset.NoSuchTableException: person
	at org.dbunit.database.DatabaseDataSet.getTableMetaData(DatabaseDataSet.java:282)
	at org.dbunit.operation.AbstractOperation.getOperationMetaData(AbstractOperation.java:80)
	at org.dbunit.operation.RefreshOperation.execute(RefreshOperation.java:98)
	at org.openmrs.test.BaseContextSensitiveTest.executeDataSet(BaseContextSensitiveTest.java:682)
	at org.openmrs.test.BaseContextSensitiveTest.executeDataSet(BaseContextSensitiveTest.java:577)
	at org.openmrs.test.BaseContextSensitiveTest.initializeInMemoryDatabase(BaseContextSensitiveTest.java:489)
	at org.openmrs.test.BaseContextSensitiveTest.baseSetupWithStandardDataAndAuthentication(BaseContextSensitiveTest.java:778)
(33 more lines...)
Collapse Failed SchedulerFormTest addANewTaskShouldNotError History
< 1 sec
org.dbunit.dataset.NoSuchTableException: person
	at org.dbunit.database.DatabaseDataSet.getTableMetaData(DatabaseDataSet.java:282)
	at org.dbunit.operation.AbstractOperation.getOperationMetaData(AbstractOperation.java:80)
	at org.dbunit.operation.RefreshOperation.execute(RefreshOperation.java:98)
	at org.openmrs.test.BaseContextSensitiveTest.executeDataSet(BaseContextSensitiveTest.java:682)
	at org.openmrs.test.BaseContextSensitiveTest.executeDataSet(BaseContextSensitiveTest.java:577)
	at org.openmrs.test.BaseContextSensitiveTest.initializeInMemoryDatabase(BaseContextSensitiveTest.java:489)
	at org.openmrs.test.BaseContextSensitiveTest.baseSetupWithStandardDataAndAuthentication(BaseContextSensitiveTest.java:778)
(33 more lines...)
Collapse Failed TaskHelperTest getScheduledTaskDefinition_shouldReturnATaskThatHasBeenStarted History
< 1 sec
org.dbunit.dataset.NoSuchTableException: person
	at org.dbunit.database.DatabaseDataSet.getTableMetaData(DatabaseDataSet.java:282)
	at org.dbunit.operation.AbstractOperation.getOperationMetaData(AbstractOperation.java:80)
	at org.dbunit.operation.RefreshOperation.execute(RefreshOperation.java:98)
	at org.openmrs.test.BaseContextSensitiveTest.executeDataSet(BaseContextSensitiveTest.java:682)
	at org.openmrs.test.BaseContextSensitiveTest.executeDataSet(BaseContextSensitiveTest.java:577)
	at org.openmrs.test.BaseContextSensitiveTest.initializeInMemoryDatabase(BaseContextSensitiveTest.java:489)
	at org.openmrs.test.BaseContextSensitiveTest.baseSetupWithStandardDataAndAuthentication(BaseContextSensitiveTest.java:778)
(33 more lines...)
Collapse Failed TaskHelperTest getTime_shouldGetATimeInTheFuture History
< 1 sec
org.dbunit.dataset.NoSuchTableException: person
	at org.dbunit.database.DatabaseDataSet.getTableMetaData(DatabaseDataSet.java:282)
	at org.dbunit.operation.AbstractOperation.getOperationMetaData(AbstractOperation.java:80)
	at org.dbunit.operation.RefreshOperation.execute(RefreshOperation.java:98)
	at org.openmrs.test.BaseContextSensitiveTest.executeDataSet(BaseContextSensitiveTest.java:682)
	at org.openmrs.test.BaseContextSensitiveTest.executeDataSet(BaseContextSensitiveTest.java:577)
	at org.openmrs.test.BaseContextSensitiveTest.initializeInMemoryDatabase(BaseContextSensitiveTest.java:489)
	at org.openmrs.test.BaseContextSensitiveTest.baseSetupWithStandardDataAndAuthentication(BaseContextSensitiveTest.java:778)
(33 more lines...)
Collapse Failed TaskHelperTest getTime_shouldGetATimeInThePast History
< 1 sec
org.dbunit.dataset.NoSuchTableException: person
	at org.dbunit.database.DatabaseDataSet.getTableMetaData(DatabaseDataSet.java:282)
	at org.dbunit.operation.AbstractOperation.getOperationMetaData(AbstractOperation.java:80)
	at org.dbunit.operation.RefreshOperation.execute(RefreshOperation.java:98)
	at org.openmrs.test.BaseContextSensitiveTest.executeDataSet(BaseContextSensitiveTest.java:682)
	at org.openmrs.test.BaseContextSensitiveTest.executeDataSet(BaseContextSensitiveTest.java:577)
	at org.openmrs.test.BaseContextSensitiveTest.initializeInMemoryDatabase(BaseContextSensitiveTest.java:489)
	at org.openmrs.test.BaseContextSensitiveTest.baseSetupWithStandardDataAndAuthentication(BaseContextSensitiveTest.java:778)
(33 more lines...)
Collapse Failed TaskHelperTest getUnscheduledTaskDefinition_shouldReturnATaskThatHasNotBeenStarted History
< 1 sec
org.dbunit.dataset.NoSuchTableException: person
	at org.dbunit.database.DatabaseDataSet.getTableMetaData(DatabaseDataSet.java:282)
	at org.dbunit.operation.AbstractOperation.getOperationMetaData(AbstractOperation.java:80)
	at org.dbunit.operation.RefreshOperation.execute(RefreshOperation.java:98)
	at org.openmrs.test.BaseContextSensitiveTest.executeDataSet(BaseContextSensitiveTest.java:682)
	at org.openmrs.test.BaseContextSensitiveTest.executeDataSet(BaseContextSensitiveTest.java:577)
	at org.openmrs.test.BaseContextSensitiveTest.initializeInMemoryDatabase(BaseContextSensitiveTest.java:489)
	at org.openmrs.test.BaseContextSensitiveTest.baseSetupWithStandardDataAndAuthentication(BaseContextSensitiveTest.java:778)
(33 more lines...)
Collapse Failed TaskHelperTest waitUntilTaskIsExecuting_shouldRaiseATimeoutExceptionWhenTheTimeoutIsExceeded History
< 1 sec
org.dbunit.dataset.NoSuchTableException: person
	at org.dbunit.database.DatabaseDataSet.getTableMetaData(DatabaseDataSet.java:282)
	at org.dbunit.operation.AbstractOperation.getOperationMetaData(AbstractOperation.java:80)
	at org.dbunit.operation.RefreshOperation.execute(RefreshOperation.java:98)
	at org.openmrs.test.BaseContextSensitiveTest.executeDataSet(BaseContextSensitiveTest.java:682)
	at org.openmrs.test.BaseContextSensitiveTest.executeDataSet(BaseContextSensitiveTest.java:577)
	at org.openmrs.test.BaseContextSensitiveTest.initializeInMemoryDatabase(BaseContextSensitiveTest.java:489)
	at org.openmrs.test.BaseContextSensitiveTest.baseSetupWithStandardDataAndAuthentication(BaseContextSensitiveTest.java:778)
(33 more lines...)
Collapse Failed TaskHelperTest waitUntilTaskIsExecuting_shouldWaitUntilTaskIsExecuting History
< 1 sec
org.dbunit.dataset.NoSuchTableException: person
	at org.dbunit.database.DatabaseDataSet.getTableMetaData(DatabaseDataSet.java:282)
	at org.dbunit.operation.AbstractOperation.getOperationMetaData(AbstractOperation.java:80)
	at org.dbunit.operation.RefreshOperation.execute(RefreshOperation.java:98)
	at org.openmrs.test.BaseContextSensitiveTest.executeDataSet(BaseContextSensitiveTest.java:682)
	at org.openmrs.test.BaseContextSensitiveTest.executeDataSet(BaseContextSensitiveTest.java:577)
	at org.openmrs.test.BaseContextSensitiveTest.initializeInMemoryDatabase(BaseContextSensitiveTest.java:489)
	at org.openmrs.test.BaseContextSensitiveTest.baseSetupWithStandardDataAndAuthentication(BaseContextSensitiveTest.java:778)
(33 more lines...)
Collapse Failed ForgotPasswordFormControllerTest shouldAuthenticateAsUserWithValidSecretQuestion History
< 1 sec
org.dbunit.dataset.NoSuchTableException: person
	at org.dbunit.database.DatabaseDataSet.getTableMetaData(DatabaseDataSet.java:282)
	at org.dbunit.operation.AbstractOperation.getOperationMetaData(AbstractOperation.java:80)
	at org.dbunit.operation.RefreshOperation.execute(RefreshOperation.java:98)
	at org.openmrs.test.BaseContextSensitiveTest.executeDataSet(BaseContextSensitiveTest.java:682)
	at org.openmrs.test.BaseContextSensitiveTest.executeDataSet(BaseContextSensitiveTest.java:577)
	at org.openmrs.test.BaseContextSensitiveTest.initializeInMemoryDatabase(BaseContextSensitiveTest.java:489)
	at org.openmrs.test.BaseContextSensitiveTest.baseSetupWithStandardDataAndAuthentication(BaseContextSensitiveTest.java:778)
(34 more lines...)
Collapse Failed ForgotPasswordFormControllerTest shouldGiveUserFiveSecretAnswerAttemptsAfterLessThanFiveFailedUsernameAttempts History
< 1 sec
org.dbunit.dataset.NoSuchTableException: person
	at org.dbunit.database.DatabaseDataSet.getTableMetaData(DatabaseDataSet.java:282)
	at org.dbunit.operation.AbstractOperation.getOperationMetaData(AbstractOperation.java:80)
	at org.dbunit.operation.RefreshOperation.execute(RefreshOperation.java:98)
	at org.openmrs.test.BaseContextSensitiveTest.executeDataSet(BaseContextSensitiveTest.java:682)
	at org.openmrs.test.BaseContextSensitiveTest.executeDataSet(BaseContextSensitiveTest.java:577)
	at org.openmrs.test.BaseContextSensitiveTest.initializeInMemoryDatabase(BaseContextSensitiveTest.java:489)
	at org.openmrs.test.BaseContextSensitiveTest.baseSetupWithStandardDataAndAuthentication(BaseContextSensitiveTest.java:778)
(34 more lines...)
Collapse Failed ForgotPasswordFormControllerTest shouldLoadPageNormallyWithNoInput History
< 1 sec
org.dbunit.dataset.NoSuchTableException: person
	at org.dbunit.database.DatabaseDataSet.getTableMetaData(DatabaseDataSet.java:282)
	at org.dbunit.operation.AbstractOperation.getOperationMetaData(AbstractOperation.java:80)
	at org.dbunit.operation.RefreshOperation.execute(RefreshOperation.java:98)
	at org.openmrs.test.BaseContextSensitiveTest.executeDataSet(BaseContextSensitiveTest.java:682)
	at org.openmrs.test.BaseContextSensitiveTest.executeDataSet(BaseContextSensitiveTest.java:577)
	at org.openmrs.test.BaseContextSensitiveTest.initializeInMemoryDatabase(BaseContextSensitiveTest.java:489)
	at org.openmrs.test.BaseContextSensitiveTest.baseSetupWithStandardDataAndAuthentication(BaseContextSensitiveTest.java:778)
(34 more lines...)
Collapse Failed ForgotPasswordFormControllerTest shouldLockOutAfterFiveFailedInvalidSecretAnswers History
< 1 sec
org.dbunit.dataset.NoSuchTableException: person
	at org.dbunit.database.DatabaseDataSet.getTableMetaData(DatabaseDataSet.java:282)
	at org.dbunit.operation.AbstractOperation.getOperationMetaData(AbstractOperation.java:80)
	at org.dbunit.operation.RefreshOperation.execute(RefreshOperation.java:98)
	at org.openmrs.test.BaseContextSensitiveTest.executeDataSet(BaseContextSensitiveTest.java:682)
	at org.openmrs.test.BaseContextSensitiveTest.executeDataSet(BaseContextSensitiveTest.java:577)
	at org.openmrs.test.BaseContextSensitiveTest.initializeInMemoryDatabase(BaseContextSensitiveTest.java:489)
	at org.openmrs.test.BaseContextSensitiveTest.baseSetupWithStandardDataAndAuthentication(BaseContextSensitiveTest.java:778)
(34 more lines...)
Collapse Failed ForgotPasswordFormControllerTest shouldLockOutAfterFiveFailedInvalidUsernames History
< 1 sec
org.dbunit.dataset.NoSuchTableException: person
	at org.dbunit.database.DatabaseDataSet.getTableMetaData(DatabaseDataSet.java:282)
	at org.dbunit.operation.AbstractOperation.getOperationMetaData(AbstractOperation.java:80)
	at org.dbunit.operation.RefreshOperation.execute(RefreshOperation.java:98)
	at org.openmrs.test.BaseContextSensitiveTest.executeDataSet(BaseContextSensitiveTest.java:682)
	at org.openmrs.test.BaseContextSensitiveTest.executeDataSet(BaseContextSensitiveTest.java:577)
	at org.openmrs.test.BaseContextSensitiveTest.initializeInMemoryDatabase(BaseContextSensitiveTest.java:489)
	at org.openmrs.test.BaseContextSensitiveTest.baseSetupWithStandardDataAndAuthentication(BaseContextSensitiveTest.java:778)
(34 more lines...)
Collapse Failed ForgotPasswordFormControllerTest shouldNotAuthenticateAfterFiveFailedInvalidUsernames History
< 1 sec
org.dbunit.dataset.NoSuchTableException: person
	at org.dbunit.database.DatabaseDataSet.getTableMetaData(DatabaseDataSet.java:282)
	at org.dbunit.operation.AbstractOperation.getOperationMetaData(AbstractOperation.java:80)
	at org.dbunit.operation.RefreshOperation.execute(RefreshOperation.java:98)
	at org.openmrs.test.BaseContextSensitiveTest.executeDataSet(BaseContextSensitiveTest.java:682)
	at org.openmrs.test.BaseContextSensitiveTest.executeDataSet(BaseContextSensitiveTest.java:577)
	at org.openmrs.test.BaseContextSensitiveTest.initializeInMemoryDatabase(BaseContextSensitiveTest.java:489)
	at org.openmrs.test.BaseContextSensitiveTest.baseSetupWithStandardDataAndAuthentication(BaseContextSensitiveTest.java:778)
(34 more lines...)
Collapse Failed ForgotPasswordFormControllerTest shouldNotAuthenticateAsUserWithValidSecretQuestion History
< 1 sec
org.dbunit.dataset.NoSuchTableException: person
	at org.dbunit.database.DatabaseDataSet.getTableMetaData(DatabaseDataSet.java:282)
	at org.dbunit.operation.AbstractOperation.getOperationMetaData(AbstractOperation.java:80)
	at org.dbunit.operation.RefreshOperation.execute(RefreshOperation.java:98)
	at org.openmrs.test.BaseContextSensitiveTest.executeDataSet(BaseContextSensitiveTest.java:682)
	at org.openmrs.test.BaseContextSensitiveTest.executeDataSet(BaseContextSensitiveTest.java:577)
	at org.openmrs.test.BaseContextSensitiveTest.initializeInMemoryDatabase(BaseContextSensitiveTest.java:489)
	at org.openmrs.test.BaseContextSensitiveTest.baseSetupWithStandardDataAndAuthentication(BaseContextSensitiveTest.java:778)
(34 more lines...)
Collapse Failed ForgotPasswordFormControllerTest shouldNotNotFailOnNotFoundUsername History
< 1 sec
org.dbunit.dataset.NoSuchTableException: person
	at org.dbunit.database.DatabaseDataSet.getTableMetaData(DatabaseDataSet.java:282)
	at org.dbunit.operation.AbstractOperation.getOperationMetaData(AbstractOperation.java:80)
	at org.dbunit.operation.RefreshOperation.execute(RefreshOperation.java:98)
	at org.openmrs.test.BaseContextSensitiveTest.executeDataSet(BaseContextSensitiveTest.java:682)
	at org.openmrs.test.BaseContextSensitiveTest.executeDataSet(BaseContextSensitiveTest.java:577)
	at org.openmrs.test.BaseContextSensitiveTest.initializeInMemoryDatabase(BaseContextSensitiveTest.java:489)
	at org.openmrs.test.BaseContextSensitiveTest.baseSetupWithStandardDataAndAuthentication(BaseContextSensitiveTest.java:778)
(34 more lines...)
Collapse Failed ConceptFormControllerTest onSubmit_shouldAddANewConceptMapToAnExistingConcept History
< 1 sec
org.dbunit.dataset.NoSuchTableException: person
	at org.dbunit.database.DatabaseDataSet.getTableMetaData(DatabaseDataSet.java:282)
	at org.dbunit.operation.AbstractOperation.getOperationMetaData(AbstractOperation.java:80)
	at org.dbunit.operation.RefreshOperation.execute(RefreshOperation.java:98)
	at org.openmrs.test.BaseContextSensitiveTest.executeDataSet(BaseContextSensitiveTest.java:682)
	at org.openmrs.test.BaseContextSensitiveTest.executeDataSet(BaseContextSensitiveTest.java:577)
	at org.openmrs.test.BaseContextSensitiveTest.initializeInMemoryDatabase(BaseContextSensitiveTest.java:489)
	at org.openmrs.test.BaseContextSensitiveTest.baseSetupWithStandardDataAndAuthentication(BaseContextSensitiveTest.java:778)
(33 more lines...)
Collapse Failed ConceptFormControllerTest onSubmit_shouldAddANewConceptMapWhenCreatingAConcept History
< 1 sec
org.dbunit.dataset.NoSuchTableException: person
	at org.dbunit.database.DatabaseDataSet.getTableMetaData(DatabaseDataSet.java:282)
	at org.dbunit.operation.AbstractOperation.getOperationMetaData(AbstractOperation.java:80)
	at org.dbunit.operation.RefreshOperation.execute(RefreshOperation.java:98)
	at org.openmrs.test.BaseContextSensitiveTest.executeDataSet(BaseContextSensitiveTest.java:682)
	at org.openmrs.test.BaseContextSensitiveTest.executeDataSet(BaseContextSensitiveTest.java:577)
	at org.openmrs.test.BaseContextSensitiveTest.initializeInMemoryDatabase(BaseContextSensitiveTest.java:489)
	at org.openmrs.test.BaseContextSensitiveTest.baseSetupWithStandardDataAndAuthentication(BaseContextSensitiveTest.java:778)
(33 more lines...)
Collapse Failed ConceptFormControllerTest onSubmit_shouldCopyNumericValuesIntoNumericConcepts History
< 1 sec
org.dbunit.dataset.NoSuchTableException: person
	at org.dbunit.database.DatabaseDataSet.getTableMetaData(DatabaseDataSet.java:282)
	at org.dbunit.operation.AbstractOperation.getOperationMetaData(AbstractOperation.java:80)
	at org.dbunit.operation.RefreshOperation.execute(RefreshOperation.java:98)
	at org.openmrs.test.BaseContextSensitiveTest.executeDataSet(BaseContextSensitiveTest.java:682)
	at org.openmrs.test.BaseContextSensitiveTest.executeDataSet(BaseContextSensitiveTest.java:577)
	at org.openmrs.test.BaseContextSensitiveTest.initializeInMemoryDatabase(BaseContextSensitiveTest.java:489)
	at org.openmrs.test.BaseContextSensitiveTest.baseSetupWithStandardDataAndAuthentication(BaseContextSensitiveTest.java:778)
(33 more lines...)
Collapse Failed ConceptFormControllerTest onSubmit_shouldDisplayNumericValuesFromTable History
< 1 sec
org.dbunit.dataset.NoSuchTableException: person
	at org.dbunit.database.DatabaseDataSet.getTableMetaData(DatabaseDataSet.java:282)
	at org.dbunit.operation.AbstractOperation.getOperationMetaData(AbstractOperation.java:80)
	at org.dbunit.operation.RefreshOperation.execute(RefreshOperation.java:98)
	at org.openmrs.test.BaseContextSensitiveTest.executeDataSet(BaseContextSensitiveTest.java:682)
	at org.openmrs.test.BaseContextSensitiveTest.executeDataSet(BaseContextSensitiveTest.java:577)
	at org.openmrs.test.BaseContextSensitiveTest.initializeInMemoryDatabase(BaseContextSensitiveTest.java:489)
	at org.openmrs.test.BaseContextSensitiveTest.baseSetupWithStandardDataAndAuthentication(BaseContextSensitiveTest.java:778)
(33 more lines...)
Collapse Failed ConceptFormControllerTest onSubmit_shouldIgnoreNewConceptMapRowIfTheUserDidNotSelectATerm History
< 1 sec
org.dbunit.dataset.NoSuchTableException: person
	at org.dbunit.database.DatabaseDataSet.getTableMetaData(DatabaseDataSet.java:282)
	at org.dbunit.operation.AbstractOperation.getOperationMetaData(AbstractOperation.java:80)
	at org.dbunit.operation.RefreshOperation.execute(RefreshOperation.java:98)
	at org.openmrs.test.BaseContextSensitiveTest.executeDataSet(BaseContextSensitiveTest.java:682)
	at org.openmrs.test.BaseContextSensitiveTest.executeDataSet(BaseContextSensitiveTest.java:577)
	at org.openmrs.test.BaseContextSensitiveTest.initializeInMemoryDatabase(BaseContextSensitiveTest.java:489)
	at org.openmrs.test.BaseContextSensitiveTest.baseSetupWithStandardDataAndAuthentication(BaseContextSensitiveTest.java:778)
(33 more lines...)
Collapse Failed ConceptFormControllerTest onSubmit_shouldNotSaveChangesIfThereAreValidationErrors History
< 1 sec
org.dbunit.dataset.NoSuchTableException: person
	at org.dbunit.database.DatabaseDataSet.getTableMetaData(DatabaseDataSet.java:282)
	at org.dbunit.operation.AbstractOperation.getOperationMetaData(AbstractOperation.java:80)
	at org.dbunit.operation.RefreshOperation.execute(RefreshOperation.java:98)
	at org.openmrs.test.BaseContextSensitiveTest.executeDataSet(BaseContextSensitiveTest.java:682)
	at org.openmrs.test.BaseContextSensitiveTest.executeDataSet(BaseContextSensitiveTest.java:577)
	at org.openmrs.test.BaseContextSensitiveTest.initializeInMemoryDatabase(BaseContextSensitiveTest.java:489)
	at org.openmrs.test.BaseContextSensitiveTest.baseSetupWithStandardDataAndAuthentication(BaseContextSensitiveTest.java:778)
(33 more lines...)
Collapse Failed ConceptFormControllerTest onSubmit_shouldRemoveAConceptMapFromAnExistingConcept History
< 1 sec
org.dbunit.dataset.NoSuchTableException: person
	at org.dbunit.database.DatabaseDataSet.getTableMetaData(DatabaseDataSet.java:282)
	at org.dbunit.operation.AbstractOperation.getOperationMetaData(AbstractOperation.java:80)
	at org.dbunit.operation.RefreshOperation.execute(RefreshOperation.java:98)
	at org.openmrs.test.BaseContextSensitiveTest.executeDataSet(BaseContextSensitiveTest.java:682)
	at org.openmrs.test.BaseContextSensitiveTest.executeDataSet(BaseContextSensitiveTest.java:577)
	at org.openmrs.test.BaseContextSensitiveTest.initializeInMemoryDatabase(BaseContextSensitiveTest.java:489)
	at org.openmrs.test.BaseContextSensitiveTest.baseSetupWithStandardDataAndAuthentication(BaseContextSensitiveTest.java:778)
(33 more lines...)
Collapse Failed ConceptFormControllerTest onSubmit_shouldReturnAConceptWithANullIdIfNoMatchIsFound History
< 1 sec
org.dbunit.dataset.NoSuchTableException: person
	at org.dbunit.database.DatabaseDataSet.getTableMetaData(DatabaseDataSet.java:282)
	at org.dbunit.operation.AbstractOperation.getOperationMetaData(AbstractOperation.java:80)
	at org.dbunit.operation.RefreshOperation.execute(RefreshOperation.java:98)
	at org.openmrs.test.BaseContextSensitiveTest.executeDataSet(BaseContextSensitiveTest.java:682)
	at org.openmrs.test.BaseContextSensitiveTest.executeDataSet(BaseContextSensitiveTest.java:577)
	at org.openmrs.test.BaseContextSensitiveTest.initializeInMemoryDatabase(BaseContextSensitiveTest.java:489)
	at org.openmrs.test.BaseContextSensitiveTest.baseSetupWithStandardDataAndAuthentication(BaseContextSensitiveTest.java:778)
(33 more lines...)
Collapse Failed ConceptFormControllerTest onSubmit_shouldSetTheLocalPreferredName History
< 1 sec
org.dbunit.dataset.NoSuchTableException: person
	at org.dbunit.database.DatabaseDataSet.getTableMetaData(DatabaseDataSet.java:282)
	at org.dbunit.operation.AbstractOperation.getOperationMetaData(AbstractOperation.java:80)
	at org.dbunit.operation.RefreshOperation.execute(RefreshOperation.java:98)
	at org.openmrs.test.BaseContextSensitiveTest.executeDataSet(BaseContextSensitiveTest.java:682)
	at org.openmrs.test.BaseContextSensitiveTest.executeDataSet(BaseContextSensitiveTest.java:577)
	at org.openmrs.test.BaseContextSensitiveTest.initializeInMemoryDatabase(BaseContextSensitiveTest.java:489)
	at org.openmrs.test.BaseContextSensitiveTest.baseSetupWithStandardDataAndAuthentication(BaseContextSensitiveTest.java:778)
(33 more lines...)
Collapse Failed ConceptFormControllerTest onSubmit_shouldVoidASynonymMarkedAsPreferredWhenItIsRemoved History
< 1 sec
org.dbunit.dataset.NoSuchTableException: person
	at org.dbunit.database.DatabaseDataSet.getTableMetaData(DatabaseDataSet.java:282)
	at org.dbunit.operation.AbstractOperation.getOperationMetaData(AbstractOperation.java:80)
	at org.dbunit.operation.RefreshOperation.execute(RefreshOperation.java:98)
	at org.openmrs.test.BaseContextSensitiveTest.executeDataSet(BaseContextSensitiveTest.java:682)
	at org.openmrs.test.BaseContextSensitiveTest.executeDataSet(BaseContextSensitiveTest.java:577)
	at org.openmrs.test.BaseContextSensitiveTest.initializeInMemoryDatabase(BaseContextSensitiveTest.java:489)
	at org.openmrs.test.BaseContextSensitiveTest.baseSetupWithStandardDataAndAuthentication(BaseContextSensitiveTest.java:778)
(33 more lines...)
Collapse Failed ConceptFormControllerTest shouldAddConceptWithAllNamingSpecified History
< 1 sec
org.dbunit.dataset.NoSuchTableException: person
	at org.dbunit.database.DatabaseDataSet.getTableMetaData(DatabaseDataSet.java:282)
	at org.dbunit.operation.AbstractOperation.getOperationMetaData(AbstractOperation.java:80)
	at org.dbunit.operation.RefreshOperation.execute(RefreshOperation.java:98)
	at org.openmrs.test.BaseContextSensitiveTest.executeDataSet(BaseContextSensitiveTest.java:682)
	at org.openmrs.test.BaseContextSensitiveTest.executeDataSet(BaseContextSensitiveTest.java:577)
	at org.openmrs.test.BaseContextSensitiveTest.initializeInMemoryDatabase(BaseContextSensitiveTest.java:489)
	at org.openmrs.test.BaseContextSensitiveTest.baseSetupWithStandardDataAndAuthentication(BaseContextSensitiveTest.java:778)
(33 more lines...)
Collapse Failed ConceptFormControllerTest shouldAddConceptWithNameAndShortNameAndDescriptionSpecifiedToCodeConcepts History
< 1 sec
org.dbunit.dataset.NoSuchTableException: person
	at org.dbunit.database.DatabaseDataSet.getTableMetaData(DatabaseDataSet.java:282)
	at org.dbunit.operation.AbstractOperation.getOperationMetaData(AbstractOperation.java:80)
	at org.dbunit.operation.RefreshOperation.execute(RefreshOperation.java:98)
	at org.openmrs.test.BaseContextSensitiveTest.executeDataSet(BaseContextSensitiveTest.java:682)
	at org.openmrs.test.BaseContextSensitiveTest.executeDataSet(BaseContextSensitiveTest.java:577)
	at org.openmrs.test.BaseContextSensitiveTest.initializeInMemoryDatabase(BaseContextSensitiveTest.java:489)
	at org.openmrs.test.BaseContextSensitiveTest.baseSetupWithStandardDataAndAuthentication(BaseContextSensitiveTest.java:778)
(33 more lines...)
Collapse Failed ConceptFormControllerTest shouldAddConceptWithNameAndShortNameAndDescriptionSpecifiedToNumericConcepts History
< 1 sec
org.dbunit.dataset.NoSuchTableException: person
	at org.dbunit.database.DatabaseDataSet.getTableMetaData(DatabaseDataSet.java:282)
	at org.dbunit.operation.AbstractOperation.getOperationMetaData(AbstractOperation.java:80)
	at org.dbunit.operation.RefreshOperation.execute(RefreshOperation.java:98)
	at org.openmrs.test.BaseContextSensitiveTest.executeDataSet(BaseContextSensitiveTest.java:682)
	at org.openmrs.test.BaseContextSensitiveTest.executeDataSet(BaseContextSensitiveTest.java:577)
	at org.openmrs.test.BaseContextSensitiveTest.initializeInMemoryDatabase(BaseContextSensitiveTest.java:489)
	at org.openmrs.test.BaseContextSensitiveTest.baseSetupWithStandardDataAndAuthentication(BaseContextSensitiveTest.java:778)
(33 more lines...)
Collapse Failed ConceptFormControllerTest shouldAddConceptWithNameAndShortNameSpecified History
< 1 sec
org.dbunit.dataset.NoSuchTableException: person
	at org.dbunit.database.DatabaseDataSet.getTableMetaData(DatabaseDataSet.java:282)
	at org.dbunit.operation.AbstractOperation.getOperationMetaData(AbstractOperation.java:80)
	at org.dbunit.operation.RefreshOperation.execute(RefreshOperation.java:98)
	at org.openmrs.test.BaseContextSensitiveTest.executeDataSet(BaseContextSensitiveTest.java:682)
	at org.openmrs.test.BaseContextSensitiveTest.executeDataSet(BaseContextSensitiveTest.java:577)
	at org.openmrs.test.BaseContextSensitiveTest.initializeInMemoryDatabase(BaseContextSensitiveTest.java:489)
	at org.openmrs.test.BaseContextSensitiveTest.baseSetupWithStandardDataAndAuthentication(BaseContextSensitiveTest.java:778)
(33 more lines...)
Collapse Failed ConceptFormControllerTest shouldAddConceptWithOnlyNameSpecified History
< 1 sec
org.dbunit.dataset.NoSuchTableException: person
	at org.dbunit.database.DatabaseDataSet.getTableMetaData(DatabaseDataSet.java:282)
	at org.dbunit.operation.AbstractOperation.getOperationMetaData(AbstractOperation.java:80)
	at org.dbunit.operation.RefreshOperation.execute(RefreshOperation.java:98)
	at org.openmrs.test.BaseContextSensitiveTest.executeDataSet(BaseContextSensitiveTest.java:682)
	at org.openmrs.test.BaseContextSensitiveTest.executeDataSet(BaseContextSensitiveTest.java:577)
	at org.openmrs.test.BaseContextSensitiveTest.initializeInMemoryDatabase(BaseContextSensitiveTest.java:489)
	at org.openmrs.test.BaseContextSensitiveTest.baseSetupWithStandardDataAndAuthentication(BaseContextSensitiveTest.java:778)
(33 more lines...)
Collapse Failed ConceptFormControllerTest shouldEditConceptComplex History
4 secs
org.dbunit.dataset.NoSuchTableException: person
	at org.dbunit.database.DatabaseDataSet.getTableMetaData(DatabaseDataSet.java:282)
	at org.dbunit.operation.AbstractOperation.getOperationMetaData(AbstractOperation.java:80)
	at org.dbunit.operation.RefreshOperation.execute(RefreshOperation.java:98)
	at org.openmrs.test.BaseContextSensitiveTest.executeDataSet(BaseContextSensitiveTest.java:682)
	at org.openmrs.test.BaseContextSensitiveTest.executeDataSet(BaseContextSensitiveTest.java:577)
	at org.openmrs.test.BaseContextSensitiveTest.initializeInMemoryDatabase(BaseContextSensitiveTest.java:489)
	at org.openmrs.test.BaseContextSensitiveTest.baseSetupWithStandardDataAndAuthentication(BaseContextSensitiveTest.java:778)
(33 more lines...)
Collapse Failed ConceptFormControllerTest shouldGetConcept History
< 1 sec
org.dbunit.dataset.NoSuchTableException: person
	at org.dbunit.database.DatabaseDataSet.getTableMetaData(DatabaseDataSet.java:282)
	at org.dbunit.operation.AbstractOperation.getOperationMetaData(AbstractOperation.java:80)
	at org.dbunit.operation.RefreshOperation.execute(RefreshOperation.java:98)
	at org.openmrs.test.BaseContextSensitiveTest.executeDataSet(BaseContextSensitiveTest.java:682)
	at org.openmrs.test.BaseContextSensitiveTest.executeDataSet(BaseContextSensitiveTest.java:577)
	at org.openmrs.test.BaseContextSensitiveTest.initializeInMemoryDatabase(BaseContextSensitiveTest.java:489)
	at org.openmrs.test.BaseContextSensitiveTest.baseSetupWithStandardDataAndAuthentication(BaseContextSensitiveTest.java:778)
(33 more lines...)
Collapse Failed ConceptFormControllerTest shouldNotDeleteConceptsWhenConceptsAreLocked History
< 1 sec
org.dbunit.dataset.NoSuchTableException: person
	at org.dbunit.database.DatabaseDataSet.getTableMetaData(DatabaseDataSet.java:282)
	at org.dbunit.operation.AbstractOperation.getOperationMetaData(AbstractOperation.java:80)
	at org.dbunit.operation.RefreshOperation.execute(RefreshOperation.java:98)
	at org.openmrs.test.BaseContextSensitiveTest.executeDataSet(BaseContextSensitiveTest.java:682)
	at org.openmrs.test.BaseContextSensitiveTest.executeDataSet(BaseContextSensitiveTest.java:577)
	at org.openmrs.test.BaseContextSensitiveTest.initializeInMemoryDatabase(BaseContextSensitiveTest.java:489)
	at org.openmrs.test.BaseContextSensitiveTest.baseSetupWithStandardDataAndAuthentication(BaseContextSensitiveTest.java:778)
(33 more lines...)
Collapse Failed ConceptFormControllerTest shouldRemoveConceptAnswer History
< 1 sec
org.dbunit.dataset.NoSuchTableException: person
	at org.dbunit.database.DatabaseDataSet.getTableMetaData(DatabaseDataSet.java:282)
	at org.dbunit.operation.AbstractOperation.getOperationMetaData(AbstractOperation.java:80)
	at org.dbunit.operation.RefreshOperation.execute(RefreshOperation.java:98)
	at org.openmrs.test.BaseContextSensitiveTest.executeDataSet(BaseContextSensitiveTest.java:682)
	at org.openmrs.test.BaseContextSensitiveTest.executeDataSet(BaseContextSensitiveTest.java:577)
	at org.openmrs.test.BaseContextSensitiveTest.initializeInMemoryDatabase(BaseContextSensitiveTest.java:489)
	at org.openmrs.test.BaseContextSensitiveTest.baseSetupWithStandardDataAndAuthentication(BaseContextSensitiveTest.java:778)
(33 more lines...)
Collapse Failed ConceptFormControllerTest shouldRemoveConceptAnswersIfDatatypeChangedFromCoded History
< 1 sec
org.dbunit.dataset.NoSuchTableException: person
	at org.dbunit.database.DatabaseDataSet.getTableMetaData(DatabaseDataSet.java:282)
	at org.dbunit.operation.AbstractOperation.getOperationMetaData(AbstractOperation.java:80)
	at org.dbunit.operation.RefreshOperation.execute(RefreshOperation.java:98)
	at org.openmrs.test.BaseContextSensitiveTest.executeDataSet(BaseContextSensitiveTest.java:682)
	at org.openmrs.test.BaseContextSensitiveTest.executeDataSet(BaseContextSensitiveTest.java:577)
	at org.openmrs.test.BaseContextSensitiveTest.initializeInMemoryDatabase(BaseContextSensitiveTest.java:489)
	at org.openmrs.test.BaseContextSensitiveTest.baseSetupWithStandardDataAndAuthentication(BaseContextSensitiveTest.java:778)
(33 more lines...)
Collapse Failed ConceptFormControllerTest shouldRemoveConceptSet History
< 1 sec
org.dbunit.dataset.NoSuchTableException: person
	at org.dbunit.database.DatabaseDataSet.getTableMetaData(DatabaseDataSet.java:282)
	at org.dbunit.operation.AbstractOperation.getOperationMetaData(AbstractOperation.java:80)
	at org.dbunit.operation.RefreshOperation.execute(RefreshOperation.java:98)
	at org.openmrs.test.BaseContextSensitiveTest.executeDataSet(BaseContextSensitiveTest.java:682)
	at org.openmrs.test.BaseContextSensitiveTest.executeDataSet(BaseContextSensitiveTest.java:577)
	at org.openmrs.test.BaseContextSensitiveTest.initializeInMemoryDatabase(BaseContextSensitiveTest.java:489)
	at org.openmrs.test.BaseContextSensitiveTest.baseSetupWithStandardDataAndAuthentication(BaseContextSensitiveTest.java:778)
(33 more lines...)
Collapse Failed ConceptFormControllerTest shouldReplacePreviousDescription History
< 1 sec
org.dbunit.dataset.NoSuchTableException: person
	at org.dbunit.database.DatabaseDataSet.getTableMetaData(DatabaseDataSet.java:282)
	at org.dbunit.operation.AbstractOperation.getOperationMetaData(AbstractOperation.java:80)
	at org.dbunit.operation.RefreshOperation.execute(RefreshOperation.java:98)
	at org.openmrs.test.BaseContextSensitiveTest.executeDataSet(BaseContextSensitiveTest.java:682)
	at org.openmrs.test.BaseContextSensitiveTest.executeDataSet(BaseContextSensitiveTest.java:577)
	at org.openmrs.test.BaseContextSensitiveTest.initializeInMemoryDatabase(BaseContextSensitiveTest.java:489)
	at org.openmrs.test.BaseContextSensitiveTest.baseSetupWithStandardDataAndAuthentication(BaseContextSensitiveTest.java:778)
(33 more lines...)
Collapse Failed ConceptFormControllerTest shouldUpdateConceptByAddingName History
< 1 sec
org.dbunit.dataset.NoSuchTableException: person
	at org.dbunit.database.DatabaseDataSet.getTableMetaData(DatabaseDataSet.java:282)
	at org.dbunit.operation.AbstractOperation.getOperationMetaData(AbstractOperation.java:80)
	at org.dbunit.operation.RefreshOperation.execute(RefreshOperation.java:98)
	at org.openmrs.test.BaseContextSensitiveTest.executeDataSet(BaseContextSensitiveTest.java:682)
	at org.openmrs.test.BaseContextSensitiveTest.executeDataSet(BaseContextSensitiveTest.java:577)
	at org.openmrs.test.BaseContextSensitiveTest.initializeInMemoryDatabase(BaseContextSensitiveTest.java:489)
	at org.openmrs.test.BaseContextSensitiveTest.baseSetupWithStandardDataAndAuthentication(BaseContextSensitiveTest.java:778)
(33 more lines...)
Collapse Failed ConceptFormControllerTest shouldUpdateConceptWithNameAlreadyInSynonymList History
< 1 sec
org.dbunit.dataset.NoSuchTableException: person
	at org.dbunit.database.DatabaseDataSet.getTableMetaData(DatabaseDataSet.java:282)
	at org.dbunit.operation.AbstractOperation.getOperationMetaData(AbstractOperation.java:80)
	at org.dbunit.operation.RefreshOperation.execute(RefreshOperation.java:98)
	at org.openmrs.test.BaseContextSensitiveTest.executeDataSet(BaseContextSensitiveTest.java:682)
	at org.openmrs.test.BaseContextSensitiveTest.executeDataSet(BaseContextSensitiveTest.java:577)
	at org.openmrs.test.BaseContextSensitiveTest.initializeInMemoryDatabase(BaseContextSensitiveTest.java:489)
	at org.openmrs.test.BaseContextSensitiveTest.baseSetupWithStandardDataAndAuthentication(BaseContextSensitiveTest.java:778)
(33 more lines...)
Collapse Failed ConceptFormControllerTest shouldUpdateConceptWithShortNameAlreadyInSynonymList History
< 1 sec
org.dbunit.dataset.NoSuchTableException: person
	at org.dbunit.database.DatabaseDataSet.getTableMetaData(DatabaseDataSet.java:282)
	at org.dbunit.operation.AbstractOperation.getOperationMetaData(AbstractOperation.java:80)
	at org.dbunit.operation.RefreshOperation.execute(RefreshOperation.java:98)
	at org.openmrs.test.BaseContextSensitiveTest.executeDataSet(BaseContextSensitiveTest.java:682)
	at org.openmrs.test.BaseContextSensitiveTest.executeDataSet(BaseContextSensitiveTest.java:577)
	at org.openmrs.test.BaseContextSensitiveTest.initializeInMemoryDatabase(BaseContextSensitiveTest.java:489)
	at org.openmrs.test.BaseContextSensitiveTest.baseSetupWithStandardDataAndAuthentication(BaseContextSensitiveTest.java:778)
(33 more lines...)
Collapse Failed ConceptFormControllerTest shouldVoidShortName History
< 1 sec
org.dbunit.dataset.NoSuchTableException: person
	at org.dbunit.database.DatabaseDataSet.getTableMetaData(DatabaseDataSet.java:282)
	at org.dbunit.operation.AbstractOperation.getOperationMetaData(AbstractOperation.java:80)
	at org.dbunit.operation.RefreshOperation.execute(RefreshOperation.java:98)
	at org.openmrs.test.BaseContextSensitiveTest.executeDataSet(BaseContextSensitiveTest.java:682)
	at org.openmrs.test.BaseContextSensitiveTest.executeDataSet(BaseContextSensitiveTest.java:577)
	at org.openmrs.test.BaseContextSensitiveTest.initializeInMemoryDatabase(BaseContextSensitiveTest.java:489)
	at org.openmrs.test.BaseContextSensitiveTest.baseSetupWithStandardDataAndAuthentication(BaseContextSensitiveTest.java:778)
(33 more lines...)
Collapse Failed ConceptFormControllerTest validateConceptReferenceTermUsesPersistedObjects_shouldAddErrorIfMapTypeIsNotSaved History
< 1 sec
org.dbunit.dataset.NoSuchTableException: person
	at org.dbunit.database.DatabaseDataSet.getTableMetaData(DatabaseDataSet.java:282)
	at org.dbunit.operation.AbstractOperation.getOperationMetaData(AbstractOperation.java:80)
	at org.dbunit.operation.RefreshOperation.execute(RefreshOperation.java:98)
	at org.openmrs.test.BaseContextSensitiveTest.executeDataSet(BaseContextSensitiveTest.java:682)
	at org.openmrs.test.BaseContextSensitiveTest.executeDataSet(BaseContextSensitiveTest.java:577)
	at org.openmrs.test.BaseContextSensitiveTest.initializeInMemoryDatabase(BaseContextSensitiveTest.java:489)
	at org.openmrs.test.BaseContextSensitiveTest.baseSetupWithStandardDataAndAuthentication(BaseContextSensitiveTest.java:778)
(33 more lines...)
Collapse Failed ConceptFormControllerTest validateConceptReferenceTermUsesPersistedObjects_shouldAddErrorIfSourceIsNotSaved History
< 1 sec
org.dbunit.dataset.NoSuchTableException: person
	at org.dbunit.database.DatabaseDataSet.getTableMetaData(DatabaseDataSet.java:282)
	at org.dbunit.operation.AbstractOperation.getOperationMetaData(AbstractOperation.java:80)
	at org.dbunit.operation.RefreshOperation.execute(RefreshOperation.java:98)
	at org.openmrs.test.BaseContextSensitiveTest.executeDataSet(BaseContextSensitiveTest.java:682)
	at org.openmrs.test.BaseContextSensitiveTest.executeDataSet(BaseContextSensitiveTest.java:577)
	at org.openmrs.test.BaseContextSensitiveTest.initializeInMemoryDatabase(BaseContextSensitiveTest.java:489)
	at org.openmrs.test.BaseContextSensitiveTest.baseSetupWithStandardDataAndAuthentication(BaseContextSensitiveTest.java:778)
(33 more lines...)
Collapse Failed ConceptFormControllerTest validateConceptReferenceTermUsesPersistedObjects_shouldAddErrorIfTermBIsNotSaved History
< 1 sec
org.dbunit.dataset.NoSuchTableException: person
	at org.dbunit.database.DatabaseDataSet.getTableMetaData(DatabaseDataSet.java:282)
	at org.dbunit.operation.AbstractOperation.getOperationMetaData(AbstractOperation.java:80)
	at org.dbunit.operation.RefreshOperation.execute(RefreshOperation.java:98)
	at org.openmrs.test.BaseContextSensitiveTest.executeDataSet(BaseContextSensitiveTest.java:682)
	at org.openmrs.test.BaseContextSensitiveTest.executeDataSet(BaseContextSensitiveTest.java:577)
	at org.openmrs.test.BaseContextSensitiveTest.initializeInMemoryDatabase(BaseContextSensitiveTest.java:489)
	at org.openmrs.test.BaseContextSensitiveTest.baseSetupWithStandardDataAndAuthentication(BaseContextSensitiveTest.java:778)
(33 more lines...)
Collapse Failed GlobalPropertyPortletControllerTest populateModel_shouldExcludeMultiplePrefixes History
< 1 sec
org.dbunit.dataset.NoSuchTableException: person
	at org.dbunit.database.DatabaseDataSet.getTableMetaData(DatabaseDataSet.java:282)
	at org.dbunit.operation.AbstractOperation.getOperationMetaData(AbstractOperation.java:80)
	at org.dbunit.operation.RefreshOperation.execute(RefreshOperation.java:98)
	at org.openmrs.test.BaseContextSensitiveTest.executeDataSet(BaseContextSensitiveTest.java:682)
	at org.openmrs.test.BaseContextSensitiveTest.executeDataSet(BaseContextSensitiveTest.java:577)
	at org.openmrs.test.BaseContextSensitiveTest.initializeInMemoryDatabase(BaseContextSensitiveTest.java:489)
	at org.openmrs.test.BaseContextSensitiveTest.baseSetupWithStandardDataAndAuthentication(BaseContextSensitiveTest.java:778)
(33 more lines...)
Collapse Failed GlobalPropertyPortletControllerTest setupModelForModule_shouldChangeModelIfForModuleIsPresent History
< 1 sec
org.dbunit.dataset.NoSuchTableException: person
	at org.dbunit.database.DatabaseDataSet.getTableMetaData(DatabaseDataSet.java:282)
	at org.dbunit.operation.AbstractOperation.getOperationMetaData(AbstractOperation.java:80)
	at org.dbunit.operation.RefreshOperation.execute(RefreshOperation.java:98)
	at org.openmrs.test.BaseContextSensitiveTest.executeDataSet(BaseContextSensitiveTest.java:682)
	at org.openmrs.test.BaseContextSensitiveTest.executeDataSet(BaseContextSensitiveTest.java:577)
	at org.openmrs.test.BaseContextSensitiveTest.initializeInMemoryDatabase(BaseContextSensitiveTest.java:489)
	at org.openmrs.test.BaseContextSensitiveTest.baseSetupWithStandardDataAndAuthentication(BaseContextSensitiveTest.java:778)
(33 more lines...)
Collapse Failed GlobalPropertyPortletControllerTest setupModelForModule_shouldNotChangeModeIfForModuleIsNotPresent History
< 1 sec
org.dbunit.dataset.NoSuchTableException: person
	at org.dbunit.database.DatabaseDataSet.getTableMetaData(DatabaseDataSet.java:282)
	at org.dbunit.operation.AbstractOperation.getOperationMetaData(AbstractOperation.java:80)
	at org.dbunit.operation.RefreshOperation.execute(RefreshOperation.java:98)
	at org.openmrs.test.BaseContextSensitiveTest.executeDataSet(BaseContextSensitiveTest.java:682)
	at org.openmrs.test.BaseContextSensitiveTest.executeDataSet(BaseContextSensitiveTest.java:577)
	at org.openmrs.test.BaseContextSensitiveTest.initializeInMemoryDatabase(BaseContextSensitiveTest.java:489)
	at org.openmrs.test.BaseContextSensitiveTest.baseSetupWithStandardDataAndAuthentication(BaseContextSensitiveTest.java:778)
(33 more lines...)
Collapse Failed GlobalPropertyPortletControllerTest setupModelForModule_shouldNotOverrideExcludePrefixButConcatenate History
< 1 sec
org.dbunit.dataset.NoSuchTableException: person
	at org.dbunit.database.DatabaseDataSet.getTableMetaData(DatabaseDataSet.java:282)
	at org.dbunit.operation.AbstractOperation.getOperationMetaData(AbstractOperation.java:80)
	at org.dbunit.operation.RefreshOperation.execute(RefreshOperation.java:98)
	at org.openmrs.test.BaseContextSensitiveTest.executeDataSet(BaseContextSensitiveTest.java:682)
	at org.openmrs.test.BaseContextSensitiveTest.executeDataSet(BaseContextSensitiveTest.java:577)
	at org.openmrs.test.BaseContextSensitiveTest.initializeInMemoryDatabase(BaseContextSensitiveTest.java:489)
	at org.openmrs.test.BaseContextSensitiveTest.baseSetupWithStandardDataAndAuthentication(BaseContextSensitiveTest.java:778)
(33 more lines...)
Collapse Failed OptionsFormControllerTest onSubmit_shouldAccept2CharactersAsUsername History
< 1 sec
org.dbunit.dataset.NoSuchTableException: person
	at org.dbunit.database.DatabaseDataSet.getTableMetaData(DatabaseDataSet.java:282)
	at org.dbunit.operation.AbstractOperation.getOperationMetaData(AbstractOperation.java:80)
	at org.dbunit.operation.RefreshOperation.execute(RefreshOperation.java:98)
	at org.openmrs.test.BaseContextSensitiveTest.executeDataSet(BaseContextSensitiveTest.java:682)
	at org.openmrs.test.BaseContextSensitiveTest.executeDataSet(BaseContextSensitiveTest.java:577)
	at org.openmrs.test.BaseContextSensitiveTest.initializeInMemoryDatabase(BaseContextSensitiveTest.java:489)
	at org.openmrs.test.BaseContextSensitiveTest.baseSetupWithStandardDataAndAuthentication(BaseContextSensitiveTest.java:778)
(33 more lines...)
Collapse Failed OptionsFormControllerTest onSubmit_shouldAcceptEmailAddressAsUsernameIfEnabled History
< 1 sec
org.dbunit.dataset.NoSuchTableException: person
	at org.dbunit.database.DatabaseDataSet.getTableMetaData(DatabaseDataSet.java:282)
	at org.dbunit.operation.AbstractOperation.getOperationMetaData(AbstractOperation.java:80)
	at org.dbunit.operation.RefreshOperation.execute(RefreshOperation.java:98)
	at org.openmrs.test.BaseContextSensitiveTest.executeDataSet(BaseContextSensitiveTest.java:682)
	at org.openmrs.test.BaseContextSensitiveTest.executeDataSet(BaseContextSensitiveTest.java:577)
	at org.openmrs.test.BaseContextSensitiveTest.initializeInMemoryDatabase(BaseContextSensitiveTest.java:489)
	at org.openmrs.test.BaseContextSensitiveTest.baseSetupWithStandardDataAndAuthentication(BaseContextSensitiveTest.java:778)
(33 more lines...)
Collapse Failed OptionsFormControllerTest onSubmit_shouldReject1CharacterAsUsername History
< 1 sec
org.dbunit.dataset.NoSuchTableException: person
	at org.dbunit.database.DatabaseDataSet.getTableMetaData(DatabaseDataSet.java:282)
	at org.dbunit.operation.AbstractOperation.getOperationMetaData(AbstractOperation.java:80)
	at org.dbunit.operation.RefreshOperation.execute(RefreshOperation.java:98)
	at org.openmrs.test.BaseContextSensitiveTest.executeDataSet(BaseContextSensitiveTest.java:682)
	at org.openmrs.test.BaseContextSensitiveTest.executeDataSet(BaseContextSensitiveTest.java:577)
	at org.openmrs.test.BaseContextSensitiveTest.initializeInMemoryDatabase(BaseContextSensitiveTest.java:489)
	at org.openmrs.test.BaseContextSensitiveTest.baseSetupWithStandardDataAndAuthentication(BaseContextSensitiveTest.java:778)
(33 more lines...)
Collapse Failed OptionsFormControllerTest onSubmit_shouldRejectInvalidEmailAddressAsUsernameIfEnabled History
< 1 sec
org.dbunit.dataset.NoSuchTableException: person
	at org.dbunit.database.DatabaseDataSet.getTableMetaData(DatabaseDataSet.java:282)
	at org.dbunit.operation.AbstractOperation.getOperationMetaData(AbstractOperation.java:80)
	at org.dbunit.operation.RefreshOperation.execute(RefreshOperation.java:98)
	at org.openmrs.test.BaseContextSensitiveTest.executeDataSet(BaseContextSensitiveTest.java:682)
	at org.openmrs.test.BaseContextSensitiveTest.executeDataSet(BaseContextSensitiveTest.java:577)
	at org.openmrs.test.BaseContextSensitiveTest.initializeInMemoryDatabase(BaseContextSensitiveTest.java:489)
	at org.openmrs.test.BaseContextSensitiveTest.baseSetupWithStandardDataAndAuthentication(BaseContextSensitiveTest.java:778)
(33 more lines...)
Collapse Failed OptionsFormControllerTest shouldAcceptValidNotificationAddress History
< 1 sec
org.dbunit.dataset.NoSuchTableException: person
	at org.dbunit.database.DatabaseDataSet.getTableMetaData(DatabaseDataSet.java:282)
	at org.dbunit.operation.AbstractOperation.getOperationMetaData(AbstractOperation.java:80)
	at org.dbunit.operation.RefreshOperation.execute(RefreshOperation.java:98)
	at org.openmrs.test.BaseContextSensitiveTest.executeDataSet(BaseContextSensitiveTest.java:682)
	at org.openmrs.test.BaseContextSensitiveTest.executeDataSet(BaseContextSensitiveTest.java:577)
	at org.openmrs.test.BaseContextSensitiveTest.initializeInMemoryDatabase(BaseContextSensitiveTest.java:489)
	at org.openmrs.test.BaseContextSensitiveTest.baseSetupWithStandardDataAndAuthentication(BaseContextSensitiveTest.java:778)
(33 more lines...)
Collapse Failed OptionsFormControllerTest shouldChangeSecretQuestionAndAnswer History
< 1 sec
org.dbunit.dataset.NoSuchTableException: person
	at org.dbunit.database.DatabaseDataSet.getTableMetaData(DatabaseDataSet.java:282)
	at org.dbunit.operation.AbstractOperation.getOperationMetaData(AbstractOperation.java:80)
	at org.dbunit.operation.RefreshOperation.execute(RefreshOperation.java:98)
	at org.openmrs.test.BaseContextSensitiveTest.executeDataSet(BaseContextSensitiveTest.java:682)
	at org.openmrs.test.BaseContextSensitiveTest.executeDataSet(BaseContextSensitiveTest.java:577)
	at org.openmrs.test.BaseContextSensitiveTest.initializeInMemoryDatabase(BaseContextSensitiveTest.java:489)
	at org.openmrs.test.BaseContextSensitiveTest.baseSetupWithStandardDataAndAuthentication(BaseContextSensitiveTest.java:778)
(33 more lines...)
Collapse Failed OptionsFormControllerTest shouldRejectEmptyNotificationAddress History
< 1 sec
org.dbunit.dataset.NoSuchTableException: person
	at org.dbunit.database.DatabaseDataSet.getTableMetaData(DatabaseDataSet.java:282)
	at org.dbunit.operation.AbstractOperation.getOperationMetaData(AbstractOperation.java:80)
	at org.dbunit.operation.RefreshOperation.execute(RefreshOperation.java:98)
	at org.openmrs.test.BaseContextSensitiveTest.executeDataSet(BaseContextSensitiveTest.java:682)
	at org.openmrs.test.BaseContextSensitiveTest.executeDataSet(BaseContextSensitiveTest.java:577)
	at org.openmrs.test.BaseContextSensitiveTest.initializeInMemoryDatabase(BaseContextSensitiveTest.java:489)
	at org.openmrs.test.BaseContextSensitiveTest.baseSetupWithStandardDataAndAuthentication(BaseContextSensitiveTest.java:778)
(33 more lines...)
Collapse Failed OptionsFormControllerTest shouldRejectEmptySecretAnswer History
< 1 sec
org.dbunit.dataset.NoSuchTableException: person
	at org.dbunit.database.DatabaseDataSet.getTableMetaData(DatabaseDataSet.java:282)
	at org.dbunit.operation.AbstractOperation.getOperationMetaData(AbstractOperation.java:80)
	at org.dbunit.operation.RefreshOperation.execute(RefreshOperation.java:98)
	at org.openmrs.test.BaseContextSensitiveTest.executeDataSet(BaseContextSensitiveTest.java:682)
	at org.openmrs.test.BaseContextSensitiveTest.executeDataSet(BaseContextSensitiveTest.java:577)
	at org.openmrs.test.BaseContextSensitiveTest.initializeInMemoryDatabase(BaseContextSensitiveTest.java:489)
	at org.openmrs.test.BaseContextSensitiveTest.baseSetupWithStandardDataAndAuthentication(BaseContextSensitiveTest.java:778)
(33 more lines...)
Collapse Failed OptionsFormControllerTest shouldRejectEmptySecretQuestion History
< 1 sec
org.dbunit.dataset.NoSuchTableException: person
	at org.dbunit.database.DatabaseDataSet.getTableMetaData(DatabaseDataSet.java:282)
	at org.dbunit.operation.AbstractOperation.getOperationMetaData(AbstractOperation.java:80)
	at org.dbunit.operation.RefreshOperation.execute(RefreshOperation.java:98)
	at org.openmrs.test.BaseContextSensitiveTest.executeDataSet(BaseContextSensitiveTest.java:682)
	at org.openmrs.test.BaseContextSensitiveTest.executeDataSet(BaseContextSensitiveTest.java:577)
	at org.openmrs.test.BaseContextSensitiveTest.initializeInMemoryDatabase(BaseContextSensitiveTest.java:489)
	at org.openmrs.test.BaseContextSensitiveTest.baseSetupWithStandardDataAndAuthentication(BaseContextSensitiveTest.java:778)
(33 more lines...)
Collapse Failed OptionsFormControllerTest shouldRejectInvalidNotificationAddress History
< 1 sec
org.dbunit.dataset.NoSuchTableException: person
	at org.dbunit.database.DatabaseDataSet.getTableMetaData(DatabaseDataSet.java:282)
	at org.dbunit.operation.AbstractOperation.getOperationMetaData(AbstractOperation.java:80)
	at org.dbunit.operation.RefreshOperation.execute(RefreshOperation.java:98)
	at org.openmrs.test.BaseContextSensitiveTest.executeDataSet(BaseContextSensitiveTest.java:682)
	at org.openmrs.test.BaseContextSensitiveTest.executeDataSet(BaseContextSensitiveTest.java:577)
	at org.openmrs.test.BaseContextSensitiveTest.initializeInMemoryDatabase(BaseContextSensitiveTest.java:489)
	at org.openmrs.test.BaseContextSensitiveTest.baseSetupWithStandardDataAndAuthentication(BaseContextSensitiveTest.java:778)
(33 more lines...)
Collapse Failed PortletControllerTest handleRequest_shouldCalculateBmiIntoPatientBmiAsString History
< 1 sec
org.dbunit.dataset.NoSuchTableException: person
	at org.dbunit.database.DatabaseDataSet.getTableMetaData(DatabaseDataSet.java:282)
	at org.dbunit.operation.AbstractOperation.getOperationMetaData(AbstractOperation.java:80)
	at org.dbunit.operation.RefreshOperation.execute(RefreshOperation.java:98)
	at org.openmrs.test.BaseContextSensitiveTest.executeDataSet(BaseContextSensitiveTest.java:682)
	at org.openmrs.test.BaseContextSensitiveTest.executeDataSet(BaseContextSensitiveTest.java:577)
	at org.openmrs.test.BaseContextSensitiveTest.initializeInMemoryDatabase(BaseContextSensitiveTest.java:489)
	at org.openmrs.test.BaseContextSensitiveTest.baseSetupWithStandardDataAndAuthentication(BaseContextSensitiveTest.java:778)
(33 more lines...)
Collapse Failed PortletControllerTest handleRequest_shouldNotFailWithEmptyHeightAndWeightProperties History
< 1 sec
org.dbunit.dataset.NoSuchTableException: person
	at org.dbunit.database.DatabaseDataSet.getTableMetaData(DatabaseDataSet.java:282)
	at org.dbunit.operation.AbstractOperation.getOperationMetaData(AbstractOperation.java:80)
	at org.dbunit.operation.RefreshOperation.execute(RefreshOperation.java:98)
	at org.openmrs.test.BaseContextSensitiveTest.executeDataSet(BaseContextSensitiveTest.java:682)
	at org.openmrs.test.BaseContextSensitiveTest.executeDataSet(BaseContextSensitiveTest.java:577)
	at org.openmrs.test.BaseContextSensitiveTest.initializeInMemoryDatabase(BaseContextSensitiveTest.java:489)
	at org.openmrs.test.BaseContextSensitiveTest.baseSetupWithStandardDataAndAuthentication(BaseContextSensitiveTest.java:778)
(33 more lines...)
Collapse Failed ConceptFormControllerTest ConceptFormBackingObject_shouldCopyNumericAttributes History
< 1 sec
org.dbunit.dataset.NoSuchTableException: person
	at org.dbunit.database.DatabaseDataSet.getTableMetaData(DatabaseDataSet.java:282)
	at org.dbunit.operation.AbstractOperation.getOperationMetaData(AbstractOperation.java:80)
	at org.dbunit.operation.RefreshOperation.execute(RefreshOperation.java:98)
	at org.openmrs.test.BaseContextSensitiveTest.executeDataSet(BaseContextSensitiveTest.java:682)
	at org.openmrs.test.BaseContextSensitiveTest.executeDataSet(BaseContextSensitiveTest.java:577)
	at org.openmrs.test.BaseContextSensitiveTest.initializeInMemoryDatabase(BaseContextSensitiveTest.java:489)
	at org.openmrs.test.BaseContextSensitiveTest.baseSetupWithStandardDataAndAuthentication(BaseContextSensitiveTest.java:778)
(33 more lines...)
Collapse Failed ConceptProposalFormControllerTest onSubmit_shouldCreateASingleUniqueSynonymAndObsForAllSimilarProposals History
< 1 sec
org.dbunit.dataset.NoSuchTableException: person
	at org.dbunit.database.DatabaseDataSet.getTableMetaData(DatabaseDataSet.java:282)
	at org.dbunit.operation.AbstractOperation.getOperationMetaData(AbstractOperation.java:80)
	at org.dbunit.operation.RefreshOperation.execute(RefreshOperation.java:98)
	at org.openmrs.test.BaseContextSensitiveTest.executeDataSet(BaseContextSensitiveTest.java:682)
	at org.openmrs.test.BaseContextSensitiveTest.executeDataSet(BaseContextSensitiveTest.java:577)
	at org.openmrs.test.BaseContextSensitiveTest.initializeInMemoryDatabase(BaseContextSensitiveTest.java:489)
	at org.openmrs.test.BaseContextSensitiveTest.baseSetupWithStandardDataAndAuthentication(BaseContextSensitiveTest.java:778)
(33 more lines...)
Collapse Failed ConceptSourceFormControllerTest onSubmit_shouldDeleteConceptSource History
1 sec
org.dbunit.dataset.NoSuchTableException: person
	at org.dbunit.database.DatabaseDataSet.getTableMetaData(DatabaseDataSet.java:282)
	at org.dbunit.operation.AbstractOperation.getOperationMetaData(AbstractOperation.java:80)
	at org.dbunit.operation.RefreshOperation.execute(RefreshOperation.java:98)
	at org.openmrs.test.BaseContextSensitiveTest.executeDataSet(BaseContextSensitiveTest.java:682)
	at org.openmrs.test.BaseContextSensitiveTest.executeDataSet(BaseContextSensitiveTest.java:577)
	at org.openmrs.test.BaseContextSensitiveTest.initializeInMemoryDatabase(BaseContextSensitiveTest.java:489)
	at org.openmrs.test.BaseContextSensitiveTest.baseSetupWithStandardDataAndAuthentication(BaseContextSensitiveTest.java:778)
(33 more lines...)
Collapse Failed ConceptSourceFormControllerTest onSubmit_shouldRestoreRetiredConceptSource History
< 1 sec
org.dbunit.dataset.NoSuchTableException: person
	at org.dbunit.database.DatabaseDataSet.getTableMetaData(DatabaseDataSet.java:282)
	at org.dbunit.operation.AbstractOperation.getOperationMetaData(AbstractOperation.java:80)
	at org.dbunit.operation.RefreshOperation.execute(RefreshOperation.java:98)
	at org.openmrs.test.BaseContextSensitiveTest.executeDataSet(BaseContextSensitiveTest.java:682)
	at org.openmrs.test.BaseContextSensitiveTest.executeDataSet(BaseContextSensitiveTest.java:577)
	at org.openmrs.test.BaseContextSensitiveTest.initializeInMemoryDatabase(BaseContextSensitiveTest.java:489)
	at org.openmrs.test.BaseContextSensitiveTest.baseSetupWithStandardDataAndAuthentication(BaseContextSensitiveTest.java:778)
(33 more lines...)
Collapse Failed ConceptSourceFormControllerTest onSubmit_shouldRetireConceptSource History
< 1 sec
org.dbunit.dataset.NoSuchTableException: person
	at org.dbunit.database.DatabaseDataSet.getTableMetaData(DatabaseDataSet.java:282)
	at org.dbunit.operation.AbstractOperation.getOperationMetaData(AbstractOperation.java:80)
	at org.dbunit.operation.RefreshOperation.execute(RefreshOperation.java:98)
	at org.openmrs.test.BaseContextSensitiveTest.executeDataSet(BaseContextSensitiveTest.java:682)
	at org.openmrs.test.BaseContextSensitiveTest.executeDataSet(BaseContextSensitiveTest.java:577)
	at org.openmrs.test.BaseContextSensitiveTest.initializeInMemoryDatabase(BaseContextSensitiveTest.java:489)
	at org.openmrs.test.BaseContextSensitiveTest.baseSetupWithStandardDataAndAuthentication(BaseContextSensitiveTest.java:778)
(33 more lines...)
Collapse Failed ConceptStopWordFormControllerTest handleSubmission_shouldAddNewConceptStopWord History
< 1 sec
org.dbunit.dataset.NoSuchTableException: person
	at org.dbunit.database.DatabaseDataSet.getTableMetaData(DatabaseDataSet.java:282)
	at org.dbunit.operation.AbstractOperation.getOperationMetaData(AbstractOperation.java:80)
	at org.dbunit.operation.RefreshOperation.execute(RefreshOperation.java:98)
	at org.openmrs.test.BaseContextSensitiveTest.executeDataSet(BaseContextSensitiveTest.java:682)
	at org.openmrs.test.BaseContextSensitiveTest.executeDataSet(BaseContextSensitiveTest.java:577)
	at org.openmrs.test.BaseContextSensitiveTest.initializeInMemoryDatabase(BaseContextSensitiveTest.java:489)
	at org.openmrs.test.BaseContextSensitiveTest.baseSetupWithStandardDataAndAuthentication(BaseContextSensitiveTest.java:778)
(33 more lines...)
Collapse Failed ConceptStopWordFormControllerTest handleSubmission_shouldReturnErrorMessageForAnEmptyConceptStopWord History
< 1 sec
org.dbunit.dataset.NoSuchTableException: person
	at org.dbunit.database.DatabaseDataSet.getTableMetaData(DatabaseDataSet.java:282)
	at org.dbunit.operation.AbstractOperation.getOperationMetaData(AbstractOperation.java:80)
	at org.dbunit.operation.RefreshOperation.execute(RefreshOperation.java:98)
	at org.openmrs.test.BaseContextSensitiveTest.executeDataSet(BaseContextSensitiveTest.java:682)
	at org.openmrs.test.BaseContextSensitiveTest.executeDataSet(BaseContextSensitiveTest.java:577)
	at org.openmrs.test.BaseContextSensitiveTest.initializeInMemoryDatabase(BaseContextSensitiveTest.java:489)
	at org.openmrs.test.BaseContextSensitiveTest.baseSetupWithStandardDataAndAuthentication(BaseContextSensitiveTest.java:778)
(33 more lines...)
Collapse Failed ConceptStopWordListControllerTest handleSubmission_shouldAddTheDeleteErrorMessageInSession History
< 1 sec
org.dbunit.dataset.NoSuchTableException: person
	at org.dbunit.database.DatabaseDataSet.getTableMetaData(DatabaseDataSet.java:282)
	at org.dbunit.operation.AbstractOperation.getOperationMetaData(AbstractOperation.java:80)
	at org.dbunit.operation.RefreshOperation.execute(RefreshOperation.java:98)
	at org.openmrs.test.BaseContextSensitiveTest.executeDataSet(BaseContextSensitiveTest.java:682)
	at org.openmrs.test.BaseContextSensitiveTest.executeDataSet(BaseContextSensitiveTest.java:577)
	at org.openmrs.test.BaseContextSensitiveTest.initializeInMemoryDatabase(BaseContextSensitiveTest.java:489)
	at org.openmrs.test.BaseContextSensitiveTest.baseSetupWithStandardDataAndAuthentication(BaseContextSensitiveTest.java:778)
(33 more lines...)
Collapse Failed ConceptStopWordListControllerTest handleSubmission_shouldAddTheDeleteSuccessMessageInSession History
< 1 sec
org.dbunit.dataset.NoSuchTableException: person
	at org.dbunit.database.DatabaseDataSet.getTableMetaData(DatabaseDataSet.java:282)
	at org.dbunit.operation.AbstractOperation.getOperationMetaData(AbstractOperation.java:80)
	at org.dbunit.operation.RefreshOperation.execute(RefreshOperation.java:98)
	at org.openmrs.test.BaseContextSensitiveTest.executeDataSet(BaseContextSensitiveTest.java:682)
	at org.openmrs.test.BaseContextSensitiveTest.executeDataSet(BaseContextSensitiveTest.java:577)
	at org.openmrs.test.BaseContextSensitiveTest.initializeInMemoryDatabase(BaseContextSensitiveTest.java:489)
	at org.openmrs.test.BaseContextSensitiveTest.baseSetupWithStandardDataAndAuthentication(BaseContextSensitiveTest.java:778)
(33 more lines...)
Collapse Failed ConceptStopWordListControllerTest handleSubmission_shouldDeleteGivenConceptStopWordFromDB History
< 1 sec
org.dbunit.dataset.NoSuchTableException: person
	at org.dbunit.database.DatabaseDataSet.getTableMetaData(DatabaseDataSet.java:282)
	at org.dbunit.operation.AbstractOperation.getOperationMetaData(AbstractOperation.java:80)
	at org.dbunit.operation.RefreshOperation.execute(RefreshOperation.java:98)
	at org.openmrs.test.BaseContextSensitiveTest.executeDataSet(BaseContextSensitiveTest.java:682)
	at org.openmrs.test.BaseContextSensitiveTest.executeDataSet(BaseContextSensitiveTest.java:577)
	at org.openmrs.test.BaseContextSensitiveTest.initializeInMemoryDatabase(BaseContextSensitiveTest.java:489)
	at org.openmrs.test.BaseContextSensitiveTest.baseSetupWithStandardDataAndAuthentication(BaseContextSensitiveTest.java:778)
(33 more lines...)
Collapse Failed ConceptStopWordListControllerTest showForm_shouldAddAllConceptStopWordsInSessionAttribute History
< 1 sec
org.dbunit.dataset.NoSuchTableException: person
	at org.dbunit.database.DatabaseDataSet.getTableMetaData(DatabaseDataSet.java:282)
	at org.dbunit.operation.AbstractOperation.getOperationMetaData(AbstractOperation.java:80)
	at org.dbunit.operation.RefreshOperation.execute(RefreshOperation.java:98)
	at org.openmrs.test.BaseContextSensitiveTest.executeDataSet(BaseContextSensitiveTest.java:682)
	at org.openmrs.test.BaseContextSensitiveTest.executeDataSet(BaseContextSensitiveTest.java:577)
	at org.openmrs.test.BaseContextSensitiveTest.initializeInMemoryDatabase(BaseContextSensitiveTest.java:489)
	at org.openmrs.test.BaseContextSensitiveTest.baseSetupWithStandardDataAndAuthentication(BaseContextSensitiveTest.java:778)
(33 more lines...)
Collapse Failed ConceptStopWordListControllerTest showForm_shouldReturnConceptStopWordListView History
< 1 sec
org.dbunit.dataset.NoSuchTableException: person
	at org.dbunit.database.DatabaseDataSet.getTableMetaData(DatabaseDataSet.java:282)
	at org.dbunit.operation.AbstractOperation.getOperationMetaData(AbstractOperation.java:80)
	at org.dbunit.operation.RefreshOperation.execute(RefreshOperation.java:98)
	at org.openmrs.test.BaseContextSensitiveTest.executeDataSet(BaseContextSensitiveTest.java:682)
	at org.openmrs.test.BaseContextSensitiveTest.executeDataSet(BaseContextSensitiveTest.java:577)
	at org.openmrs.test.BaseContextSensitiveTest.initializeInMemoryDatabase(BaseContextSensitiveTest.java:489)
	at org.openmrs.test.BaseContextSensitiveTest.baseSetupWithStandardDataAndAuthentication(BaseContextSensitiveTest.java:778)
(33 more lines...)
Collapse Failed EncounterRoleFormControllerTest purge_shouldPurgeAnExistingEncounter History
< 1 sec
org.dbunit.dataset.NoSuchTableException: person
	at org.dbunit.database.DatabaseDataSet.getTableMetaData(DatabaseDataSet.java:282)
	at org.dbunit.operation.AbstractOperation.getOperationMetaData(AbstractOperation.java:80)
	at org.dbunit.operation.RefreshOperation.execute(RefreshOperation.java:98)
	at org.openmrs.test.BaseContextSensitiveTest.executeDataSet(BaseContextSensitiveTest.java:682)
	at org.openmrs.test.BaseContextSensitiveTest.executeDataSet(BaseContextSensitiveTest.java:577)
	at org.openmrs.test.BaseContextSensitiveTest.initializeInMemoryDatabase(BaseContextSensitiveTest.java:489)
	at org.openmrs.test.BaseContextSensitiveTest.baseSetupWithStandardDataAndAuthentication(BaseContextSensitiveTest.java:778)
(33 more lines...)
Collapse Failed EncounterRoleFormControllerTest retire_shouldRaiseAnErrorIfRetireReasonIsNotFilled History
< 1 sec
org.dbunit.dataset.NoSuchTableException: person
	at org.dbunit.database.DatabaseDataSet.getTableMetaData(DatabaseDataSet.java:282)
	at org.dbunit.operation.AbstractOperation.getOperationMetaData(AbstractOperation.java:80)
	at org.dbunit.operation.RefreshOperation.execute(RefreshOperation.java:98)
	at org.openmrs.test.BaseContextSensitiveTest.executeDataSet(BaseContextSensitiveTest.java:682)
	at org.openmrs.test.BaseContextSensitiveTest.executeDataSet(BaseContextSensitiveTest.java:577)
	at org.openmrs.test.BaseContextSensitiveTest.initializeInMemoryDatabase(BaseContextSensitiveTest.java:489)
	at org.openmrs.test.BaseContextSensitiveTest.baseSetupWithStandardDataAndAuthentication(BaseContextSensitiveTest.java:778)
(33 more lines...)
Collapse Failed EncounterRoleFormControllerTest retire_shouldRetireAnExistingEncounter History
< 1 sec
org.dbunit.dataset.NoSuchTableException: person
	at org.dbunit.database.DatabaseDataSet.getTableMetaData(DatabaseDataSet.java:282)
	at org.dbunit.operation.AbstractOperation.getOperationMetaData(AbstractOperation.java:80)
	at org.dbunit.operation.RefreshOperation.execute(RefreshOperation.java:98)
	at org.openmrs.test.BaseContextSensitiveTest.executeDataSet(BaseContextSensitiveTest.java:682)
	at org.openmrs.test.BaseContextSensitiveTest.executeDataSet(BaseContextSensitiveTest.java:577)
	at org.openmrs.test.BaseContextSensitiveTest.initializeInMemoryDatabase(BaseContextSensitiveTest.java:489)
	at org.openmrs.test.BaseContextSensitiveTest.baseSetupWithStandardDataAndAuthentication(BaseContextSensitiveTest.java:778)
(33 more lines...)
Collapse Failed EncounterRoleFormControllerTest saveEncounterRole_shouldEditAndSaveAnExistingEncounter History
< 1 sec
org.dbunit.dataset.NoSuchTableException: person
	at org.dbunit.database.DatabaseDataSet.getTableMetaData(DatabaseDataSet.java:282)
	at org.dbunit.operation.AbstractOperation.getOperationMetaData(AbstractOperation.java:80)
	at org.dbunit.operation.RefreshOperation.execute(RefreshOperation.java:98)
	at org.openmrs.test.BaseContextSensitiveTest.executeDataSet(BaseContextSensitiveTest.java:682)
	at org.openmrs.test.BaseContextSensitiveTest.executeDataSet(BaseContextSensitiveTest.java:577)
	at org.openmrs.test.BaseContextSensitiveTest.initializeInMemoryDatabase(BaseContextSensitiveTest.java:489)
	at org.openmrs.test.BaseContextSensitiveTest.baseSetupWithStandardDataAndAuthentication(BaseContextSensitiveTest.java:778)
(33 more lines...)
Collapse Failed EncounterRoleFormControllerTest saveEncounterRole_shouldRaiseAnErrorIfValidationOfEncounterRoleFails History
< 1 sec
org.dbunit.dataset.NoSuchTableException: person
	at org.dbunit.database.DatabaseDataSet.getTableMetaData(DatabaseDataSet.java:282)
	at org.dbunit.operation.AbstractOperation.getOperationMetaData(AbstractOperation.java:80)
	at org.dbunit.operation.RefreshOperation.execute(RefreshOperation.java:98)
	at org.openmrs.test.BaseContextSensitiveTest.executeDataSet(BaseContextSensitiveTest.java:682)
	at org.openmrs.test.BaseContextSensitiveTest.executeDataSet(BaseContextSensitiveTest.java:577)
	at org.openmrs.test.BaseContextSensitiveTest.initializeInMemoryDatabase(BaseContextSensitiveTest.java:489)
	at org.openmrs.test.BaseContextSensitiveTest.baseSetupWithStandardDataAndAuthentication(BaseContextSensitiveTest.java:778)
(33 more lines...)
Collapse Failed EncounterRoleFormControllerTest saveEncounterRole_shouldSaveANewEncounterRoleObject History
< 1 sec
org.dbunit.dataset.NoSuchTableException: person
	at org.dbunit.database.DatabaseDataSet.getTableMetaData(DatabaseDataSet.java:282)
	at org.dbunit.operation.AbstractOperation.getOperationMetaData(AbstractOperation.java:80)
	at org.dbunit.operation.RefreshOperation.execute(RefreshOperation.java:98)
	at org.openmrs.test.BaseContextSensitiveTest.executeDataSet(BaseContextSensitiveTest.java:682)
	at org.openmrs.test.BaseContextSensitiveTest.executeDataSet(BaseContextSensitiveTest.java:577)
	at org.openmrs.test.BaseContextSensitiveTest.initializeInMemoryDatabase(BaseContextSensitiveTest.java:489)
	at org.openmrs.test.BaseContextSensitiveTest.baseSetupWithStandardDataAndAuthentication(BaseContextSensitiveTest.java:778)
(33 more lines...)
Collapse Failed EncounterRoleFormControllerTest showEncounterList_shouldAddListOfEncounterRoleObjectsToTheModel History
< 1 sec
org.dbunit.dataset.NoSuchTableException: person
	at org.dbunit.database.DatabaseDataSet.getTableMetaData(DatabaseDataSet.java:282)
	at org.dbunit.operation.AbstractOperation.getOperationMetaData(AbstractOperation.java:80)
	at org.dbunit.operation.RefreshOperation.execute(RefreshOperation.java:98)
	at org.openmrs.test.BaseContextSensitiveTest.executeDataSet(BaseContextSensitiveTest.java:682)
	at org.openmrs.test.BaseContextSensitiveTest.executeDataSet(BaseContextSensitiveTest.java:577)
	at org.openmrs.test.BaseContextSensitiveTest.initializeInMemoryDatabase(BaseContextSensitiveTest.java:489)
	at org.openmrs.test.BaseContextSensitiveTest.baseSetupWithStandardDataAndAuthentication(BaseContextSensitiveTest.java:778)
(33 more lines...)
Collapse Failed EncounterRoleFormControllerTest unretire_shouldRetireAnExistingEncounter History
< 1 sec
org.dbunit.dataset.NoSuchTableException: person
	at org.dbunit.database.DatabaseDataSet.getTableMetaData(DatabaseDataSet.java:282)
	at org.dbunit.operation.AbstractOperation.getOperationMetaData(AbstractOperation.java:80)
	at org.dbunit.operation.RefreshOperation.execute(RefreshOperation.java:98)
	at org.openmrs.test.BaseContextSensitiveTest.executeDataSet(BaseContextSensitiveTest.java:682)
	at org.openmrs.test.BaseContextSensitiveTest.executeDataSet(BaseContextSensitiveTest.java:577)
	at org.openmrs.test.BaseContextSensitiveTest.initializeInMemoryDatabase(BaseContextSensitiveTest.java:489)
	at org.openmrs.test.BaseContextSensitiveTest.baseSetupWithStandardDataAndAuthentication(BaseContextSensitiveTest.java:778)
(33 more lines...)
Collapse Failed EncounterTypeFormControllerTest shouldNotDeleteEncounterTypeWhenEncounterTypesAreLocked History
< 1 sec
org.dbunit.dataset.NoSuchTableException: person
	at org.dbunit.database.DatabaseDataSet.getTableMetaData(DatabaseDataSet.java:282)
	at org.dbunit.operation.AbstractOperation.getOperationMetaData(AbstractOperation.java:80)
	at org.dbunit.operation.RefreshOperation.execute(RefreshOperation.java:98)
	at org.openmrs.test.BaseContextSensitiveTest.executeDataSet(BaseContextSensitiveTest.java:682)
	at org.openmrs.test.BaseContextSensitiveTest.executeDataSet(BaseContextSensitiveTest.java:577)
	at org.openmrs.test.BaseContextSensitiveTest.initializeInMemoryDatabase(BaseContextSensitiveTest.java:489)
	at org.openmrs.test.BaseContextSensitiveTest.baseSetupWithStandardDataAndAuthentication(BaseContextSensitiveTest.java:778)
(33 more lines...)
Collapse Failed EncounterTypeFormControllerTest shouldSaveEncounterTypeWhenEncounterTypesAreNotLocked History
1 sec
org.dbunit.dataset.NoSuchTableException: person
	at org.dbunit.database.DatabaseDataSet.getTableMetaData(DatabaseDataSet.java:282)
	at org.dbunit.operation.AbstractOperation.getOperationMetaData(AbstractOperation.java:80)
	at org.dbunit.operation.RefreshOperation.execute(RefreshOperation.java:98)
	at org.openmrs.test.BaseContextSensitiveTest.executeDataSet(BaseContextSensitiveTest.java:682)
	at org.openmrs.test.BaseContextSensitiveTest.executeDataSet(BaseContextSensitiveTest.java:577)
	at org.openmrs.test.BaseContextSensitiveTest.initializeInMemoryDatabase(BaseContextSensitiveTest.java:489)
	at org.openmrs.test.BaseContextSensitiveTest.baseSetupWithStandardDataAndAuthentication(BaseContextSensitiveTest.java:778)
(33 more lines...)
Collapse Failed EncounterTypeListControllerTest onSubmit_shouldNotFailIfNoEncounterTypesAreSelected History
< 1 sec
org.dbunit.dataset.NoSuchTableException: person
	at org.dbunit.database.DatabaseDataSet.getTableMetaData(DatabaseDataSet.java:282)
	at org.dbunit.operation.AbstractOperation.getOperationMetaData(AbstractOperation.java:80)
	at org.dbunit.operation.RefreshOperation.execute(RefreshOperation.java:98)
	at org.openmrs.test.BaseContextSensitiveTest.executeDataSet(BaseContextSensitiveTest.java:682)
	at org.openmrs.test.BaseContextSensitiveTest.executeDataSet(BaseContextSensitiveTest.java:577)
	at org.openmrs.test.BaseContextSensitiveTest.initializeInMemoryDatabase(BaseContextSensitiveTest.java:489)
	at org.openmrs.test.BaseContextSensitiveTest.baseSetupWithStandardDataAndAuthentication(BaseContextSensitiveTest.java:778)
(33 more lines...)
Collapse Failed LocationFormControllerTest formBackingObject_shouldReturnValidLocationGivenValidLocationId History
8 mins
org.dbunit.dataset.NoSuchTableException: person
	at org.dbunit.database.DatabaseDataSet.getTableMetaData(DatabaseDataSet.java:282)
	at org.dbunit.operation.AbstractOperation.getOperationMetaData(AbstractOperation.java:80)
	at org.dbunit.operation.RefreshOperation.execute(RefreshOperation.java:98)
	at org.openmrs.test.BaseContextSensitiveTest.executeDataSet(BaseContextSensitiveTest.java:682)
	at org.openmrs.test.BaseContextSensitiveTest.executeDataSet(BaseContextSensitiveTest.java:577)
	at org.openmrs.test.BaseContextSensitiveTest.initializeInMemoryDatabase(BaseContextSensitiveTest.java:489)
	at org.openmrs.test.BaseContextSensitiveTest.baseSetupWithStandardDataAndAuthentication(BaseContextSensitiveTest.java:778)
(34 more lines...)
Collapse Failed LocationFormControllerTest onSubmit_shouldNotRetireLocationIfReasonIsEmpty History
< 1 sec
org.dbunit.dataset.NoSuchTableException: person
	at org.dbunit.database.DatabaseDataSet.getTableMetaData(DatabaseDataSet.java:282)
	at org.dbunit.operation.AbstractOperation.getOperationMetaData(AbstractOperation.java:80)
	at org.dbunit.operation.RefreshOperation.execute(RefreshOperation.java:98)
	at org.openmrs.test.BaseContextSensitiveTest.executeDataSet(BaseContextSensitiveTest.java:682)
	at org.openmrs.test.BaseContextSensitiveTest.executeDataSet(BaseContextSensitiveTest.java:577)
	at org.openmrs.test.BaseContextSensitiveTest.initializeInMemoryDatabase(BaseContextSensitiveTest.java:489)
	at org.openmrs.test.BaseContextSensitiveTest.baseSetupWithStandardDataAndAuthentication(BaseContextSensitiveTest.java:778)
(34 more lines...)
Collapse Failed LocationFormControllerTest onSubmit_shouldRetireLocation History
< 1 sec
org.dbunit.dataset.NoSuchTableException: person
	at org.dbunit.database.DatabaseDataSet.getTableMetaData(DatabaseDataSet.java:282)
	at org.dbunit.operation.AbstractOperation.getOperationMetaData(AbstractOperation.java:80)
	at org.dbunit.operation.RefreshOperation.execute(RefreshOperation.java:98)
	at org.openmrs.test.BaseContextSensitiveTest.executeDataSet(BaseContextSensitiveTest.java:682)
	at org.openmrs.test.BaseContextSensitiveTest.executeDataSet(BaseContextSensitiveTest.java:577)
	at org.openmrs.test.BaseContextSensitiveTest.initializeInMemoryDatabase(BaseContextSensitiveTest.java:489)
	at org.openmrs.test.BaseContextSensitiveTest.baseSetupWithStandardDataAndAuthentication(BaseContextSensitiveTest.java:778)
(34 more lines...)
Collapse Failed FieldFormControllerTest formBackingObject_shouldGetField History
< 1 sec
org.dbunit.dataset.NoSuchTableException: person
	at org.dbunit.database.DatabaseDataSet.getTableMetaData(DatabaseDataSet.java:282)
	at org.dbunit.operation.AbstractOperation.getOperationMetaData(AbstractOperation.java:80)
	at org.dbunit.operation.RefreshOperation.execute(RefreshOperation.java:98)
	at org.openmrs.test.BaseContextSensitiveTest.executeDataSet(BaseContextSensitiveTest.java:682)
	at org.openmrs.test.BaseContextSensitiveTest.executeDataSet(BaseContextSensitiveTest.java:577)
	at org.openmrs.test.BaseContextSensitiveTest.initializeInMemoryDatabase(BaseContextSensitiveTest.java:489)
	at org.openmrs.test.BaseContextSensitiveTest.baseSetupWithStandardDataAndAuthentication(BaseContextSensitiveTest.java:778)
(33 more lines...)
Collapse Failed FieldFormControllerTest onSubmit_shouldNotFailOnFieldAnswers History
< 1 sec
org.dbunit.dataset.NoSuchTableException: person
	at org.dbunit.database.DatabaseDataSet.getTableMetaData(DatabaseDataSet.java:282)
	at org.dbunit.operation.AbstractOperation.getOperationMetaData(AbstractOperation.java:80)
	at org.dbunit.operation.RefreshOperation.execute(RefreshOperation.java:98)
	at org.openmrs.test.BaseContextSensitiveTest.executeDataSet(BaseContextSensitiveTest.java:682)
	at org.openmrs.test.BaseContextSensitiveTest.executeDataSet(BaseContextSensitiveTest.java:577)
	at org.openmrs.test.BaseContextSensitiveTest.initializeInMemoryDatabase(BaseContextSensitiveTest.java:489)
	at org.openmrs.test.BaseContextSensitiveTest.baseSetupWithStandardDataAndAuthentication(BaseContextSensitiveTest.java:778)
(33 more lines...)
Collapse Failed FieldTypeListControllerTest onSubmit_shouldDisplayAUserFriendlyErrorMessage History
1 sec
org.hibernate.HibernateException: No Hibernate Session bound to thread, and configuration does not allow creation of non-transactional one here
	at org.springframework.orm.hibernate3.SpringSessionContext.currentSession(SpringSessionContext.java:63)
	at org.hibernate.impl.SessionFactoryImpl.getCurrentSession(SessionFactoryImpl.java:687)
	at org.openmrs.test.BaseContextSensitiveTest.getConnection(BaseContextSensitiveTest.java:476)
	at org.openmrs.test.BaseContextSensitiveTest.executeDataSet(BaseContextSensitiveTest.java:676)
	at org.openmrs.test.BaseContextSensitiveTest.executeDataSet(BaseContextSensitiveTest.java:577)
	at org.openmrs.test.BaseContextSensitiveTest.initializeInMemoryDatabase(BaseContextSensitiveTest.java:489)
	at org.openmrs.test.BaseContextSensitiveTest.baseSetupWithStandardDataAndAuthentication(BaseContextSensitiveTest.java:778)
(33 more lines...)
Collapse Failed GlobalPropertyControllerTest onSubmit_shouldPurgeNotIncludedProperties History
< 1 sec
org.dbunit.dataset.NoSuchTableException: person
	at org.dbunit.database.DatabaseDataSet.getTableMetaData(DatabaseDataSet.java:282)
	at org.dbunit.operation.AbstractOperation.getOperationMetaData(AbstractOperation.java:80)
	at org.dbunit.operation.RefreshOperation.execute(RefreshOperation.java:98)
	at org.openmrs.test.BaseContextSensitiveTest.executeDataSet(BaseContextSensitiveTest.java:682)
	at org.openmrs.test.BaseContextSensitiveTest.executeDataSet(BaseContextSensitiveTest.java:577)
	at org.openmrs.test.BaseContextSensitiveTest.initializeInMemoryDatabase(BaseContextSensitiveTest.java:489)
	at org.openmrs.test.BaseContextSensitiveTest.baseSetupWithStandardDataAndAuthentication(BaseContextSensitiveTest.java:778)
(33 more lines...)
Collapse Failed GlobalPropertyControllerTest onSubmit_shouldSaveOrUpdateIncludedProperties History
< 1 sec
org.dbunit.dataset.NoSuchTableException: person
	at org.dbunit.database.DatabaseDataSet.getTableMetaData(DatabaseDataSet.java:282)
	at org.dbunit.operation.AbstractOperation.getOperationMetaData(AbstractOperation.java:80)
	at org.dbunit.operation.RefreshOperation.execute(RefreshOperation.java:98)
	at org.openmrs.test.BaseContextSensitiveTest.executeDataSet(BaseContextSensitiveTest.java:682)
	at org.openmrs.test.BaseContextSensitiveTest.executeDataSet(BaseContextSensitiveTest.java:577)
	at org.openmrs.test.BaseContextSensitiveTest.initializeInMemoryDatabase(BaseContextSensitiveTest.java:489)
	at org.openmrs.test.BaseContextSensitiveTest.baseSetupWithStandardDataAndAuthentication(BaseContextSensitiveTest.java:778)
(33 more lines...)
Collapse Failed SystemInformationControllerTest getMemoryInformation_shouldReturnMemoryInformation History
< 1 sec
org.dbunit.dataset.NoSuchTableException: person
	at org.dbunit.database.DatabaseDataSet.getTableMetaData(DatabaseDataSet.java:282)
	at org.dbunit.operation.AbstractOperation.getOperationMetaData(AbstractOperation.java:80)
	at org.dbunit.operation.RefreshOperation.execute(RefreshOperation.java:98)
	at org.openmrs.test.BaseContextSensitiveTest.executeDataSet(BaseContextSensitiveTest.java:682)
	at org.openmrs.test.BaseContextSensitiveTest.executeDataSet(BaseContextSensitiveTest.java:577)
	at org.openmrs.test.BaseContextSensitiveTest.initializeInMemoryDatabase(BaseContextSensitiveTest.java:489)
	at org.openmrs.test.BaseContextSensitiveTest.baseSetupWithStandardDataAndAuthentication(BaseContextSensitiveTest.java:778)
(33 more lines...)
Collapse Failed SystemInformationControllerTest showPage_shouldReturnAllDatabaseInformation History
2 secs
org.dbunit.dataset.NoSuchTableException: person
	at org.dbunit.database.DatabaseDataSet.getTableMetaData(DatabaseDataSet.java:282)
	at org.dbunit.operation.AbstractOperation.getOperationMetaData(AbstractOperation.java:80)
	at org.dbunit.operation.RefreshOperation.execute(RefreshOperation.java:98)
	at org.openmrs.test.BaseContextSensitiveTest.executeDataSet(BaseContextSensitiveTest.java:682)
	at org.openmrs.test.BaseContextSensitiveTest.executeDataSet(BaseContextSensitiveTest.java:577)
	at org.openmrs.test.BaseContextSensitiveTest.initializeInMemoryDatabase(BaseContextSensitiveTest.java:489)
	at org.openmrs.test.BaseContextSensitiveTest.baseSetupWithStandardDataAndAuthentication(BaseContextSensitiveTest.java:778)
(33 more lines...)
Collapse Failed SystemInformationControllerTest showPage_shouldReturnAllJavaRuntimeInformation History
< 1 sec
org.dbunit.dataset.NoSuchTableException: person
	at org.dbunit.database.DatabaseDataSet.getTableMetaData(DatabaseDataSet.java:282)
	at org.dbunit.operation.AbstractOperation.getOperationMetaData(AbstractOperation.java:80)
	at org.dbunit.operation.RefreshOperation.execute(RefreshOperation.java:98)
	at org.openmrs.test.BaseContextSensitiveTest.executeDataSet(BaseContextSensitiveTest.java:682)
	at org.openmrs.test.BaseContextSensitiveTest.executeDataSet(BaseContextSensitiveTest.java:577)
	at org.openmrs.test.BaseContextSensitiveTest.initializeInMemoryDatabase(BaseContextSensitiveTest.java:489)
	at org.openmrs.test.BaseContextSensitiveTest.baseSetupWithStandardDataAndAuthentication(BaseContextSensitiveTest.java:778)
(33 more lines...)
Collapse Failed SystemInformationControllerTest showPage_shouldReturnOpenmrsInformation History
< 1 sec
org.dbunit.dataset.NoSuchTableException: person
	at org.dbunit.database.DatabaseDataSet.getTableMetaData(DatabaseDataSet.java:282)
	at org.dbunit.operation.AbstractOperation.getOperationMetaData(AbstractOperation.java:80)
	at org.dbunit.operation.RefreshOperation.execute(RefreshOperation.java:98)
	at org.openmrs.test.BaseContextSensitiveTest.executeDataSet(BaseContextSensitiveTest.java:682)
	at org.openmrs.test.BaseContextSensitiveTest.executeDataSet(BaseContextSensitiveTest.java:577)
	at org.openmrs.test.BaseContextSensitiveTest.initializeInMemoryDatabase(BaseContextSensitiveTest.java:489)
	at org.openmrs.test.BaseContextSensitiveTest.baseSetupWithStandardDataAndAuthentication(BaseContextSensitiveTest.java:778)
(33 more lines...)
Collapse Failed SystemInformationControllerTest showPage_shouldReturnUserInformation History
< 1 sec
org.dbunit.dataset.NoSuchTableException: person
	at org.dbunit.database.DatabaseDataSet.getTableMetaData(DatabaseDataSet.java:282)
	at org.dbunit.operation.AbstractOperation.getOperationMetaData(AbstractOperation.java:80)
	at org.dbunit.operation.RefreshOperation.execute(RefreshOperation.java:98)
	at org.openmrs.test.BaseContextSensitiveTest.executeDataSet(BaseContextSensitiveTest.java:682)
	at org.openmrs.test.BaseContextSensitiveTest.executeDataSet(BaseContextSensitiveTest.java:577)
	at org.openmrs.test.BaseContextSensitiveTest.initializeInMemoryDatabase(BaseContextSensitiveTest.java:489)
	at org.openmrs.test.BaseContextSensitiveTest.baseSetupWithStandardDataAndAuthentication(BaseContextSensitiveTest.java:778)
(33 more lines...)
Collapse Failed ShortPatientFormControllerTest saveShortPatient_shouldAddANewAddressIfThePersonHadNone History
< 1 sec
org.dbunit.dataset.NoSuchTableException: person
	at org.dbunit.database.DatabaseDataSet.getTableMetaData(DatabaseDataSet.java:282)
	at org.dbunit.operation.AbstractOperation.getOperationMetaData(AbstractOperation.java:80)
	at org.dbunit.operation.RefreshOperation.execute(RefreshOperation.java:98)
	at org.openmrs.test.BaseContextSensitiveTest.executeDataSet(BaseContextSensitiveTest.java:682)
	at org.openmrs.test.BaseContextSensitiveTest.executeDataSet(BaseContextSensitiveTest.java:577)
	at org.openmrs.test.BaseContextSensitiveTest.initializeInMemoryDatabase(BaseContextSensitiveTest.java:489)
	at org.openmrs.test.BaseContextSensitiveTest.baseSetupWithStandardDataAndAuthentication(BaseContextSensitiveTest.java:778)
(33 more lines...)
Collapse Failed ShortPatientFormControllerTest saveShortPatient_shouldAddANewNameIfThePersonHadNoNames History
< 1 sec
org.dbunit.dataset.NoSuchTableException: person
	at org.dbunit.database.DatabaseDataSet.getTableMetaData(DatabaseDataSet.java:282)
	at org.dbunit.operation.AbstractOperation.getOperationMetaData(AbstractOperation.java:80)
	at org.dbunit.operation.RefreshOperation.execute(RefreshOperation.java:98)
	at org.openmrs.test.BaseContextSensitiveTest.executeDataSet(BaseContextSensitiveTest.java:682)
	at org.openmrs.test.BaseContextSensitiveTest.executeDataSet(BaseContextSensitiveTest.java:577)
	at org.openmrs.test.BaseContextSensitiveTest.initializeInMemoryDatabase(BaseContextSensitiveTest.java:489)
	at org.openmrs.test.BaseContextSensitiveTest.baseSetupWithStandardDataAndAuthentication(BaseContextSensitiveTest.java:778)
(33 more lines...)
Collapse Failed ShortPatientFormControllerTest saveShortPatient_shouldAddANewPersonAttributeWithANonEmptyValue History
< 1 sec
org.dbunit.dataset.NoSuchTableException: person
	at org.dbunit.database.DatabaseDataSet.getTableMetaData(DatabaseDataSet.java:282)
	at org.dbunit.operation.AbstractOperation.getOperationMetaData(AbstractOperation.java:80)
	at org.dbunit.operation.RefreshOperation.execute(RefreshOperation.java:98)
	at org.openmrs.test.BaseContextSensitiveTest.executeDataSet(BaseContextSensitiveTest.java:682)
	at org.openmrs.test.BaseContextSensitiveTest.executeDataSet(BaseContextSensitiveTest.java:577)
	at org.openmrs.test.BaseContextSensitiveTest.initializeInMemoryDatabase(BaseContextSensitiveTest.java:489)
	at org.openmrs.test.BaseContextSensitiveTest.baseSetupWithStandardDataAndAuthentication(BaseContextSensitiveTest.java:778)
(33 more lines...)
Collapse Failed ShortPatientFormControllerTest saveShortPatient_shouldCreateANewPatient History
2 secs
org.dbunit.dataset.NoSuchTableException: person
	at org.dbunit.database.DatabaseDataSet.getTableMetaData(DatabaseDataSet.java:282)
	at org.dbunit.operation.AbstractOperation.getOperationMetaData(AbstractOperation.java:80)
	at org.dbunit.operation.RefreshOperation.execute(RefreshOperation.java:98)
	at org.openmrs.test.BaseContextSensitiveTest.executeDataSet(BaseContextSensitiveTest.java:682)
	at org.openmrs.test.BaseContextSensitiveTest.executeDataSet(BaseContextSensitiveTest.java:577)
	at org.openmrs.test.BaseContextSensitiveTest.initializeInMemoryDatabase(BaseContextSensitiveTest.java:489)
	at org.openmrs.test.BaseContextSensitiveTest.baseSetupWithStandardDataAndAuthentication(BaseContextSensitiveTest.java:778)
(33 more lines...)
Collapse Failed ShortPatientFormControllerTest saveShortPatient_shouldIgnoreANewAddressThatWasAddedAndVoidedAtSameTime History
< 1 sec
org.dbunit.dataset.NoSuchTableException: person
	at org.dbunit.database.DatabaseDataSet.getTableMetaData(DatabaseDataSet.java:282)
	at org.dbunit.operation.AbstractOperation.getOperationMetaData(AbstractOperation.java:80)
	at org.dbunit.operation.RefreshOperation.execute(RefreshOperation.java:98)
	at org.openmrs.test.BaseContextSensitiveTest.executeDataSet(BaseContextSensitiveTest.java:682)
	at org.openmrs.test.BaseContextSensitiveTest.executeDataSet(BaseContextSensitiveTest.java:577)
	at org.openmrs.test.BaseContextSensitiveTest.initializeInMemoryDatabase(BaseContextSensitiveTest.java:489)
	at org.openmrs.test.BaseContextSensitiveTest.baseSetupWithStandardDataAndAuthentication(BaseContextSensitiveTest.java:778)
(33 more lines...)
Collapse Failed ShortPatientFormControllerTest saveShortPatient_shouldNotAddANewPersonAttributeWithAnEmptyValue History
< 1 sec
org.dbunit.dataset.NoSuchTableException: person
	at org.dbunit.database.DatabaseDataSet.getTableMetaData(DatabaseDataSet.java:282)
	at org.dbunit.operation.AbstractOperation.getOperationMetaData(AbstractOperation.java:80)
	at org.dbunit.operation.RefreshOperation.execute(RefreshOperation.java:98)
	at org.openmrs.test.BaseContextSensitiveTest.executeDataSet(BaseContextSensitiveTest.java:682)
	at org.openmrs.test.BaseContextSensitiveTest.executeDataSet(BaseContextSensitiveTest.java:577)
	at org.openmrs.test.BaseContextSensitiveTest.initializeInMemoryDatabase(BaseContextSensitiveTest.java:489)
	at org.openmrs.test.BaseContextSensitiveTest.baseSetupWithStandardDataAndAuthentication(BaseContextSensitiveTest.java:778)
(33 more lines...)
Collapse Failed ShortPatientFormControllerTest saveShortPatient_shouldNotVoidAddressIfItWasNotChanged History
< 1 sec
org.dbunit.dataset.NoSuchTableException: person
	at org.dbunit.database.DatabaseDataSet.getTableMetaData(DatabaseDataSet.java:282)
	at org.dbunit.operation.AbstractOperation.getOperationMetaData(AbstractOperation.java:80)
	at org.dbunit.operation.RefreshOperation.execute(RefreshOperation.java:98)
	at org.openmrs.test.BaseContextSensitiveTest.executeDataSet(BaseContextSensitiveTest.java:682)
	at org.openmrs.test.BaseContextSensitiveTest.executeDataSet(BaseContextSensitiveTest.java:577)
	at org.openmrs.test.BaseContextSensitiveTest.initializeInMemoryDatabase(BaseContextSensitiveTest.java:489)
	at org.openmrs.test.BaseContextSensitiveTest.baseSetupWithStandardDataAndAuthentication(BaseContextSensitiveTest.java:778)
(33 more lines...)
Collapse Failed ShortPatientFormControllerTest saveShortPatient_shouldPassIfAllTheFormDataIsValid History
< 1 sec
org.dbunit.dataset.NoSuchTableException: person
	at org.dbunit.database.DatabaseDataSet.getTableMetaData(DatabaseDataSet.java:282)
	at org.dbunit.operation.AbstractOperation.getOperationMetaData(AbstractOperation.java:80)
	at org.dbunit.operation.RefreshOperation.execute(RefreshOperation.java:98)
	at org.openmrs.test.BaseContextSensitiveTest.executeDataSet(BaseContextSensitiveTest.java:682)
	at org.openmrs.test.BaseContextSensitiveTest.executeDataSet(BaseContextSensitiveTest.java:577)
	at org.openmrs.test.BaseContextSensitiveTest.initializeInMemoryDatabase(BaseContextSensitiveTest.java:489)
	at org.openmrs.test.BaseContextSensitiveTest.baseSetupWithStandardDataAndAuthentication(BaseContextSensitiveTest.java:778)
(33 more lines...)
Collapse Failed ShortPatientFormControllerTest saveShortPatient_shouldSendTheUserBackToTheFormInCaseOfValidationErrors History
< 1 sec
org.dbunit.dataset.NoSuchTableException: person
	at org.dbunit.database.DatabaseDataSet.getTableMetaData(DatabaseDataSet.java:282)
	at org.dbunit.operation.AbstractOperation.getOperationMetaData(AbstractOperation.java:80)
	at org.dbunit.operation.RefreshOperation.execute(RefreshOperation.java:98)
	at org.openmrs.test.BaseContextSensitiveTest.executeDataSet(BaseContextSensitiveTest.java:682)
	at org.openmrs.test.BaseContextSensitiveTest.executeDataSet(BaseContextSensitiveTest.java:577)
	at org.openmrs.test.BaseContextSensitiveTest.initializeInMemoryDatabase(BaseContextSensitiveTest.java:489)
	at org.openmrs.test.BaseContextSensitiveTest.baseSetupWithStandardDataAndAuthentication(BaseContextSensitiveTest.java:778)
(33 more lines...)
Collapse Failed ShortPatientFormControllerTest saveShortPatient_shouldShouldReplaceAnExistingAttributeWithANewOneWhenEdited History
< 1 sec
org.dbunit.dataset.NoSuchTableException: person
	at org.dbunit.database.DatabaseDataSet.getTableMetaData(DatabaseDataSet.java:282)
	at org.dbunit.operation.AbstractOperation.getOperationMetaData(AbstractOperation.java:80)
	at org.dbunit.operation.RefreshOperation.execute(RefreshOperation.java:98)
	at org.openmrs.test.BaseContextSensitiveTest.executeDataSet(BaseContextSensitiveTest.java:682)
	at org.openmrs.test.BaseContextSensitiveTest.executeDataSet(BaseContextSensitiveTest.java:577)
	at org.openmrs.test.BaseContextSensitiveTest.initializeInMemoryDatabase(BaseContextSensitiveTest.java:489)
	at org.openmrs.test.BaseContextSensitiveTest.baseSetupWithStandardDataAndAuthentication(BaseContextSensitiveTest.java:778)
(33 more lines...)
Collapse Failed ShortPatientFormControllerTest saveShortPatient_shouldVoidANameAndReplaceItWithANewOneIfItIsChangedToAUniqueValue History
< 1 sec
org.dbunit.dataset.NoSuchTableException: person
	at org.dbunit.database.DatabaseDataSet.getTableMetaData(DatabaseDataSet.java:282)
	at org.dbunit.operation.AbstractOperation.getOperationMetaData(AbstractOperation.java:80)
	at org.dbunit.operation.RefreshOperation.execute(RefreshOperation.java:98)
	at org.openmrs.test.BaseContextSensitiveTest.executeDataSet(BaseContextSensitiveTest.java:682)
	at org.openmrs.test.BaseContextSensitiveTest.executeDataSet(BaseContextSensitiveTest.java:577)
	at org.openmrs.test.BaseContextSensitiveTest.initializeInMemoryDatabase(BaseContextSensitiveTest.java:489)
	at org.openmrs.test.BaseContextSensitiveTest.baseSetupWithStandardDataAndAuthentication(BaseContextSensitiveTest.java:778)
(33 more lines...)
Collapse Failed ShortPatientFormControllerTest saveShortPatient_shouldVoidAddressIfItWasChanged History
< 1 sec
org.dbunit.dataset.NoSuchTableException: person
	at org.dbunit.database.DatabaseDataSet.getTableMetaData(DatabaseDataSet.java:282)
	at org.dbunit.operation.AbstractOperation.getOperationMetaData(AbstractOperation.java:80)
	at org.dbunit.operation.RefreshOperation.execute(RefreshOperation.java:98)
	at org.openmrs.test.BaseContextSensitiveTest.executeDataSet(BaseContextSensitiveTest.java:682)
	at org.openmrs.test.BaseContextSensitiveTest.executeDataSet(BaseContextSensitiveTest.java:577)
	at org.openmrs.test.BaseContextSensitiveTest.initializeInMemoryDatabase(BaseContextSensitiveTest.java:489)
	at org.openmrs.test.BaseContextSensitiveTest.baseSetupWithStandardDataAndAuthentication(BaseContextSensitiveTest.java:778)
(33 more lines...)
Collapse Failed ShortPatientFormControllerTest saveShortPatient_shouldVoidAnAddressAndReplaceItWithANewOneIfItIsChangedToAUniqueValue History
< 1 sec
org.dbunit.dataset.NoSuchTableException: person
	at org.dbunit.database.DatabaseDataSet.getTableMetaData(DatabaseDataSet.java:282)
	at org.dbunit.operation.AbstractOperation.getOperationMetaData(AbstractOperation.java:80)
	at org.dbunit.operation.RefreshOperation.execute(RefreshOperation.java:98)
	at org.openmrs.test.BaseContextSensitiveTest.executeDataSet(BaseContextSensitiveTest.java:682)
	at org.openmrs.test.BaseContextSensitiveTest.executeDataSet(BaseContextSensitiveTest.java:577)
	at org.openmrs.test.BaseContextSensitiveTest.initializeInMemoryDatabase(BaseContextSensitiveTest.java:489)
	at org.openmrs.test.BaseContextSensitiveTest.baseSetupWithStandardDataAndAuthentication(BaseContextSensitiveTest.java:778)
(33 more lines...)
Collapse Failed ShortPatientFormControllerTest saveShortPatient_shouldVoidAnExistingPersonAttributeWithAnEmptyValue History
< 1 sec
org.dbunit.dataset.NoSuchTableException: person
	at org.dbunit.database.DatabaseDataSet.getTableMetaData(DatabaseDataSet.java:282)
	at org.dbunit.operation.AbstractOperation.getOperationMetaData(AbstractOperation.java:80)
	at org.dbunit.operation.RefreshOperation.execute(RefreshOperation.java:98)
	at org.openmrs.test.BaseContextSensitiveTest.executeDataSet(BaseContextSensitiveTest.java:682)
	at org.openmrs.test.BaseContextSensitiveTest.executeDataSet(BaseContextSensitiveTest.java:577)
	at org.openmrs.test.BaseContextSensitiveTest.initializeInMemoryDatabase(BaseContextSensitiveTest.java:489)
	at org.openmrs.test.BaseContextSensitiveTest.baseSetupWithStandardDataAndAuthentication(BaseContextSensitiveTest.java:778)
(33 more lines...)
Collapse Failed ShortPatientFormValidatorTest validate_shouldFailIfAllIdentifiersHaveBeenVoided History
< 1 sec
org.dbunit.dataset.NoSuchTableException: person
	at org.dbunit.database.DatabaseDataSet.getTableMetaData(DatabaseDataSet.java:282)
	at org.dbunit.operation.AbstractOperation.getOperationMetaData(AbstractOperation.java:80)
	at org.dbunit.operation.RefreshOperation.execute(RefreshOperation.java:98)
	at org.openmrs.test.BaseContextSensitiveTest.executeDataSet(BaseContextSensitiveTest.java:682)
	at org.openmrs.test.BaseContextSensitiveTest.executeDataSet(BaseContextSensitiveTest.java:577)
	at org.openmrs.test.BaseContextSensitiveTest.initializeInMemoryDatabase(BaseContextSensitiveTest.java:489)
	at org.openmrs.test.BaseContextSensitiveTest.baseSetupWithStandardDataAndAuthentication(BaseContextSensitiveTest.java:778)
(33 more lines...)
Collapse Failed ShortPatientFormValidatorTest validate_shouldFailIfAllNameFieldsAreEmptyOrWhiteSpaceCharacters History
< 1 sec
org.dbunit.dataset.NoSuchTableException: person
	at org.dbunit.database.DatabaseDataSet.getTableMetaData(DatabaseDataSet.java:282)
	at org.dbunit.operation.AbstractOperation.getOperationMetaData(AbstractOperation.java:80)
	at org.dbunit.operation.RefreshOperation.execute(RefreshOperation.java:98)
	at org.openmrs.test.BaseContextSensitiveTest.executeDataSet(BaseContextSensitiveTest.java:682)
	at org.openmrs.test.BaseContextSensitiveTest.executeDataSet(BaseContextSensitiveTest.java:577)
	at org.openmrs.test.BaseContextSensitiveTest.initializeInMemoryDatabase(BaseContextSensitiveTest.java:489)
	at org.openmrs.test.BaseContextSensitiveTest.baseSetupWithStandardDataAndAuthentication(BaseContextSensitiveTest.java:778)
(33 more lines...)
Collapse Failed ShortPatientFormValidatorTest validate_shouldFailIfAnyNameHasMoreThan50Characters History
< 1 sec
org.dbunit.dataset.NoSuchTableException: person
	at org.dbunit.database.DatabaseDataSet.getTableMetaData(DatabaseDataSet.java:282)
	at org.dbunit.operation.AbstractOperation.getOperationMetaData(AbstractOperation.java:80)
	at org.dbunit.operation.RefreshOperation.execute(RefreshOperation.java:98)
	at org.openmrs.test.BaseContextSensitiveTest.executeDataSet(BaseContextSensitiveTest.java:682)
	at org.openmrs.test.BaseContextSensitiveTest.executeDataSet(BaseContextSensitiveTest.java:577)
	at org.openmrs.test.BaseContextSensitiveTest.initializeInMemoryDatabase(BaseContextSensitiveTest.java:489)
	at org.openmrs.test.BaseContextSensitiveTest.baseSetupWithStandardDataAndAuthentication(BaseContextSensitiveTest.java:778)
(33 more lines...)
Collapse Failed ShortPatientFormValidatorTest validate_shouldFailIfNoIdentifiersAreAdded History
< 1 sec
org.dbunit.dataset.NoSuchTableException: person
	at org.dbunit.database.DatabaseDataSet.getTableMetaData(DatabaseDataSet.java:282)
	at org.dbunit.operation.AbstractOperation.getOperationMetaData(AbstractOperation.java:80)
	at org.dbunit.operation.RefreshOperation.execute(RefreshOperation.java:98)
	at org.openmrs.test.BaseContextSensitiveTest.executeDataSet(BaseContextSensitiveTest.java:682)
	at org.openmrs.test.BaseContextSensitiveTest.executeDataSet(BaseContextSensitiveTest.java:577)
	at org.openmrs.test.BaseContextSensitiveTest.initializeInMemoryDatabase(BaseContextSensitiveTest.java:489)
	at org.openmrs.test.BaseContextSensitiveTest.baseSetupWithStandardDataAndAuthentication(BaseContextSensitiveTest.java:778)
(33 more lines...)
Collapse Failed ShortPatientFormValidatorTest validate_shouldFailIfTheDeathdateIsBeforeTheBirthdateIncaseThePatientIsDead History
< 1 sec
org.dbunit.dataset.NoSuchTableException: person
	at org.dbunit.database.DatabaseDataSet.getTableMetaData(DatabaseDataSet.java:282)
	at org.dbunit.operation.AbstractOperation.getOperationMetaData(AbstractOperation.java:80)
	at org.dbunit.operation.RefreshOperation.execute(RefreshOperation.java:98)
	at org.openmrs.test.BaseContextSensitiveTest.executeDataSet(BaseContextSensitiveTest.java:682)
	at org.openmrs.test.BaseContextSensitiveTest.executeDataSet(BaseContextSensitiveTest.java:577)
	at org.openmrs.test.BaseContextSensitiveTest.initializeInMemoryDatabase(BaseContextSensitiveTest.java:489)
	at org.openmrs.test.BaseContextSensitiveTest.baseSetupWithStandardDataAndAuthentication(BaseContextSensitiveTest.java:778)
(33 more lines...)
Collapse Failed ShortPatientFormValidatorTest validate_shouldFailValidationIfBirthdateIsAFutureDate History
< 1 sec
org.dbunit.dataset.NoSuchTableException: person
	at org.dbunit.database.DatabaseDataSet.getTableMetaData(DatabaseDataSet.java:282)
	at org.dbunit.operation.AbstractOperation.getOperationMetaData(AbstractOperation.java:80)
	at org.dbunit.operation.RefreshOperation.execute(RefreshOperation.java:98)
	at org.openmrs.test.BaseContextSensitiveTest.executeDataSet(BaseContextSensitiveTest.java:682)
	at org.openmrs.test.BaseContextSensitiveTest.executeDataSet(BaseContextSensitiveTest.java:577)
	at org.openmrs.test.BaseContextSensitiveTest.initializeInMemoryDatabase(BaseContextSensitiveTest.java:489)
	at org.openmrs.test.BaseContextSensitiveTest.baseSetupWithStandardDataAndAuthentication(BaseContextSensitiveTest.java:778)
(33 more lines...)
Collapse Failed ShortPatientFormValidatorTest validate_shouldFailValidationIfBirthdateIsBlank History
< 1 sec
org.dbunit.dataset.NoSuchTableException: person
	at org.dbunit.database.DatabaseDataSet.getTableMetaData(DatabaseDataSet.java:282)
	at org.dbunit.operation.AbstractOperation.getOperationMetaData(AbstractOperation.java:80)
	at org.dbunit.operation.RefreshOperation.execute(RefreshOperation.java:98)
	at org.openmrs.test.BaseContextSensitiveTest.executeDataSet(BaseContextSensitiveTest.java:682)
	at org.openmrs.test.BaseContextSensitiveTest.executeDataSet(BaseContextSensitiveTest.java:577)
	at org.openmrs.test.BaseContextSensitiveTest.initializeInMemoryDatabase(BaseContextSensitiveTest.java:489)
	at org.openmrs.test.BaseContextSensitiveTest.baseSetupWithStandardDataAndAuthentication(BaseContextSensitiveTest.java:778)
(33 more lines...)
Collapse Failed ShortPatientFormValidatorTest validate_shouldFailValidationIfBirthdateMakesPatient120YearsOldOrOlder History
< 1 sec
org.dbunit.dataset.NoSuchTableException: person
	at org.dbunit.database.DatabaseDataSet.getTableMetaData(DatabaseDataSet.java:282)
	at org.dbunit.operation.AbstractOperation.getOperationMetaData(AbstractOperation.java:80)
	at org.dbunit.operation.RefreshOperation.execute(RefreshOperation.java:98)
	at org.openmrs.test.BaseContextSensitiveTest.executeDataSet(BaseContextSensitiveTest.java:682)
	at org.openmrs.test.BaseContextSensitiveTest.executeDataSet(BaseContextSensitiveTest.java:577)
	at org.openmrs.test.BaseContextSensitiveTest.initializeInMemoryDatabase(BaseContextSensitiveTest.java:489)
	at org.openmrs.test.BaseContextSensitiveTest.baseSetupWithStandardDataAndAuthentication(BaseContextSensitiveTest.java:778)
(33 more lines...)
Collapse Failed ShortPatientFormValidatorTest validate_shouldFailValidationIfCauseOfDeathIsBlankWhenPatientIsDead History
< 1 sec
org.dbunit.dataset.NoSuchTableException: person
	at org.dbunit.database.DatabaseDataSet.getTableMetaData(DatabaseDataSet.java:282)
	at org.dbunit.operation.AbstractOperation.getOperationMetaData(AbstractOperation.java:80)
	at org.dbunit.operation.RefreshOperation.execute(RefreshOperation.java:98)
	at org.openmrs.test.BaseContextSensitiveTest.executeDataSet(BaseContextSensitiveTest.java:682)
	at org.openmrs.test.BaseContextSensitiveTest.executeDataSet(BaseContextSensitiveTest.java:577)
	at org.openmrs.test.BaseContextSensitiveTest.initializeInMemoryDatabase(BaseContextSensitiveTest.java:489)
	at org.openmrs.test.BaseContextSensitiveTest.baseSetupWithStandardDataAndAuthentication(BaseContextSensitiveTest.java:778)
(33 more lines...)
Collapse Failed ShortPatientFormValidatorTest validate_shouldFailValidationIfDeathdateIsAFutureDate History
< 1 sec
org.dbunit.dataset.NoSuchTableException: person
	at org.dbunit.database.DatabaseDataSet.getTableMetaData(DatabaseDataSet.java:282)
	at org.dbunit.operation.AbstractOperation.getOperationMetaData(AbstractOperation.java:80)
	at org.dbunit.operation.RefreshOperation.execute(RefreshOperation.java:98)
	at org.openmrs.test.BaseContextSensitiveTest.executeDataSet(BaseContextSensitiveTest.java:682)
	at org.openmrs.test.BaseContextSensitiveTest.executeDataSet(BaseContextSensitiveTest.java:577)
	at org.openmrs.test.BaseContextSensitiveTest.initializeInMemoryDatabase(BaseContextSensitiveTest.java:489)
	at org.openmrs.test.BaseContextSensitiveTest.baseSetupWithStandardDataAndAuthentication(BaseContextSensitiveTest.java:778)
(33 more lines...)
Collapse Failed ShortPatientFormValidatorTest validate_shouldFailValidationIfGenderIsBlank History
< 1 sec
org.dbunit.dataset.NoSuchTableException: person
	at org.dbunit.database.DatabaseDataSet.getTableMetaData(DatabaseDataSet.java:282)
	at org.dbunit.operation.AbstractOperation.getOperationMetaData(AbstractOperation.java:80)
	at org.dbunit.operation.RefreshOperation.execute(RefreshOperation.java:98)
	at org.openmrs.test.BaseContextSensitiveTest.executeDataSet(BaseContextSensitiveTest.java:682)
	at org.openmrs.test.BaseContextSensitiveTest.executeDataSet(BaseContextSensitiveTest.java:577)
	at org.openmrs.test.BaseContextSensitiveTest.initializeInMemoryDatabase(BaseContextSensitiveTest.java:489)
	at org.openmrs.test.BaseContextSensitiveTest.baseSetupWithStandardDataAndAuthentication(BaseContextSensitiveTest.java:778)
(33 more lines...)
Collapse Failed ShortPatientFormValidatorTest validate_shouldPassIfTheMinimumRequiredFieldsAreProvidedAndAreValid History
< 1 sec
org.dbunit.dataset.NoSuchTableException: person
	at org.dbunit.database.DatabaseDataSet.getTableMetaData(DatabaseDataSet.java:282)
	at org.dbunit.operation.AbstractOperation.getOperationMetaData(AbstractOperation.java:80)
	at org.dbunit.operation.RefreshOperation.execute(RefreshOperation.java:98)
	at org.openmrs.test.BaseContextSensitiveTest.executeDataSet(BaseContextSensitiveTest.java:682)
	at org.openmrs.test.BaseContextSensitiveTest.executeDataSet(BaseContextSensitiveTest.java:577)
	at org.openmrs.test.BaseContextSensitiveTest.initializeInMemoryDatabase(BaseContextSensitiveTest.java:489)
	at org.openmrs.test.BaseContextSensitiveTest.baseSetupWithStandardDataAndAuthentication(BaseContextSensitiveTest.java:778)
(33 more lines...)
Collapse Failed ShortPatientFormValidatorTest validate_shouldRejectADuplicateAddress History
< 1 sec
org.dbunit.dataset.NoSuchTableException: person
	at org.dbunit.database.DatabaseDataSet.getTableMetaData(DatabaseDataSet.java:282)
	at org.dbunit.operation.AbstractOperation.getOperationMetaData(AbstractOperation.java:80)
	at org.dbunit.operation.RefreshOperation.execute(RefreshOperation.java:98)
	at org.openmrs.test.BaseContextSensitiveTest.executeDataSet(BaseContextSensitiveTest.java:682)
	at org.openmrs.test.BaseContextSensitiveTest.executeDataSet(BaseContextSensitiveTest.java:577)
	at org.openmrs.test.BaseContextSensitiveTest.initializeInMemoryDatabase(BaseContextSensitiveTest.java:489)
	at org.openmrs.test.BaseContextSensitiveTest.baseSetupWithStandardDataAndAuthentication(BaseContextSensitiveTest.java:778)
(33 more lines...)
Collapse Failed ShortPatientFormValidatorTest validate_shouldRejectADuplicateName History
< 1 sec
org.dbunit.dataset.NoSuchTableException: person
	at org.dbunit.database.DatabaseDataSet.getTableMetaData(DatabaseDataSet.java:282)
	at org.dbunit.operation.AbstractOperation.getOperationMetaData(AbstractOperation.java:80)
	at org.dbunit.operation.RefreshOperation.execute(RefreshOperation.java:98)
	at org.openmrs.test.BaseContextSensitiveTest.executeDataSet(BaseContextSensitiveTest.java:682)
	at org.openmrs.test.BaseContextSensitiveTest.executeDataSet(BaseContextSensitiveTest.java:577)
	at org.openmrs.test.BaseContextSensitiveTest.initializeInMemoryDatabase(BaseContextSensitiveTest.java:489)
	at org.openmrs.test.BaseContextSensitiveTest.baseSetupWithStandardDataAndAuthentication(BaseContextSensitiveTest.java:778)
(33 more lines...)
Collapse Failed AddPersonControllerTest formBackingObject_shouldCatchAnInvalidBirthdate History
1 sec
org.dbunit.dataset.NoSuchTableException: person
	at org.dbunit.database.DatabaseDataSet.getTableMetaData(DatabaseDataSet.java:282)
	at org.dbunit.operation.AbstractOperation.getOperationMetaData(AbstractOperation.java:80)
	at org.dbunit.operation.RefreshOperation.execute(RefreshOperation.java:98)
	at org.openmrs.test.BaseContextSensitiveTest.executeDataSet(BaseContextSensitiveTest.java:682)
	at org.openmrs.test.BaseContextSensitiveTest.executeDataSet(BaseContextSensitiveTest.java:577)
	at org.openmrs.test.BaseContextSensitiveTest.initializeInMemoryDatabase(BaseContextSensitiveTest.java:489)
	at org.openmrs.test.BaseContextSensitiveTest.baseSetupWithStandardDataAndAuthentication(BaseContextSensitiveTest.java:778)
(33 more lines...)
Collapse Failed AddPersonControllerTest formBackingObject_shouldCatchPassForAValidBirthdate History
< 1 sec
org.dbunit.dataset.NoSuchTableException: person
	at org.dbunit.database.DatabaseDataSet.getTableMetaData(DatabaseDataSet.java:282)
	at org.dbunit.operation.AbstractOperation.getOperationMetaData(AbstractOperation.java:80)
	at org.dbunit.operation.RefreshOperation.execute(RefreshOperation.java:98)
	at org.openmrs.test.BaseContextSensitiveTest.executeDataSet(BaseContextSensitiveTest.java:682)
	at org.openmrs.test.BaseContextSensitiveTest.executeDataSet(BaseContextSensitiveTest.java:577)
	at org.openmrs.test.BaseContextSensitiveTest.initializeInMemoryDatabase(BaseContextSensitiveTest.java:489)
	at org.openmrs.test.BaseContextSensitiveTest.baseSetupWithStandardDataAndAuthentication(BaseContextSensitiveTest.java:778)
(33 more lines...)
Collapse Failed PersonAttributeTypeListControllerTest displayPage_shouldNotFailIfNotAuthenticated History
< 1 sec
org.dbunit.dataset.NoSuchTableException: person
	at org.dbunit.database.DatabaseDataSet.getTableMetaData(DatabaseDataSet.java:282)
	at org.dbunit.operation.AbstractOperation.getOperationMetaData(AbstractOperation.java:80)
	at org.dbunit.operation.RefreshOperation.execute(RefreshOperation.java:98)
	at org.openmrs.test.BaseContextSensitiveTest.executeDataSet(BaseContextSensitiveTest.java:682)
	at org.openmrs.test.BaseContextSensitiveTest.executeDataSet(BaseContextSensitiveTest.java:577)
	at org.openmrs.test.BaseContextSensitiveTest.initializeInMemoryDatabase(BaseContextSensitiveTest.java:489)
	at org.openmrs.test.BaseContextSensitiveTest.baseSetupWithStandardDataAndAuthentication(BaseContextSensitiveTest.java:778)
(33 more lines...)
Collapse Failed PersonAttributeTypeListControllerTest displayPage_shouldPutAllAttributeTypesIntoMap History
< 1 sec
org.dbunit.dataset.NoSuchTableException: person
	at org.dbunit.database.DatabaseDataSet.getTableMetaData(DatabaseDataSet.java:282)
	at org.dbunit.operation.AbstractOperation.getOperationMetaData(AbstractOperation.java:80)
	at org.dbunit.operation.RefreshOperation.execute(RefreshOperation.java:98)
	at org.openmrs.test.BaseContextSensitiveTest.executeDataSet(BaseContextSensitiveTest.java:682)
	at org.openmrs.test.BaseContextSensitiveTest.executeDataSet(BaseContextSensitiveTest.java:577)
	at org.openmrs.test.BaseContextSensitiveTest.initializeInMemoryDatabase(BaseContextSensitiveTest.java:489)
	at org.openmrs.test.BaseContextSensitiveTest.baseSetupWithStandardDataAndAuthentication(BaseContextSensitiveTest.java:778)
(33 more lines...)
Collapse Failed PersonAttributeTypeListControllerTest moveDown_shouldMoveSelectedIdsDownInTheList History
< 1 sec
org.dbunit.dataset.NoSuchTableException: person
	at org.dbunit.database.DatabaseDataSet.getTableMetaData(DatabaseDataSet.java:282)
	at org.dbunit.operation.AbstractOperation.getOperationMetaData(AbstractOperation.java:80)
	at org.dbunit.operation.RefreshOperation.execute(RefreshOperation.java:98)
	at org.openmrs.test.BaseContextSensitiveTest.executeDataSet(BaseContextSensitiveTest.java:682)
	at org.openmrs.test.BaseContextSensitiveTest.executeDataSet(BaseContextSensitiveTest.java:577)
	at org.openmrs.test.BaseContextSensitiveTest.initializeInMemoryDatabase(BaseContextSensitiveTest.java:489)
	at org.openmrs.test.BaseContextSensitiveTest.baseSetupWithStandardDataAndAuthentication(BaseContextSensitiveTest.java:778)
(33 more lines...)
Collapse Failed PersonAttributeTypeListControllerTest moveDown_shouldNotFailIfGivenLastId History
< 1 sec
org.dbunit.dataset.NoSuchTableException: person
	at org.dbunit.database.DatabaseDataSet.getTableMetaData(DatabaseDataSet.java:282)
	at org.dbunit.operation.AbstractOperation.getOperationMetaData(AbstractOperation.java:80)
	at org.dbunit.operation.RefreshOperation.execute(RefreshOperation.java:98)
	at org.openmrs.test.BaseContextSensitiveTest.executeDataSet(BaseContextSensitiveTest.java:682)
	at org.openmrs.test.BaseContextSensitiveTest.executeDataSet(BaseContextSensitiveTest.java:577)
	at org.openmrs.test.BaseContextSensitiveTest.initializeInMemoryDatabase(BaseContextSensitiveTest.java:489)
	at org.openmrs.test.BaseContextSensitiveTest.baseSetupWithStandardDataAndAuthentication(BaseContextSensitiveTest.java:778)
(33 more lines...)
Collapse Failed PersonAttributeTypeListControllerTest moveDown_shouldNotFailIfNotGivenAnyIds History
< 1 sec
org.dbunit.dataset.NoSuchTableException: person
	at org.dbunit.database.DatabaseDataSet.getTableMetaData(DatabaseDataSet.java:282)
	at org.dbunit.operation.AbstractOperation.getOperationMetaData(AbstractOperation.java:80)
	at org.dbunit.operation.RefreshOperation.execute(RefreshOperation.java:98)
	at org.openmrs.test.BaseContextSensitiveTest.executeDataSet(BaseContextSensitiveTest.java:682)
	at org.openmrs.test.BaseContextSensitiveTest.executeDataSet(BaseContextSensitiveTest.java:577)
	at org.openmrs.test.BaseContextSensitiveTest.initializeInMemoryDatabase(BaseContextSensitiveTest.java:489)
	at org.openmrs.test.BaseContextSensitiveTest.baseSetupWithStandardDataAndAuthentication(BaseContextSensitiveTest.java:778)
(33 more lines...)
Collapse Failed PersonAttributeTypeListControllerTest moveUp_shouldMoveSelectedIdsUpOneInTheList History
< 1 sec
org.dbunit.dataset.NoSuchTableException: person
	at org.dbunit.database.DatabaseDataSet.getTableMetaData(DatabaseDataSet.java:282)
	at org.dbunit.operation.AbstractOperation.getOperationMetaData(AbstractOperation.java:80)
	at org.dbunit.operation.RefreshOperation.execute(RefreshOperation.java:98)
	at org.openmrs.test.BaseContextSensitiveTest.executeDataSet(BaseContextSensitiveTest.java:682)
	at org.openmrs.test.BaseContextSensitiveTest.executeDataSet(BaseContextSensitiveTest.java:577)
	at org.openmrs.test.BaseContextSensitiveTest.initializeInMemoryDatabase(BaseContextSensitiveTest.java:489)
	at org.openmrs.test.BaseContextSensitiveTest.baseSetupWithStandardDataAndAuthentication(BaseContextSensitiveTest.java:778)
(33 more lines...)
Collapse Failed PersonAttributeTypeListControllerTest moveUp_shouldNotFailIfGivenFirstId History
< 1 sec
org.dbunit.dataset.NoSuchTableException: person
	at org.dbunit.database.DatabaseDataSet.getTableMetaData(DatabaseDataSet.java:282)
	at org.dbunit.operation.AbstractOperation.getOperationMetaData(AbstractOperation.java:80)
	at org.dbunit.operation.RefreshOperation.execute(RefreshOperation.java:98)
	at org.openmrs.test.BaseContextSensitiveTest.executeDataSet(BaseContextSensitiveTest.java:682)
	at org.openmrs.test.BaseContextSensitiveTest.executeDataSet(BaseContextSensitiveTest.java:577)
	at org.openmrs.test.BaseContextSensitiveTest.initializeInMemoryDatabase(BaseContextSensitiveTest.java:489)
	at org.openmrs.test.BaseContextSensitiveTest.baseSetupWithStandardDataAndAuthentication(BaseContextSensitiveTest.java:778)
(33 more lines...)
Collapse Failed PersonAttributeTypeListControllerTest moveUp_shouldNotFailIfNotGivenAnyIds History
< 1 sec
org.dbunit.dataset.NoSuchTableException: person
	at org.dbunit.database.DatabaseDataSet.getTableMetaData(DatabaseDataSet.java:282)
	at org.dbunit.operation.AbstractOperation.getOperationMetaData(AbstractOperation.java:80)
	at org.dbunit.operation.RefreshOperation.execute(RefreshOperation.java:98)
	at org.openmrs.test.BaseContextSensitiveTest.executeDataSet(BaseContextSensitiveTest.java:682)
	at org.openmrs.test.BaseContextSensitiveTest.executeDataSet(BaseContextSensitiveTest.java:577)
	at org.openmrs.test.BaseContextSensitiveTest.initializeInMemoryDatabase(BaseContextSensitiveTest.java:489)
	at org.openmrs.test.BaseContextSensitiveTest.baseSetupWithStandardDataAndAuthentication(BaseContextSensitiveTest.java:778)
(33 more lines...)
Collapse Failed PersonAttributeTypeListControllerTest updateGlobalProperties_shouldSaveGivenPersonListingAttributeTypes History
< 1 sec
org.dbunit.dataset.NoSuchTableException: person
	at org.dbunit.database.DatabaseDataSet.getTableMetaData(DatabaseDataSet.java:282)
	at org.dbunit.operation.AbstractOperation.getOperationMetaData(AbstractOperation.java:80)
	at org.dbunit.operation.RefreshOperation.execute(RefreshOperation.java:98)
	at org.openmrs.test.BaseContextSensitiveTest.executeDataSet(BaseContextSensitiveTest.java:682)
	at org.openmrs.test.BaseContextSensitiveTest.executeDataSet(BaseContextSensitiveTest.java:577)
	at org.openmrs.test.BaseContextSensitiveTest.initializeInMemoryDatabase(BaseContextSensitiveTest.java:489)
	at org.openmrs.test.BaseContextSensitiveTest.baseSetupWithStandardDataAndAuthentication(BaseContextSensitiveTest.java:778)
(33 more lines...)
Collapse Failed ProgramFormControllerTest onSubmit_shouldSaveWorkflowsWithProgram History
< 1 sec
org.dbunit.dataset.NoSuchTableException: person
	at org.dbunit.database.DatabaseDataSet.getTableMetaData(DatabaseDataSet.java:282)
	at org.dbunit.operation.AbstractOperation.getOperationMetaData(AbstractOperation.java:80)
	at org.dbunit.operation.RefreshOperation.execute(RefreshOperation.java:98)
	at org.openmrs.test.BaseContextSensitiveTest.executeDataSet(BaseContextSensitiveTest.java:682)
	at org.openmrs.test.BaseContextSensitiveTest.executeDataSet(BaseContextSensitiveTest.java:577)
	at org.openmrs.test.BaseContextSensitiveTest.initializeInMemoryDatabase(BaseContextSensitiveTest.java:489)
	at org.openmrs.test.BaseContextSensitiveTest.baseSetupWithStandardDataAndAuthentication(BaseContextSensitiveTest.java:778)
(33 more lines...)
Collapse Failed ProviderFormControllerTest onSubmit_shouldNotVoidOrChangeAttributeListIfTheAttributeValuesAreSame History
< 1 sec
org.dbunit.dataset.NoSuchTableException: person
	at org.dbunit.database.DatabaseDataSet.getTableMetaData(DatabaseDataSet.java:282)
	at org.dbunit.operation.AbstractOperation.getOperationMetaData(AbstractOperation.java:80)
	at org.dbunit.operation.RefreshOperation.execute(RefreshOperation.java:98)
	at org.openmrs.test.BaseContextSensitiveTest.executeDataSet(BaseContextSensitiveTest.java:682)
	at org.openmrs.test.BaseContextSensitiveTest.executeDataSet(BaseContextSensitiveTest.java:577)
	at org.openmrs.test.BaseContextSensitiveTest.initializeInMemoryDatabase(BaseContextSensitiveTest.java:489)
	at org.openmrs.test.BaseContextSensitiveTest.baseSetupWithStandardDataAndAuthentication(BaseContextSensitiveTest.java:778)
(33 more lines...)
Collapse Failed ProviderFormControllerTest onSubmit_shouldSetAttributesToVoidIfTheValueIsNotSet History
< 1 sec
org.dbunit.dataset.NoSuchTableException: person
	at org.dbunit.database.DatabaseDataSet.getTableMetaData(DatabaseDataSet.java:282)
	at org.dbunit.operation.AbstractOperation.getOperationMetaData(AbstractOperation.java:80)
	at org.dbunit.operation.RefreshOperation.execute(RefreshOperation.java:98)
	at org.openmrs.test.BaseContextSensitiveTest.executeDataSet(BaseContextSensitiveTest.java:682)
	at org.openmrs.test.BaseContextSensitiveTest.executeDataSet(BaseContextSensitiveTest.java:577)
	at org.openmrs.test.BaseContextSensitiveTest.initializeInMemoryDatabase(BaseContextSensitiveTest.java:489)
	at org.openmrs.test.BaseContextSensitiveTest.baseSetupWithStandardDataAndAuthentication(BaseContextSensitiveTest.java:778)
(33 more lines...)
Collapse Failed ChangePasswordFormControllerTest formBackingObject_shouldRemainOnChangePasswordFormPageIfThereAreErrors History
< 1 sec
org.dbunit.dataset.NoSuchTableException: person
	at org.dbunit.database.DatabaseDataSet.getTableMetaData(DatabaseDataSet.java:282)
	at org.dbunit.operation.AbstractOperation.getOperationMetaData(AbstractOperation.java:80)
	at org.dbunit.operation.RefreshOperation.execute(RefreshOperation.java:98)
	at org.openmrs.test.BaseContextSensitiveTest.executeDataSet(BaseContextSensitiveTest.java:682)
	at org.openmrs.test.BaseContextSensitiveTest.executeDataSet(BaseContextSensitiveTest.java:577)
	at org.openmrs.test.BaseContextSensitiveTest.initializeInMemoryDatabase(BaseContextSensitiveTest.java:489)
	at org.openmrs.test.BaseContextSensitiveTest.baseSetupWithStandardDataAndAuthentication(BaseContextSensitiveTest.java:778)
(33 more lines...)
Collapse Failed ChangePasswordFormControllerTest formBackingObject_shouldReturnAuthenticatedUser History
< 1 sec
org.dbunit.dataset.NoSuchTableException: person
	at org.dbunit.database.DatabaseDataSet.getTableMetaData(DatabaseDataSet.java:282)
	at org.dbunit.operation.AbstractOperation.getOperationMetaData(AbstractOperation.java:80)
	at org.dbunit.operation.RefreshOperation.execute(RefreshOperation.java:98)
	at org.openmrs.test.BaseContextSensitiveTest.executeDataSet(BaseContextSensitiveTest.java:682)
	at org.openmrs.test.BaseContextSensitiveTest.executeDataSet(BaseContextSensitiveTest.java:577)
	at org.openmrs.test.BaseContextSensitiveTest.initializeInMemoryDatabase(BaseContextSensitiveTest.java:489)
	at org.openmrs.test.BaseContextSensitiveTest.baseSetupWithStandardDataAndAuthentication(BaseContextSensitiveTest.java:778)
(33 more lines...)
Collapse Failed ChangePasswordFormControllerTest handleSubmission_shouldChangeTheUserPropertyForcePasswordChangeToFalse History
< 1 sec
org.dbunit.dataset.NoSuchTableException: person
	at org.dbunit.database.DatabaseDataSet.getTableMetaData(DatabaseDataSet.java:282)
	at org.dbunit.operation.AbstractOperation.getOperationMetaData(AbstractOperation.java:80)
	at org.dbunit.operation.RefreshOperation.execute(RefreshOperation.java:98)
	at org.openmrs.test.BaseContextSensitiveTest.executeDataSet(BaseContextSensitiveTest.java:682)
	at org.openmrs.test.BaseContextSensitiveTest.executeDataSet(BaseContextSensitiveTest.java:577)
	at org.openmrs.test.BaseContextSensitiveTest.initializeInMemoryDatabase(BaseContextSensitiveTest.java:489)
	at org.openmrs.test.BaseContextSensitiveTest.baseSetupWithStandardDataAndAuthentication(BaseContextSensitiveTest.java:778)
(33 more lines...)
Collapse Failed ChangePasswordFormControllerTest handleSubmission_shouldDiplayErrorMessageIfAnswerAndConfirmAnswerAreNotTheSame History
< 1 sec
org.dbunit.dataset.NoSuchTableException: person
	at org.dbunit.database.DatabaseDataSet.getTableMetaData(DatabaseDataSet.java:282)
	at org.dbunit.operation.AbstractOperation.getOperationMetaData(AbstractOperation.java:80)
	at org.dbunit.operation.RefreshOperation.execute(RefreshOperation.java:98)
	at org.openmrs.test.BaseContextSensitiveTest.executeDataSet(BaseContextSensitiveTest.java:682)
	at org.openmrs.test.BaseContextSensitiveTest.executeDataSet(BaseContextSensitiveTest.java:577)
	at org.openmrs.test.BaseContextSensitiveTest.initializeInMemoryDatabase(BaseContextSensitiveTest.java:489)
	at org.openmrs.test.BaseContextSensitiveTest.baseSetupWithStandardDataAndAuthentication(BaseContextSensitiveTest.java:778)
(33 more lines...)
Collapse Failed ChangePasswordFormControllerTest handleSubmission_shouldDiplayErrorMessageIfQuestionIsEmptyAndAnswerIsNotEmpty History
2 secs
org.dbunit.dataset.NoSuchTableException: person
	at org.dbunit.database.DatabaseDataSet.getTableMetaData(DatabaseDataSet.java:282)
	at org.dbunit.operation.AbstractOperation.getOperationMetaData(AbstractOperation.java:80)
	at org.dbunit.operation.RefreshOperation.execute(RefreshOperation.java:98)
	at org.openmrs.test.BaseContextSensitiveTest.executeDataSet(BaseContextSensitiveTest.java:682)
	at org.openmrs.test.BaseContextSensitiveTest.executeDataSet(BaseContextSensitiveTest.java:577)
	at org.openmrs.test.BaseContextSensitiveTest.initializeInMemoryDatabase(BaseContextSensitiveTest.java:489)
	at org.openmrs.test.BaseContextSensitiveTest.baseSetupWithStandardDataAndAuthentication(BaseContextSensitiveTest.java:778)
(33 more lines...)
Collapse Failed ChangePasswordFormControllerTest handleSubmission_shouldDiplayErrorMessageOnWeakPasswords History
< 1 sec
org.dbunit.dataset.NoSuchTableException: person
	at org.dbunit.database.DatabaseDataSet.getTableMetaData(DatabaseDataSet.java:282)
	at org.dbunit.operation.AbstractOperation.getOperationMetaData(AbstractOperation.java:80)
	at org.dbunit.operation.RefreshOperation.execute(RefreshOperation.java:98)
	at org.openmrs.test.BaseContextSensitiveTest.executeDataSet(BaseContextSensitiveTest.java:682)
	at org.openmrs.test.BaseContextSensitiveTest.executeDataSet(BaseContextSensitiveTest.java:577)
	at org.openmrs.test.BaseContextSensitiveTest.initializeInMemoryDatabase(BaseContextSensitiveTest.java:489)
	at org.openmrs.test.BaseContextSensitiveTest.baseSetupWithStandardDataAndAuthentication(BaseContextSensitiveTest.java:778)
(33 more lines...)
Collapse Failed ChangePasswordFormControllerTest handleSubmission_shouldDisplayErrorMessageIfQuestionIsNotEmptyAndAnswerIsEmpty History
2 secs
org.dbunit.dataset.NoSuchTableException: person
	at org.dbunit.database.DatabaseDataSet.getTableMetaData(DatabaseDataSet.java:282)
	at org.dbunit.operation.AbstractOperation.getOperationMetaData(AbstractOperation.java:80)
	at org.dbunit.operation.RefreshOperation.execute(RefreshOperation.java:98)
	at org.openmrs.test.BaseContextSensitiveTest.executeDataSet(BaseContextSensitiveTest.java:682)
	at org.openmrs.test.BaseContextSensitiveTest.executeDataSet(BaseContextSensitiveTest.java:577)
	at org.openmrs.test.BaseContextSensitiveTest.initializeInMemoryDatabase(BaseContextSensitiveTest.java:489)
	at org.openmrs.test.BaseContextSensitiveTest.baseSetupWithStandardDataAndAuthentication(BaseContextSensitiveTest.java:778)
(33 more lines...)
Collapse Failed ChangePasswordFormControllerTest handleSubmission_shouldDisplayErrorMessageWhenPasswordAndConfirmPasswordAreNotSame History
< 1 sec
org.dbunit.dataset.NoSuchTableException: person
	at org.dbunit.database.DatabaseDataSet.getTableMetaData(DatabaseDataSet.java:282)
	at org.dbunit.operation.AbstractOperation.getOperationMetaData(AbstractOperation.java:80)
	at org.dbunit.operation.RefreshOperation.execute(RefreshOperation.java:98)
	at org.openmrs.test.BaseContextSensitiveTest.executeDataSet(BaseContextSensitiveTest.java:682)
	at org.openmrs.test.BaseContextSensitiveTest.executeDataSet(BaseContextSensitiveTest.java:577)
	at org.openmrs.test.BaseContextSensitiveTest.initializeInMemoryDatabase(BaseContextSensitiveTest.java:489)
	at org.openmrs.test.BaseContextSensitiveTest.baseSetupWithStandardDataAndAuthentication(BaseContextSensitiveTest.java:778)
(33 more lines...)
Collapse Failed ChangePasswordFormControllerTest handleSubmission_shouldDisplayErrorMessageWhenPasswordIsEmpty History
< 1 sec
org.dbunit.dataset.NoSuchTableException: person
	at org.dbunit.database.DatabaseDataSet.getTableMetaData(DatabaseDataSet.java:282)
	at org.dbunit.operation.AbstractOperation.getOperationMetaData(AbstractOperation.java:80)
	at org.dbunit.operation.RefreshOperation.execute(RefreshOperation.java:98)
	at org.openmrs.test.BaseContextSensitiveTest.executeDataSet(BaseContextSensitiveTest.java:682)
	at org.openmrs.test.BaseContextSensitiveTest.executeDataSet(BaseContextSensitiveTest.java:577)
	at org.openmrs.test.BaseContextSensitiveTest.initializeInMemoryDatabase(BaseContextSensitiveTest.java:489)
	at org.openmrs.test.BaseContextSensitiveTest.baseSetupWithStandardDataAndAuthentication(BaseContextSensitiveTest.java:778)
(33 more lines...)
Collapse Failed ChangePasswordFormControllerTest handleSubmission_shouldNotChangeTheUserPropertyForcePasswordChangeToFalse History
< 1 sec
org.dbunit.dataset.NoSuchTableException: person
	at org.dbunit.database.DatabaseDataSet.getTableMetaData(DatabaseDataSet.java:282)
	at org.dbunit.operation.AbstractOperation.getOperationMetaData(AbstractOperation.java:80)
	at org.dbunit.operation.RefreshOperation.execute(RefreshOperation.java:98)
	at org.openmrs.test.BaseContextSensitiveTest.executeDataSet(BaseContextSensitiveTest.java:682)
	at org.openmrs.test.BaseContextSensitiveTest.executeDataSet(BaseContextSensitiveTest.java:577)
	at org.openmrs.test.BaseContextSensitiveTest.initializeInMemoryDatabase(BaseContextSensitiveTest.java:489)
	at org.openmrs.test.BaseContextSensitiveTest.baseSetupWithStandardDataAndAuthentication(BaseContextSensitiveTest.java:778)
(33 more lines...)
Collapse Failed ChangePasswordFormControllerTest handleSubmission_shouldProceedToHomePageIfOperationIsSuccesful History
< 1 sec
org.dbunit.dataset.NoSuchTableException: person
	at org.dbunit.database.DatabaseDataSet.getTableMetaData(DatabaseDataSet.java:282)
	at org.dbunit.operation.AbstractOperation.getOperationMetaData(AbstractOperation.java:80)
	at org.dbunit.operation.RefreshOperation.execute(RefreshOperation.java:98)
	at org.openmrs.test.BaseContextSensitiveTest.executeDataSet(BaseContextSensitiveTest.java:682)
	at org.openmrs.test.BaseContextSensitiveTest.executeDataSet(BaseContextSensitiveTest.java:577)
	at org.openmrs.test.BaseContextSensitiveTest.initializeInMemoryDatabase(BaseContextSensitiveTest.java:489)
	at org.openmrs.test.BaseContextSensitiveTest.baseSetupWithStandardDataAndAuthentication(BaseContextSensitiveTest.java:778)
(33 more lines...)
Collapse Failed ChangePasswordFormControllerTest handleSubmission_shouldRedirectToIndexPageWhenPasswordAndConfirmPasswordAreTheSame History
< 1 sec
org.dbunit.dataset.NoSuchTableException: person
	at org.dbunit.database.DatabaseDataSet.getTableMetaData(DatabaseDataSet.java:282)
	at org.dbunit.operation.AbstractOperation.getOperationMetaData(AbstractOperation.java:80)
	at org.dbunit.operation.RefreshOperation.execute(RefreshOperation.java:98)
	at org.openmrs.test.BaseContextSensitiveTest.executeDataSet(BaseContextSensitiveTest.java:682)
	at org.openmrs.test.BaseContextSensitiveTest.executeDataSet(BaseContextSensitiveTest.java:577)
	at org.openmrs.test.BaseContextSensitiveTest.initializeInMemoryDatabase(BaseContextSensitiveTest.java:489)
	at org.openmrs.test.BaseContextSensitiveTest.baseSetupWithStandardDataAndAuthentication(BaseContextSensitiveTest.java:778)
(33 more lines...)
Collapse Failed ChangePasswordFormControllerTest handleSubmission_shouldSetTheUserSecretQuestionAndAnswer History
< 1 sec
org.dbunit.dataset.NoSuchTableException: person
	at org.dbunit.database.DatabaseDataSet.getTableMetaData(DatabaseDataSet.java:282)
	at org.dbunit.operation.AbstractOperation.getOperationMetaData(AbstractOperation.java:80)
	at org.dbunit.operation.RefreshOperation.execute(RefreshOperation.java:98)
	at org.openmrs.test.BaseContextSensitiveTest.executeDataSet(BaseContextSensitiveTest.java:682)
	at org.openmrs.test.BaseContextSensitiveTest.executeDataSet(BaseContextSensitiveTest.java:577)
	at org.openmrs.test.BaseContextSensitiveTest.initializeInMemoryDatabase(BaseContextSensitiveTest.java:489)
	at org.openmrs.test.BaseContextSensitiveTest.baseSetupWithStandardDataAndAuthentication(BaseContextSensitiveTest.java:778)
(33 more lines...)
Collapse Failed RoleFormControllerTest shouldUpdateRoleWithParent History
1 sec
org.dbunit.dataset.NoSuchTableException: person
	at org.dbunit.database.DatabaseDataSet.getTableMetaData(DatabaseDataSet.java:282)
	at org.dbunit.operation.AbstractOperation.getOperationMetaData(AbstractOperation.java:80)
	at org.dbunit.operation.RefreshOperation.execute(RefreshOperation.java:98)
	at org.openmrs.test.BaseContextSensitiveTest.executeDataSet(BaseContextSensitiveTest.java:682)
	at org.openmrs.test.BaseContextSensitiveTest.executeDataSet(BaseContextSensitiveTest.java:577)
	at org.openmrs.test.BaseContextSensitiveTest.initializeInMemoryDatabase(BaseContextSensitiveTest.java:489)
	at org.openmrs.test.BaseContextSensitiveTest.baseSetupWithStandardDataAndAuthentication(BaseContextSensitiveTest.java:778)
(34 more lines...)
Collapse Failed UserFormControllerTest handleSubmission_shouldWorkForAnExample History
< 1 sec
org.dbunit.dataset.NoSuchTableException: person
	at org.dbunit.database.DatabaseDataSet.getTableMetaData(DatabaseDataSet.java:282)
	at org.dbunit.operation.AbstractOperation.getOperationMetaData(AbstractOperation.java:80)
	at org.dbunit.operation.RefreshOperation.execute(RefreshOperation.java:98)
	at org.openmrs.test.BaseContextSensitiveTest.executeDataSet(BaseContextSensitiveTest.java:682)
	at org.openmrs.test.BaseContextSensitiveTest.executeDataSet(BaseContextSensitiveTest.java:577)
	at org.openmrs.test.BaseContextSensitiveTest.initializeInMemoryDatabase(BaseContextSensitiveTest.java:489)
	at org.openmrs.test.BaseContextSensitiveTest.baseSetupWithStandardDataAndAuthentication(BaseContextSensitiveTest.java:778)
(33 more lines...)
Collapse Failed UserListControllerTest displayUsers_shouldGetAllUsersIfNoNameGiven History
< 1 sec
org.dbunit.dataset.NoSuchTableException: person
	at org.dbunit.database.DatabaseDataSet.getTableMetaData(DatabaseDataSet.java:282)
	at org.dbunit.operation.AbstractOperation.getOperationMetaData(AbstractOperation.java:80)
	at org.dbunit.operation.RefreshOperation.execute(RefreshOperation.java:98)
	at org.openmrs.test.BaseContextSensitiveTest.executeDataSet(BaseContextSensitiveTest.java:682)
	at org.openmrs.test.BaseContextSensitiveTest.executeDataSet(BaseContextSensitiveTest.java:577)
	at org.openmrs.test.BaseContextSensitiveTest.initializeInMemoryDatabase(BaseContextSensitiveTest.java:489)
	at org.openmrs.test.BaseContextSensitiveTest.baseSetupWithStandardDataAndAuthentication(BaseContextSensitiveTest.java:778)
(33 more lines...)
Collapse Failed UserListControllerTest displayUsers_shouldGetUsersJustGivenActionParameter History
< 1 sec
org.dbunit.dataset.NoSuchTableException: person
	at org.dbunit.database.DatabaseDataSet.getTableMetaData(DatabaseDataSet.java:282)
	at org.dbunit.operation.AbstractOperation.getOperationMetaData(AbstractOperation.java:80)
	at org.dbunit.operation.RefreshOperation.execute(RefreshOperation.java:98)
	at org.openmrs.test.BaseContextSensitiveTest.executeDataSet(BaseContextSensitiveTest.java:682)
	at org.openmrs.test.BaseContextSensitiveTest.executeDataSet(BaseContextSensitiveTest.java:577)
	at org.openmrs.test.BaseContextSensitiveTest.initializeInMemoryDatabase(BaseContextSensitiveTest.java:489)
	at org.openmrs.test.BaseContextSensitiveTest.baseSetupWithStandardDataAndAuthentication(BaseContextSensitiveTest.java:778)
(33 more lines...)
Collapse Failed UserListControllerTest displayUsers_shouldGetUsersWithAGivenRole History
< 1 sec
org.dbunit.dataset.NoSuchTableException: person
	at org.dbunit.database.DatabaseDataSet.getTableMetaData(DatabaseDataSet.java:282)
	at org.dbunit.operation.AbstractOperation.getOperationMetaData(AbstractOperation.java:80)
	at org.dbunit.operation.RefreshOperation.execute(RefreshOperation.java:98)
	at org.openmrs.test.BaseContextSensitiveTest.executeDataSet(BaseContextSensitiveTest.java:682)
	at org.openmrs.test.BaseContextSensitiveTest.executeDataSet(BaseContextSensitiveTest.java:577)
	at org.openmrs.test.BaseContextSensitiveTest.initializeInMemoryDatabase(BaseContextSensitiveTest.java:489)
	at org.openmrs.test.BaseContextSensitiveTest.baseSetupWithStandardDataAndAuthentication(BaseContextSensitiveTest.java:778)
(33 more lines...)
Collapse Failed UserListControllerTest displayUsers_shouldIncludeDisabledUsersIfRequested History
< 1 sec
org.dbunit.dataset.NoSuchTableException: person
	at org.dbunit.database.DatabaseDataSet.getTableMetaData(DatabaseDataSet.java:282)
	at org.dbunit.operation.AbstractOperation.getOperationMetaData(AbstractOperation.java:80)
	at org.dbunit.operation.RefreshOperation.execute(RefreshOperation.java:98)
	at org.openmrs.test.BaseContextSensitiveTest.executeDataSet(BaseContextSensitiveTest.java:682)
	at org.openmrs.test.BaseContextSensitiveTest.executeDataSet(BaseContextSensitiveTest.java:577)
	at org.openmrs.test.BaseContextSensitiveTest.initializeInMemoryDatabase(BaseContextSensitiveTest.java:489)
	at org.openmrs.test.BaseContextSensitiveTest.baseSetupWithStandardDataAndAuthentication(BaseContextSensitiveTest.java:778)
(33 more lines...)
Collapse Failed DWRConceptServiceTest findBatchOfConcepts_shouldNotReturnConceptByGivenIdIfClassnameIsExcluded History
< 1 sec
org.dbunit.dataset.NoSuchTableException: person
	at org.dbunit.database.DatabaseDataSet.getTableMetaData(DatabaseDataSet.java:282)
	at org.dbunit.operation.AbstractOperation.getOperationMetaData(AbstractOperation.java:80)
	at org.dbunit.operation.RefreshOperation.execute(RefreshOperation.java:98)
	at org.openmrs.test.BaseContextSensitiveTest.executeDataSet(BaseContextSensitiveTest.java:682)
	at org.openmrs.test.BaseContextSensitiveTest.executeDataSet(BaseContextSensitiveTest.java:577)
	at org.openmrs.test.BaseContextSensitiveTest.initializeInMemoryDatabase(BaseContextSensitiveTest.java:489)
	at org.openmrs.test.BaseContextSensitiveTest.baseSetupWithStandardDataAndAuthentication(BaseContextSensitiveTest.java:778)
(33 more lines...)
Collapse Failed DWRConceptServiceTest findBatchOfConcepts_shouldNotReturnConceptByGivenIdIfClassnameIsNotIncluded History
< 1 sec
org.dbunit.dataset.NoSuchTableException: person
	at org.dbunit.database.DatabaseDataSet.getTableMetaData(DatabaseDataSet.java:282)
	at org.dbunit.operation.AbstractOperation.getOperationMetaData(AbstractOperation.java:80)
	at org.dbunit.operation.RefreshOperation.execute(RefreshOperation.java:98)
	at org.openmrs.test.BaseContextSensitiveTest.executeDataSet(BaseContextSensitiveTest.java:682)
	at org.openmrs.test.BaseContextSensitiveTest.executeDataSet(BaseContextSensitiveTest.java:577)
	at org.openmrs.test.BaseContextSensitiveTest.initializeInMemoryDatabase(BaseContextSensitiveTest.java:489)
	at org.openmrs.test.BaseContextSensitiveTest.baseSetupWithStandardDataAndAuthentication(BaseContextSensitiveTest.java:778)
(33 more lines...)
Collapse Failed DWRConceptServiceTest findBatchOfConcepts_shouldNotReturnConceptByGivenIdIfDatatypeIsExcluded History
< 1 sec
org.dbunit.dataset.NoSuchTableException: person
	at org.dbunit.database.DatabaseDataSet.getTableMetaData(DatabaseDataSet.java:282)
	at org.dbunit.operation.AbstractOperation.getOperationMetaData(AbstractOperation.java:80)
	at org.dbunit.operation.RefreshOperation.execute(RefreshOperation.java:98)
	at org.openmrs.test.BaseContextSensitiveTest.executeDataSet(BaseContextSensitiveTest.java:682)
	at org.openmrs.test.BaseContextSensitiveTest.executeDataSet(BaseContextSensitiveTest.java:577)
	at org.openmrs.test.BaseContextSensitiveTest.initializeInMemoryDatabase(BaseContextSensitiveTest.java:489)
	at org.openmrs.test.BaseContextSensitiveTest.baseSetupWithStandardDataAndAuthentication(BaseContextSensitiveTest.java:778)
(33 more lines...)
Collapse Failed DWRConceptServiceTest findBatchOfConcepts_shouldNotReturnConceptByGivenIdIfDatatypeIsNotIncluded History
< 1 sec
org.dbunit.dataset.NoSuchTableException: person
	at org.dbunit.database.DatabaseDataSet.getTableMetaData(DatabaseDataSet.java:282)
	at org.dbunit.operation.AbstractOperation.getOperationMetaData(AbstractOperation.java:80)
	at org.dbunit.operation.RefreshOperation.execute(RefreshOperation.java:98)
	at org.openmrs.test.BaseContextSensitiveTest.executeDataSet(BaseContextSensitiveTest.java:682)
	at org.openmrs.test.BaseContextSensitiveTest.executeDataSet(BaseContextSensitiveTest.java:577)
	at org.openmrs.test.BaseContextSensitiveTest.initializeInMemoryDatabase(BaseContextSensitiveTest.java:489)
	at org.openmrs.test.BaseContextSensitiveTest.baseSetupWithStandardDataAndAuthentication(BaseContextSensitiveTest.java:778)
(33 more lines...)
Collapse Failed DWRConceptServiceTest findBatchOfConcepts_shouldReturnConceptByGivenIdIfClassnameIsIncluded History
< 1 sec
org.dbunit.dataset.NoSuchTableException: person
	at org.dbunit.database.DatabaseDataSet.getTableMetaData(DatabaseDataSet.java:282)
	at org.dbunit.operation.AbstractOperation.getOperationMetaData(AbstractOperation.java:80)
	at org.dbunit.operation.RefreshOperation.execute(RefreshOperation.java:98)
	at org.openmrs.test.BaseContextSensitiveTest.executeDataSet(BaseContextSensitiveTest.java:682)
	at org.openmrs.test.BaseContextSensitiveTest.executeDataSet(BaseContextSensitiveTest.java:577)
	at org.openmrs.test.BaseContextSensitiveTest.initializeInMemoryDatabase(BaseContextSensitiveTest.java:489)
	at org.openmrs.test.BaseContextSensitiveTest.baseSetupWithStandardDataAndAuthentication(BaseContextSensitiveTest.java:778)
(33 more lines...)
Collapse Failed DWRConceptServiceTest findBatchOfConcepts_shouldReturnConceptByGivenIdIfDatatypeIsIncluded History
< 1 sec
org.dbunit.dataset.NoSuchTableException: person
	at org.dbunit.database.DatabaseDataSet.getTableMetaData(DatabaseDataSet.java:282)
	at org.dbunit.operation.AbstractOperation.getOperationMetaData(AbstractOperation.java:80)
	at org.dbunit.operation.RefreshOperation.execute(RefreshOperation.java:98)
	at org.openmrs.test.BaseContextSensitiveTest.executeDataSet(BaseContextSensitiveTest.java:682)
	at org.openmrs.test.BaseContextSensitiveTest.executeDataSet(BaseContextSensitiveTest.java:577)
	at org.openmrs.test.BaseContextSensitiveTest.initializeInMemoryDatabase(BaseContextSensitiveTest.java:489)
	at org.openmrs.test.BaseContextSensitiveTest.baseSetupWithStandardDataAndAuthentication(BaseContextSensitiveTest.java:778)
(33 more lines...)
Collapse Failed DWRConceptServiceTest findBatchOfConcepts_shouldReturnConceptByGivenIdIfExclusionAndInclusionListsAreEmpty History
< 1 sec
org.dbunit.dataset.NoSuchTableException: person
	at org.dbunit.database.DatabaseDataSet.getTableMetaData(DatabaseDataSet.java:282)
	at org.dbunit.operation.AbstractOperation.getOperationMetaData(AbstractOperation.java:80)
	at org.dbunit.operation.RefreshOperation.execute(RefreshOperation.java:98)
	at org.openmrs.test.BaseContextSensitiveTest.executeDataSet(BaseContextSensitiveTest.java:682)
	at org.openmrs.test.BaseContextSensitiveTest.executeDataSet(BaseContextSensitiveTest.java:577)
	at org.openmrs.test.BaseContextSensitiveTest.initializeInMemoryDatabase(BaseContextSensitiveTest.java:489)
	at org.openmrs.test.BaseContextSensitiveTest.baseSetupWithStandardDataAndAuthentication(BaseContextSensitiveTest.java:778)
(33 more lines...)
Collapse Failed DWRConceptServiceTest findConceptAnswers_shouldNotFailIfTheSpecifiedConceptHasNoAnswersRegressionTestForTRUNK2807 History
< 1 sec
org.dbunit.dataset.NoSuchTableException: person
	at org.dbunit.database.DatabaseDataSet.getTableMetaData(DatabaseDataSet.java:282)
	at org.dbunit.operation.AbstractOperation.getOperationMetaData(AbstractOperation.java:80)
	at org.dbunit.operation.RefreshOperation.execute(RefreshOperation.java:98)
	at org.openmrs.test.BaseContextSensitiveTest.executeDataSet(BaseContextSensitiveTest.java:682)
	at org.openmrs.test.BaseContextSensitiveTest.executeDataSet(BaseContextSensitiveTest.java:577)
	at org.openmrs.test.BaseContextSensitiveTest.initializeInMemoryDatabase(BaseContextSensitiveTest.java:489)
	at org.openmrs.test.BaseContextSensitiveTest.baseSetupWithStandardDataAndAuthentication(BaseContextSensitiveTest.java:778)
(33 more lines...)
Collapse Failed DWRConceptServiceTest findConceptAnswers_shouldNotReturnDuplicates History
< 1 sec
org.dbunit.dataset.NoSuchTableException: person
	at org.dbunit.database.DatabaseDataSet.getTableMetaData(DatabaseDataSet.java:282)
	at org.dbunit.operation.AbstractOperation.getOperationMetaData(AbstractOperation.java:80)
	at org.dbunit.operation.RefreshOperation.execute(RefreshOperation.java:98)
	at org.openmrs.test.BaseContextSensitiveTest.executeDataSet(BaseContextSensitiveTest.java:682)
	at org.openmrs.test.BaseContextSensitiveTest.executeDataSet(BaseContextSensitiveTest.java:577)
	at org.openmrs.test.BaseContextSensitiveTest.initializeInMemoryDatabase(BaseContextSensitiveTest.java:489)
	at org.openmrs.test.BaseContextSensitiveTest.baseSetupWithStandardDataAndAuthentication(BaseContextSensitiveTest.java:778)
(33 more lines...)
Collapse Failed DWRConceptServiceTest findConceptAnswers_shouldSearchForConceptAnswersInAllSearchLocales History
< 1 sec
org.dbunit.dataset.NoSuchTableException: person
	at org.dbunit.database.DatabaseDataSet.getTableMetaData(DatabaseDataSet.java:282)
	at org.dbunit.operation.AbstractOperation.getOperationMetaData(AbstractOperation.java:80)
	at org.dbunit.operation.RefreshOperation.execute(RefreshOperation.java:98)
	at org.openmrs.test.BaseContextSensitiveTest.executeDataSet(BaseContextSensitiveTest.java:682)
	at org.openmrs.test.BaseContextSensitiveTest.executeDataSet(BaseContextSensitiveTest.java:577)
	at org.openmrs.test.BaseContextSensitiveTest.initializeInMemoryDatabase(BaseContextSensitiveTest.java:489)
	at org.openmrs.test.BaseContextSensitiveTest.baseSetupWithStandardDataAndAuthentication(BaseContextSensitiveTest.java:778)
(33 more lines...)
Collapse Failed DWRPatientServiceTest findCountAndPatients_shouldMatchPatientWithIdentifiersThatContainNoDigit History
< 1 sec
org.dbunit.dataset.NoSuchTableException: person
	at org.dbunit.database.DatabaseDataSet.getTableMetaData(DatabaseDataSet.java:282)
	at org.dbunit.operation.AbstractOperation.getOperationMetaData(AbstractOperation.java:80)
	at org.dbunit.operation.RefreshOperation.execute(RefreshOperation.java:98)
	at org.openmrs.test.BaseContextSensitiveTest.executeDataSet(BaseContextSensitiveTest.java:682)
	at org.openmrs.test.BaseContextSensitiveTest.executeDataSet(BaseContextSensitiveTest.java:577)
	at org.openmrs.test.BaseContextSensitiveTest.initializeInMemoryDatabase(BaseContextSensitiveTest.java:489)
	at org.openmrs.test.BaseContextSensitiveTest.baseSetupWithStandardDataAndAuthentication(BaseContextSensitiveTest.java:778)
(33 more lines...)
Collapse Failed DWRPatientServiceTest findCountAndPatients_shouldNotSignalForANewSearchIfItIsNotTheFirstAjaxCall History
4 secs
org.dbunit.dataset.NoSuchTableException: person
	at org.dbunit.database.DatabaseDataSet.getTableMetaData(DatabaseDataSet.java:282)
	at org.dbunit.operation.AbstractOperation.getOperationMetaData(AbstractOperation.java:80)
	at org.dbunit.operation.RefreshOperation.execute(RefreshOperation.java:98)
	at org.openmrs.test.BaseContextSensitiveTest.executeDataSet(BaseContextSensitiveTest.java:682)
	at org.openmrs.test.BaseContextSensitiveTest.executeDataSet(BaseContextSensitiveTest.java:577)
	at org.openmrs.test.BaseContextSensitiveTest.initializeInMemoryDatabase(BaseContextSensitiveTest.java:489)
	at org.openmrs.test.BaseContextSensitiveTest.baseSetupWithStandardDataAndAuthentication(BaseContextSensitiveTest.java:778)
(33 more lines...)
Collapse Failed DWRPatientServiceTest findCountAndPatients_shouldNotSignalForANewSearchIfTheNewSearchValueHasNoMatches History
< 1 sec
org.dbunit.dataset.NoSuchTableException: person
	at org.dbunit.database.DatabaseDataSet.getTableMetaData(DatabaseDataSet.java:282)
	at org.dbunit.operation.AbstractOperation.getOperationMetaData(AbstractOperation.java:80)
	at org.dbunit.operation.RefreshOperation.execute(RefreshOperation.java:98)
	at org.openmrs.test.BaseContextSensitiveTest.executeDataSet(BaseContextSensitiveTest.java:682)
	at org.openmrs.test.BaseContextSensitiveTest.executeDataSet(BaseContextSensitiveTest.java:577)
	at org.openmrs.test.BaseContextSensitiveTest.initializeInMemoryDatabase(BaseContextSensitiveTest.java:489)
	at org.openmrs.test.BaseContextSensitiveTest.baseSetupWithStandardDataAndAuthentication(BaseContextSensitiveTest.java:778)
(33 more lines...)
Collapse Failed DWRPatientServiceTest findCountAndPatients_shouldSignalForANewSearchIfTheNewSearchValueHasMatchesAndIsAFirstCall History
< 1 sec
org.dbunit.dataset.NoSuchTableException: person
	at org.dbunit.database.DatabaseDataSet.getTableMetaData(DatabaseDataSet.java:282)
	at org.dbunit.operation.AbstractOperation.getOperationMetaData(AbstractOperation.java:80)
	at org.dbunit.operation.RefreshOperation.execute(RefreshOperation.java:98)
	at org.openmrs.test.BaseContextSensitiveTest.executeDataSet(BaseContextSensitiveTest.java:682)
	at org.openmrs.test.BaseContextSensitiveTest.executeDataSet(BaseContextSensitiveTest.java:577)
	at org.openmrs.test.BaseContextSensitiveTest.initializeInMemoryDatabase(BaseContextSensitiveTest.java:489)
	at org.openmrs.test.BaseContextSensitiveTest.baseSetupWithStandardDataAndAuthentication(BaseContextSensitiveTest.java:778)
(33 more lines...)
Collapse Failed DWRPersonServiceTest findPeopleByRoles_shouldAllowNullRolesParameter History
< 1 sec
org.dbunit.dataset.NoSuchTableException: person
	at org.dbunit.database.DatabaseDataSet.getTableMetaData(DatabaseDataSet.java:282)
	at org.dbunit.operation.AbstractOperation.getOperationMetaData(AbstractOperation.java:80)
	at org.dbunit.operation.RefreshOperation.execute(RefreshOperation.java:98)
	at org.openmrs.test.BaseContextSensitiveTest.executeDataSet(BaseContextSensitiveTest.java:682)
	at org.openmrs.test.BaseContextSensitiveTest.executeDataSet(BaseContextSensitiveTest.java:577)
	at org.openmrs.test.BaseContextSensitiveTest.initializeInMemoryDatabase(BaseContextSensitiveTest.java:489)
	at org.openmrs.test.BaseContextSensitiveTest.baseSetupWithStandardDataAndAuthentication(BaseContextSensitiveTest.java:778)
(33 more lines...)
Collapse Failed DWRPersonServiceTest findPeopleByRoles_shouldMatchOnPatientIdentifiers History
< 1 sec
org.dbunit.dataset.NoSuchTableException: person
	at org.dbunit.database.DatabaseDataSet.getTableMetaData(DatabaseDataSet.java:282)
	at org.dbunit.operation.AbstractOperation.getOperationMetaData(AbstractOperation.java:80)
	at org.dbunit.operation.RefreshOperation.execute(RefreshOperation.java:98)
	at org.openmrs.test.BaseContextSensitiveTest.executeDataSet(BaseContextSensitiveTest.java:682)
	at org.openmrs.test.BaseContextSensitiveTest.executeDataSet(BaseContextSensitiveTest.java:577)
	at org.openmrs.test.BaseContextSensitiveTest.initializeInMemoryDatabase(BaseContextSensitiveTest.java:489)
	at org.openmrs.test.BaseContextSensitiveTest.baseSetupWithStandardDataAndAuthentication(BaseContextSensitiveTest.java:778)
(33 more lines...)
Collapse Failed DWRProgramWorkflowServiceTest getPossibleNextStates_shouldReturnAllNext History
2 secs
org.dbunit.dataset.NoSuchTableException: person
	at org.dbunit.database.DatabaseDataSet.getTableMetaData(DatabaseDataSet.java:282)
	at org.dbunit.operation.AbstractOperation.getOperationMetaData(AbstractOperation.java:80)
	at org.dbunit.operation.RefreshOperation.execute(RefreshOperation.java:98)
	at org.openmrs.test.BaseContextSensitiveTest.executeDataSet(BaseContextSensitiveTest.java:682)
	at org.openmrs.test.BaseContextSensitiveTest.executeDataSet(BaseContextSensitiveTest.java:577)
	at org.openmrs.test.BaseContextSensitiveTest.initializeInMemoryDatabase(BaseContextSensitiveTest.java:489)
	at org.openmrs.test.BaseContextSensitiveTest.baseSetupWithStandardDataAndAuthentication(BaseContextSensitiveTest.java:778)
(33 more lines...)
Collapse Failed DWRProgramWorkflowServiceTest getPossibleNextStates_shouldReturnNonRetiredConcepts History
< 1 sec
org.dbunit.dataset.NoSuchTableException: person
	at org.dbunit.database.DatabaseDataSet.getTableMetaData(DatabaseDataSet.java:282)
	at org.dbunit.operation.AbstractOperation.getOperationMetaData(AbstractOperation.java:80)
	at org.dbunit.operation.RefreshOperation.execute(RefreshOperation.java:98)
	at org.openmrs.test.BaseContextSensitiveTest.executeDataSet(BaseContextSensitiveTest.java:682)
	at org.openmrs.test.BaseContextSensitiveTest.executeDataSet(BaseContextSensitiveTest.java:577)
	at org.openmrs.test.BaseContextSensitiveTest.initializeInMemoryDatabase(BaseContextSensitiveTest.java:489)
	at org.openmrs.test.BaseContextSensitiveTest.baseSetupWithStandardDataAndAuthentication(BaseContextSensitiveTest.java:778)
(33 more lines...)
Collapse Failed DWRProgramWorkflowServiceTest getPossibleNextStates_shouldReturnNonRetiredStates History
< 1 sec
org.dbunit.dataset.NoSuchTableException: person
	at org.dbunit.database.DatabaseDataSet.getTableMetaData(DatabaseDataSet.java:282)
	at org.dbunit.operation.AbstractOperation.getOperationMetaData(AbstractOperation.java:80)
	at org.dbunit.operation.RefreshOperation.execute(RefreshOperation.java:98)
	at org.openmrs.test.BaseContextSensitiveTest.executeDataSet(BaseContextSensitiveTest.java:682)
	at org.openmrs.test.BaseContextSensitiveTest.executeDataSet(BaseContextSensitiveTest.java:577)
	at org.openmrs.test.BaseContextSensitiveTest.initializeInMemoryDatabase(BaseContextSensitiveTest.java:489)
	at org.openmrs.test.BaseContextSensitiveTest.baseSetupWithStandardDataAndAuthentication(BaseContextSensitiveTest.java:778)
(33 more lines...)
Collapse Failed DWRProgramWorkflowServiceTest getPossibleOutcomes_shouldReturnOutcomeConceptsFromProgram History
< 1 sec
org.dbunit.dataset.NoSuchTableException: person
	at org.dbunit.database.DatabaseDataSet.getTableMetaData(DatabaseDataSet.java:282)
	at org.dbunit.operation.AbstractOperation.getOperationMetaData(AbstractOperation.java:80)
	at org.dbunit.operation.RefreshOperation.execute(RefreshOperation.java:98)
	at org.openmrs.test.BaseContextSensitiveTest.executeDataSet(BaseContextSensitiveTest.java:682)
	at org.openmrs.test.BaseContextSensitiveTest.executeDataSet(BaseContextSensitiveTest.java:577)
	at org.openmrs.test.BaseContextSensitiveTest.initializeInMemoryDatabase(BaseContextSensitiveTest.java:489)
	at org.openmrs.test.BaseContextSensitiveTest.baseSetupWithStandardDataAndAuthentication(BaseContextSensitiveTest.java:778)
(33 more lines...)
Collapse Failed DWRProviderServiceTest findProvider_shouldReturnAMessageWithNoMatchesFoundWhenNoProvidersAreFound History
< 1 sec
org.dbunit.dataset.NoSuchTableException: person
	at org.dbunit.database.DatabaseDataSet.getTableMetaData(DatabaseDataSet.java:282)
	at org.dbunit.operation.AbstractOperation.getOperationMetaData(AbstractOperation.java:80)
	at org.dbunit.operation.RefreshOperation.execute(RefreshOperation.java:98)
	at org.openmrs.test.BaseContextSensitiveTest.executeDataSet(BaseContextSensitiveTest.java:682)
	at org.openmrs.test.BaseContextSensitiveTest.executeDataSet(BaseContextSensitiveTest.java:577)
	at org.openmrs.test.BaseContextSensitiveTest.initializeInMemoryDatabase(BaseContextSensitiveTest.java:489)
	at org.openmrs.test.BaseContextSensitiveTest.baseSetupWithStandardDataAndAuthentication(BaseContextSensitiveTest.java:778)
(33 more lines...)
Collapse Failed DWRProviderServiceTest findProvider_shouldReturnTheListOfProvidersIncludingRetiredProvidersForTheMatchingSearchName History
4 secs
org.dbunit.dataset.NoSuchTableException: person
	at org.dbunit.database.DatabaseDataSet.getTableMetaData(DatabaseDataSet.java:282)
	at org.dbunit.operation.AbstractOperation.getOperationMetaData(AbstractOperation.java:80)
	at org.dbunit.operation.RefreshOperation.execute(RefreshOperation.java:98)
	at org.openmrs.test.BaseContextSensitiveTest.executeDataSet(BaseContextSensitiveTest.java:682)
	at org.openmrs.test.BaseContextSensitiveTest.executeDataSet(BaseContextSensitiveTest.java:577)
	at org.openmrs.test.BaseContextSensitiveTest.initializeInMemoryDatabase(BaseContextSensitiveTest.java:489)
	at org.openmrs.test.BaseContextSensitiveTest.baseSetupWithStandardDataAndAuthentication(BaseContextSensitiveTest.java:778)
(33 more lines...)
Collapse Failed DWRProviderServiceTest findProvider_shouldReturnTheListOfProvidersMatchingTheSearchName History
< 1 sec
org.dbunit.dataset.NoSuchTableException: person
	at org.dbunit.database.DatabaseDataSet.getTableMetaData(DatabaseDataSet.java:282)
	at org.dbunit.operation.AbstractOperation.getOperationMetaData(AbstractOperation.java:80)
	at org.dbunit.operation.RefreshOperation.execute(RefreshOperation.java:98)
	at org.openmrs.test.BaseContextSensitiveTest.executeDataSet(BaseContextSensitiveTest.java:682)
	at org.openmrs.test.BaseContextSensitiveTest.executeDataSet(BaseContextSensitiveTest.java:577)
	at org.openmrs.test.BaseContextSensitiveTest.initializeInMemoryDatabase(BaseContextSensitiveTest.java:489)
	at org.openmrs.test.BaseContextSensitiveTest.baseSetupWithStandardDataAndAuthentication(BaseContextSensitiveTest.java:778)
(33 more lines...)
Collapse Failed PersonListItemTest PersonListItem_shouldIdentifyBestMatchingNameAsOtherNameForTheGivenName History
< 1 sec
org.dbunit.dataset.NoSuchTableException: person
	at org.dbunit.database.DatabaseDataSet.getTableMetaData(DatabaseDataSet.java:282)
	at org.dbunit.operation.AbstractOperation.getOperationMetaData(AbstractOperation.java:80)
	at org.dbunit.operation.RefreshOperation.execute(RefreshOperation.java:98)
	at org.openmrs.test.BaseContextSensitiveTest.executeDataSet(BaseContextSensitiveTest.java:682)
	at org.openmrs.test.BaseContextSensitiveTest.executeDataSet(BaseContextSensitiveTest.java:577)
	at org.openmrs.test.BaseContextSensitiveTest.initializeInMemoryDatabase(BaseContextSensitiveTest.java:489)
	at org.openmrs.test.BaseContextSensitiveTest.baseSetupWithStandardDataAndAuthentication(BaseContextSensitiveTest.java:778)
(33 more lines...)
Collapse Failed PersonListItemTest PersonListItem_shouldIdentifyBestMatchingNameAsOtherNameForTheMiddleName History
< 1 sec
org.dbunit.dataset.NoSuchTableException: person
	at org.dbunit.database.DatabaseDataSet.getTableMetaData(DatabaseDataSet.java:282)
	at org.dbunit.operation.AbstractOperation.getOperationMetaData(AbstractOperation.java:80)
	at org.dbunit.operation.RefreshOperation.execute(RefreshOperation.java:98)
	at org.openmrs.test.BaseContextSensitiveTest.executeDataSet(BaseContextSensitiveTest.java:682)
	at org.openmrs.test.BaseContextSensitiveTest.executeDataSet(BaseContextSensitiveTest.java:577)
	at org.openmrs.test.BaseContextSensitiveTest.initializeInMemoryDatabase(BaseContextSensitiveTest.java:489)
	at org.openmrs.test.BaseContextSensitiveTest.baseSetupWithStandardDataAndAuthentication(BaseContextSensitiveTest.java:778)
(33 more lines...)
Collapse Failed PersonListItemTest PersonListItem_shouldIdentifyBestMatchingNameForTheFamilyName History
< 1 sec
org.dbunit.dataset.NoSuchTableException: person
	at org.dbunit.database.DatabaseDataSet.getTableMetaData(DatabaseDataSet.java:282)
	at org.dbunit.operation.AbstractOperation.getOperationMetaData(AbstractOperation.java:80)
	at org.dbunit.operation.RefreshOperation.execute(RefreshOperation.java:98)
	at org.openmrs.test.BaseContextSensitiveTest.executeDataSet(BaseContextSensitiveTest.java:682)
	at org.openmrs.test.BaseContextSensitiveTest.executeDataSet(BaseContextSensitiveTest.java:577)
	at org.openmrs.test.BaseContextSensitiveTest.initializeInMemoryDatabase(BaseContextSensitiveTest.java:489)
	at org.openmrs.test.BaseContextSensitiveTest.baseSetupWithStandardDataAndAuthentication(BaseContextSensitiveTest.java:778)
(33 more lines...)
Collapse Failed PersonListItemTest PersonListItem_shouldIdentifyBestMatchingNameForTheGivenPreferredNameEvenIfOtherNamesMatch History
< 1 sec
org.dbunit.dataset.NoSuchTableException: person
	at org.dbunit.database.DatabaseDataSet.getTableMetaData(DatabaseDataSet.java:282)
	at org.dbunit.operation.AbstractOperation.getOperationMetaData(AbstractOperation.java:80)
	at org.dbunit.operation.RefreshOperation.execute(RefreshOperation.java:98)
	at org.openmrs.test.BaseContextSensitiveTest.executeDataSet(BaseContextSensitiveTest.java:682)
	at org.openmrs.test.BaseContextSensitiveTest.executeDataSet(BaseContextSensitiveTest.java:577)
	at org.openmrs.test.BaseContextSensitiveTest.initializeInMemoryDatabase(BaseContextSensitiveTest.java:489)
	at org.openmrs.test.BaseContextSensitiveTest.baseSetupWithStandardDataAndAuthentication(BaseContextSensitiveTest.java:778)
(33 more lines...)
Collapse Failed PersonListItemTest PersonListItem_shouldIdentifyBestMatchingNameInMultipleSearchNames History
< 1 sec
org.dbunit.dataset.NoSuchTableException: person
	at org.dbunit.database.DatabaseDataSet.getTableMetaData(DatabaseDataSet.java:282)
	at org.dbunit.operation.AbstractOperation.getOperationMetaData(AbstractOperation.java:80)
	at org.dbunit.operation.RefreshOperation.execute(RefreshOperation.java:98)
	at org.openmrs.test.BaseContextSensitiveTest.executeDataSet(BaseContextSensitiveTest.java:682)
	at org.openmrs.test.BaseContextSensitiveTest.executeDataSet(BaseContextSensitiveTest.java:577)
	at org.openmrs.test.BaseContextSensitiveTest.initializeInMemoryDatabase(BaseContextSensitiveTest.java:489)
	at org.openmrs.test.BaseContextSensitiveTest.baseSetupWithStandardDataAndAuthentication(BaseContextSensitiveTest.java:778)
(33 more lines...)
Collapse Failed PersonListItemTest PersonListItem_shouldPutAttributeToStringValueIntoAttributesMap History
< 1 sec
org.dbunit.dataset.NoSuchTableException: person
	at org.dbunit.database.DatabaseDataSet.getTableMetaData(DatabaseDataSet.java:282)
	at org.dbunit.operation.AbstractOperation.getOperationMetaData(AbstractOperation.java:80)
	at org.dbunit.operation.RefreshOperation.execute(RefreshOperation.java:98)
	at org.openmrs.test.BaseContextSensitiveTest.executeDataSet(BaseContextSensitiveTest.java:682)
	at org.openmrs.test.BaseContextSensitiveTest.executeDataSet(BaseContextSensitiveTest.java:577)
	at org.openmrs.test.BaseContextSensitiveTest.initializeInMemoryDatabase(BaseContextSensitiveTest.java:489)
	at org.openmrs.test.BaseContextSensitiveTest.baseSetupWithStandardDataAndAuthentication(BaseContextSensitiveTest.java:778)
(33 more lines...)
Collapse Failed PersonListItemTest createBestMatch_shouldReturnPatientListItemGivenPatientParameter History
< 1 sec
org.dbunit.dataset.NoSuchTableException: person
	at org.dbunit.database.DatabaseDataSet.getTableMetaData(DatabaseDataSet.java:282)
	at org.dbunit.operation.AbstractOperation.getOperationMetaData(AbstractOperation.java:80)
	at org.dbunit.operation.RefreshOperation.execute(RefreshOperation.java:98)
	at org.openmrs.test.BaseContextSensitiveTest.executeDataSet(BaseContextSensitiveTest.java:682)
	at org.openmrs.test.BaseContextSensitiveTest.executeDataSet(BaseContextSensitiveTest.java:577)
	at org.openmrs.test.BaseContextSensitiveTest.initializeInMemoryDatabase(BaseContextSensitiveTest.java:489)
	at org.openmrs.test.BaseContextSensitiveTest.baseSetupWithStandardDataAndAuthentication(BaseContextSensitiveTest.java:778)
(33 more lines...)
Collapse Failed PersonListItemTest createBestMatch_shouldReturnPersonListItemGivenPersonParameter History
< 1 sec
org.dbunit.dataset.NoSuchTableException: person
	at org.dbunit.database.DatabaseDataSet.getTableMetaData(DatabaseDataSet.java:282)
	at org.dbunit.operation.AbstractOperation.getOperationMetaData(AbstractOperation.java:80)
	at org.dbunit.operation.RefreshOperation.execute(RefreshOperation.java:98)
	at org.openmrs.test.BaseContextSensitiveTest.executeDataSet(BaseContextSensitiveTest.java:682)
	at org.openmrs.test.BaseContextSensitiveTest.executeDataSet(BaseContextSensitiveTest.java:577)
	at org.openmrs.test.BaseContextSensitiveTest.initializeInMemoryDatabase(BaseContextSensitiveTest.java:489)
	at org.openmrs.test.BaseContextSensitiveTest.baseSetupWithStandardDataAndAuthentication(BaseContextSensitiveTest.java:778)
(33 more lines...)
Collapse Failed EncounterDisplayControllerTest shouldAllowMoreThanOneObsPerConceptInObsGroup History
< 1 sec
org.dbunit.dataset.NoSuchTableException: person
	at org.dbunit.database.DatabaseDataSet.getTableMetaData(DatabaseDataSet.java:282)
	at org.dbunit.operation.AbstractOperation.getOperationMetaData(AbstractOperation.java:80)
	at org.dbunit.operation.RefreshOperation.execute(RefreshOperation.java:98)
	at org.openmrs.test.BaseContextSensitiveTest.executeDataSet(BaseContextSensitiveTest.java:682)
	at org.openmrs.test.BaseContextSensitiveTest.executeDataSet(BaseContextSensitiveTest.java:577)
	at org.openmrs.test.BaseContextSensitiveTest.initializeInMemoryDatabase(BaseContextSensitiveTest.java:489)
	at org.openmrs.test.BaseContextSensitiveTest.baseSetupWithStandardDataAndAuthentication(BaseContextSensitiveTest.java:778)
(33 more lines...)
Collapse Failed EncounterDisplayControllerTest shouldGetNormalEncounterPageData History
< 1 sec
org.dbunit.dataset.NoSuchTableException: person
	at org.dbunit.database.DatabaseDataSet.getTableMetaData(DatabaseDataSet.java:282)
	at org.dbunit.operation.AbstractOperation.getOperationMetaData(AbstractOperation.java:80)
	at org.dbunit.operation.RefreshOperation.execute(RefreshOperation.java:98)
	at org.openmrs.test.BaseContextSensitiveTest.executeDataSet(BaseContextSensitiveTest.java:682)
	at org.openmrs.test.BaseContextSensitiveTest.executeDataSet(BaseContextSensitiveTest.java:577)
	at org.openmrs.test.BaseContextSensitiveTest.initializeInMemoryDatabase(BaseContextSensitiveTest.java:489)
	at org.openmrs.test.BaseContextSensitiveTest.baseSetupWithStandardDataAndAuthentication(BaseContextSensitiveTest.java:778)
(33 more lines...)
Collapse Failed UpdateFilterTest authenticateAsSuperUser_shouldReturnFalseIfGivenInvalidCredentials History
< 1 sec
org.dbunit.dataset.NoSuchTableException: person
	at org.dbunit.database.DatabaseDataSet.getTableMetaData(DatabaseDataSet.java:282)
	at org.dbunit.operation.AbstractOperation.getOperationMetaData(AbstractOperation.java:80)
	at org.dbunit.operation.RefreshOperation.execute(RefreshOperation.java:98)
	at org.openmrs.test.BaseContextSensitiveTest.executeDataSet(BaseContextSensitiveTest.java:682)
	at org.openmrs.test.BaseContextSensitiveTest.executeDataSet(BaseContextSensitiveTest.java:577)
	at org.openmrs.test.BaseContextSensitiveTest.initializeInMemoryDatabase(BaseContextSensitiveTest.java:489)
	at org.openmrs.test.BaseContextSensitiveTest.baseSetupWithStandardDataAndAuthentication(BaseContextSensitiveTest.java:778)
(34 more lines...)
Collapse Failed UpdateFilterTest authenticateAsSuperUser_shouldReturnFalseIfGivenUserIsNotSuperuser History
< 1 sec
org.dbunit.dataset.NoSuchTableException: person
	at org.dbunit.database.DatabaseDataSet.getTableMetaData(DatabaseDataSet.java:282)
	at org.dbunit.operation.AbstractOperation.getOperationMetaData(AbstractOperation.java:80)
	at org.dbunit.operation.RefreshOperation.execute(RefreshOperation.java:98)
	at org.openmrs.test.BaseContextSensitiveTest.executeDataSet(BaseContextSensitiveTest.java:682)
	at org.openmrs.test.BaseContextSensitiveTest.executeDataSet(BaseContextSensitiveTest.java:577)
	at org.openmrs.test.BaseContextSensitiveTest.initializeInMemoryDatabase(BaseContextSensitiveTest.java:489)
	at org.openmrs.test.BaseContextSensitiveTest.baseSetupWithStandardDataAndAuthentication(BaseContextSensitiveTest.java:778)
(34 more lines...)
Collapse Failed UpdateFilterTest authenticateAsSuperUser_shouldReturnTrueIfGivenUserIsSuperuser History
< 1 sec
org.dbunit.dataset.NoSuchTableException: person
	at org.dbunit.database.DatabaseDataSet.getTableMetaData(DatabaseDataSet.java:282)
	at org.dbunit.operation.AbstractOperation.getOperationMetaData(AbstractOperation.java:80)
	at org.dbunit.operation.RefreshOperation.execute(RefreshOperation.java:98)
	at org.openmrs.test.BaseContextSensitiveTest.executeDataSet(BaseContextSensitiveTest.java:682)
	at org.openmrs.test.BaseContextSensitiveTest.executeDataSet(BaseContextSensitiveTest.java:577)
	at org.openmrs.test.BaseContextSensitiveTest.initializeInMemoryDatabase(BaseContextSensitiveTest.java:489)
	at org.openmrs.test.BaseContextSensitiveTest.baseSetupWithStandardDataAndAuthentication(BaseContextSensitiveTest.java:778)
(34 more lines...)
Collapse Failed UpdateFilterTest isSuperUser_shouldReturnFalseIfGivenUserDoesNotHaveTheSuperUserRole History
< 1 sec
org.dbunit.dataset.NoSuchTableException: person
	at org.dbunit.database.DatabaseDataSet.getTableMetaData(DatabaseDataSet.java:282)
	at org.dbunit.operation.AbstractOperation.getOperationMetaData(AbstractOperation.java:80)
	at org.dbunit.operation.RefreshOperation.execute(RefreshOperation.java:98)
	at org.openmrs.test.BaseContextSensitiveTest.executeDataSet(BaseContextSensitiveTest.java:682)
	at org.openmrs.test.BaseContextSensitiveTest.executeDataSet(BaseContextSensitiveTest.java:577)
	at org.openmrs.test.BaseContextSensitiveTest.initializeInMemoryDatabase(BaseContextSensitiveTest.java:489)
	at org.openmrs.test.BaseContextSensitiveTest.baseSetupWithStandardDataAndAuthentication(BaseContextSensitiveTest.java:778)
(34 more lines...)
Collapse Failed UpdateFilterTest isSuperUser_shouldReturnTrueIfGivenUserHasSuperuserRole History
< 1 sec
org.dbunit.dataset.NoSuchTableException: person
	at org.dbunit.database.DatabaseDataSet.getTableMetaData(DatabaseDataSet.java:282)
	at org.dbunit.operation.AbstractOperation.getOperationMetaData(AbstractOperation.java:80)
	at org.dbunit.operation.RefreshOperation.execute(RefreshOperation.java:98)
	at org.openmrs.test.BaseContextSensitiveTest.executeDataSet(BaseContextSensitiveTest.java:682)
	at org.openmrs.test.BaseContextSensitiveTest.executeDataSet(BaseContextSensitiveTest.java:577)
	at org.openmrs.test.BaseContextSensitiveTest.initializeInMemoryDatabase(BaseContextSensitiveTest.java:489)
	at org.openmrs.test.BaseContextSensitiveTest.baseSetupWithStandardDataAndAuthentication(BaseContextSensitiveTest.java:778)
(33 more lines...)
Collapse Failed ObsFormControllerTest shouldGetObsFormWithEncounterFilledIn History
< 1 sec
org.dbunit.dataset.NoSuchTableException: person
	at org.dbunit.database.DatabaseDataSet.getTableMetaData(DatabaseDataSet.java:282)
	at org.dbunit.operation.AbstractOperation.getOperationMetaData(AbstractOperation.java:80)
	at org.dbunit.operation.RefreshOperation.execute(RefreshOperation.java:98)
	at org.openmrs.test.BaseContextSensitiveTest.executeDataSet(BaseContextSensitiveTest.java:682)
	at org.openmrs.test.BaseContextSensitiveTest.executeDataSet(BaseContextSensitiveTest.java:577)
	at org.openmrs.test.BaseContextSensitiveTest.initializeInMemoryDatabase(BaseContextSensitiveTest.java:489)
	at org.openmrs.test.BaseContextSensitiveTest.baseSetupWithStandardDataAndAuthentication(BaseContextSensitiveTest.java:778)
(33 more lines...)
Collapse Failed ObsFormControllerTest shouldSaveObsFormNormally History
4 secs
org.dbunit.dataset.NoSuchTableException: person
	at org.dbunit.database.DatabaseDataSet.getTableMetaData(DatabaseDataSet.java:282)
	at org.dbunit.operation.AbstractOperation.getOperationMetaData(AbstractOperation.java:80)
	at org.dbunit.operation.RefreshOperation.execute(RefreshOperation.java:98)
	at org.openmrs.test.BaseContextSensitiveTest.executeDataSet(BaseContextSensitiveTest.java:682)
	at org.openmrs.test.BaseContextSensitiveTest.executeDataSet(BaseContextSensitiveTest.java:577)
	at org.openmrs.test.BaseContextSensitiveTest.initializeInMemoryDatabase(BaseContextSensitiveTest.java:489)
	at org.openmrs.test.BaseContextSensitiveTest.baseSetupWithStandardDataAndAuthentication(BaseContextSensitiveTest.java:778)
(33 more lines...)
Collapse Failed OrderTest getDiscontinued_shouldGetDiscontinuedProperty History
< 1 sec
org.dbunit.dataset.NoSuchTableException: person
	at org.dbunit.database.DatabaseDataSet.getTableMetaData(DatabaseDataSet.java:282)
	at org.dbunit.operation.AbstractOperation.getOperationMetaData(AbstractOperation.java:80)
	at org.dbunit.operation.RefreshOperation.execute(RefreshOperation.java:98)
	at org.openmrs.test.BaseContextSensitiveTest.executeDataSet(BaseContextSensitiveTest.java:682)
	at org.openmrs.test.BaseContextSensitiveTest.executeDataSet(BaseContextSensitiveTest.java:577)
	at org.openmrs.test.BaseContextSensitiveTest.initializeInMemoryDatabase(BaseContextSensitiveTest.java:489)
	at org.openmrs.test.BaseContextSensitiveTest.baseSetupWithStandardDataAndAuthentication(BaseContextSensitiveTest.java:778)
(33 more lines...)
Collapse Failed PatientDashboardGraphControllerTest shouldDisplayPatientDashboardGraphForm History
1 sec
org.dbunit.dataset.NoSuchTableException: person
	at org.dbunit.database.DatabaseDataSet.getTableMetaData(DatabaseDataSet.java:282)
	at org.dbunit.operation.AbstractOperation.getOperationMetaData(AbstractOperation.java:80)
	at org.dbunit.operation.RefreshOperation.execute(RefreshOperation.java:98)
	at org.openmrs.test.BaseContextSensitiveTest.executeDataSet(BaseContextSensitiveTest.java:682)
	at org.openmrs.test.BaseContextSensitiveTest.executeDataSet(BaseContextSensitiveTest.java:577)
	at org.openmrs.test.BaseContextSensitiveTest.initializeInMemoryDatabase(BaseContextSensitiveTest.java:489)
	at org.openmrs.test.BaseContextSensitiveTest.baseSetupWithStandardDataAndAuthentication(BaseContextSensitiveTest.java:778)
(33 more lines...)
Collapse Failed PatientDashboardGraphControllerTest shouldReturnJSONWithPatientObservationDetails History
< 1 sec
org.dbunit.dataset.NoSuchTableException: person
	at org.dbunit.database.DatabaseDataSet.getTableMetaData(DatabaseDataSet.java:282)
	at org.dbunit.operation.AbstractOperation.getOperationMetaData(AbstractOperation.java:80)
	at org.dbunit.operation.RefreshOperation.execute(RefreshOperation.java:98)
	at org.openmrs.test.BaseContextSensitiveTest.executeDataSet(BaseContextSensitiveTest.java:682)
	at org.openmrs.test.BaseContextSensitiveTest.executeDataSet(BaseContextSensitiveTest.java:577)
	at org.openmrs.test.BaseContextSensitiveTest.initializeInMemoryDatabase(BaseContextSensitiveTest.java:489)
	at org.openmrs.test.BaseContextSensitiveTest.baseSetupWithStandardDataAndAuthentication(BaseContextSensitiveTest.java:778)
(33 more lines...)
Collapse Failed LoginServletTest shouldLockUserOutAfterFiveFailedLoginAttempts History
< 1 sec
org.dbunit.dataset.NoSuchTableException: person
	at org.dbunit.database.DatabaseDataSet.getTableMetaData(DatabaseDataSet.java:282)
	at org.dbunit.operation.AbstractOperation.getOperationMetaData(AbstractOperation.java:80)
	at org.dbunit.operation.RefreshOperation.execute(RefreshOperation.java:98)
	at org.openmrs.test.BaseContextSensitiveTest.executeDataSet(BaseContextSensitiveTest.java:682)
	at org.openmrs.test.BaseContextSensitiveTest.executeDataSet(BaseContextSensitiveTest.java:577)
	at org.openmrs.test.BaseContextSensitiveTest.initializeInMemoryDatabase(BaseContextSensitiveTest.java:489)
	at org.openmrs.test.BaseContextSensitiveTest.baseSetupWithStandardDataAndAuthentication(BaseContextSensitiveTest.java:778)
(33 more lines...)
Collapse Failed LoginServletTest shouldNotRedirectBackToLoginScreenWithCorrectUsernameAndPassword History
< 1 sec
org.dbunit.dataset.NoSuchTableException: person
	at org.dbunit.database.DatabaseDataSet.getTableMetaData(DatabaseDataSet.java:282)
	at org.dbunit.operation.AbstractOperation.getOperationMetaData(AbstractOperation.java:80)
	at org.dbunit.operation.RefreshOperation.execute(RefreshOperation.java:98)
	at org.openmrs.test.BaseContextSensitiveTest.executeDataSet(BaseContextSensitiveTest.java:682)
	at org.openmrs.test.BaseContextSensitiveTest.executeDataSet(BaseContextSensitiveTest.java:577)
	at org.openmrs.test.BaseContextSensitiveTest.initializeInMemoryDatabase(BaseContextSensitiveTest.java:489)
	at org.openmrs.test.BaseContextSensitiveTest.baseSetupWithStandardDataAndAuthentication(BaseContextSensitiveTest.java:778)
(33 more lines...)
Collapse Failed LoginServletTest shouldRedirectBackToLoginScreenOnBadUsernameAndPassword History
< 1 sec
org.dbunit.dataset.NoSuchTableException: person
	at org.dbunit.database.DatabaseDataSet.getTableMetaData(DatabaseDataSet.java:282)
	at org.dbunit.operation.AbstractOperation.getOperationMetaData(AbstractOperation.java:80)
	at org.dbunit.operation.RefreshOperation.execute(RefreshOperation.java:98)
	at org.openmrs.test.BaseContextSensitiveTest.executeDataSet(BaseContextSensitiveTest.java:682)
	at org.openmrs.test.BaseContextSensitiveTest.executeDataSet(BaseContextSensitiveTest.java:577)
	at org.openmrs.test.BaseContextSensitiveTest.initializeInMemoryDatabase(BaseContextSensitiveTest.java:489)
	at org.openmrs.test.BaseContextSensitiveTest.baseSetupWithStandardDataAndAuthentication(BaseContextSensitiveTest.java:778)
(33 more lines...)
Collapse Failed ShowGraphServletTest getChart_shouldSetValueAxisLabelToConceptNumericUnitsIfGivenUnitsIsNull History
< 1 sec
org.dbunit.dataset.NoSuchTableException: person
	at org.dbunit.database.DatabaseDataSet.getTableMetaData(DatabaseDataSet.java:282)
	at org.dbunit.operation.AbstractOperation.getOperationMetaData(AbstractOperation.java:80)
	at org.dbunit.operation.RefreshOperation.execute(RefreshOperation.java:98)
	at org.openmrs.test.BaseContextSensitiveTest.executeDataSet(BaseContextSensitiveTest.java:682)
	at org.openmrs.test.BaseContextSensitiveTest.executeDataSet(BaseContextSensitiveTest.java:577)
	at org.openmrs.test.BaseContextSensitiveTest.initializeInMemoryDatabase(BaseContextSensitiveTest.java:489)
	at org.openmrs.test.BaseContextSensitiveTest.baseSetupWithStandardDataAndAuthentication(BaseContextSensitiveTest.java:778)
(33 more lines...)
Collapse Failed ShowGraphServletTest getChart_shouldSetValueAxisLabelToGivenUnits History
< 1 sec
org.dbunit.dataset.NoSuchTableException: person
	at org.dbunit.database.DatabaseDataSet.getTableMetaData(DatabaseDataSet.java:282)
	at org.dbunit.operation.AbstractOperation.getOperationMetaData(AbstractOperation.java:80)
	at org.dbunit.operation.RefreshOperation.execute(RefreshOperation.java:98)
	at org.openmrs.test.BaseContextSensitiveTest.executeDataSet(BaseContextSensitiveTest.java:682)
	at org.openmrs.test.BaseContextSensitiveTest.executeDataSet(BaseContextSensitiveTest.java:577)
	at org.openmrs.test.BaseContextSensitiveTest.initializeInMemoryDatabase(BaseContextSensitiveTest.java:489)
	at org.openmrs.test.BaseContextSensitiveTest.baseSetupWithStandardDataAndAuthentication(BaseContextSensitiveTest.java:778)
(33 more lines...)
Collapse Failed ShowGraphServletTest getFromDate_shouldReturnOneYearPreviousToTodayIfParameterIsNull History
< 1 sec
org.dbunit.dataset.NoSuchTableException: person
	at org.dbunit.database.DatabaseDataSet.getTableMetaData(DatabaseDataSet.java:282)
	at org.dbunit.operation.AbstractOperation.getOperationMetaData(AbstractOperation.java:80)
	at org.dbunit.operation.RefreshOperation.execute(RefreshOperation.java:98)
	at org.openmrs.test.BaseContextSensitiveTest.executeDataSet(BaseContextSensitiveTest.java:682)
	at org.openmrs.test.BaseContextSensitiveTest.executeDataSet(BaseContextSensitiveTest.java:577)
	at org.openmrs.test.BaseContextSensitiveTest.initializeInMemoryDatabase(BaseContextSensitiveTest.java:489)
	at org.openmrs.test.BaseContextSensitiveTest.baseSetupWithStandardDataAndAuthentication(BaseContextSensitiveTest.java:778)
(33 more lines...)
Collapse Failed ShowGraphServletTest getFromDate_shouldReturnSameDateAsGivenStringParameter History
< 1 sec
org.dbunit.dataset.NoSuchTableException: person
	at org.dbunit.database.DatabaseDataSet.getTableMetaData(DatabaseDataSet.java:282)
	at org.dbunit.operation.AbstractOperation.getOperationMetaData(AbstractOperation.java:80)
	at org.dbunit.operation.RefreshOperation.execute(RefreshOperation.java:98)
	at org.openmrs.test.BaseContextSensitiveTest.executeDataSet(BaseContextSensitiveTest.java:682)
	at org.openmrs.test.BaseContextSensitiveTest.executeDataSet(BaseContextSensitiveTest.java:577)
	at org.openmrs.test.BaseContextSensitiveTest.initializeInMemoryDatabase(BaseContextSensitiveTest.java:489)
	at org.openmrs.test.BaseContextSensitiveTest.baseSetupWithStandardDataAndAuthentication(BaseContextSensitiveTest.java:778)
(33 more lines...)
Collapse Failed ShowGraphServletTest getToDate_shouldReturnDateOneDayAfterGivenStringDate History
< 1 sec
org.dbunit.dataset.NoSuchTableException: person
	at org.dbunit.database.DatabaseDataSet.getTableMetaData(DatabaseDataSet.java:282)
	at org.dbunit.operation.AbstractOperation.getOperationMetaData(AbstractOperation.java:80)
	at org.dbunit.operation.RefreshOperation.execute(RefreshOperation.java:98)
	at org.openmrs.test.BaseContextSensitiveTest.executeDataSet(BaseContextSensitiveTest.java:682)
	at org.openmrs.test.BaseContextSensitiveTest.executeDataSet(BaseContextSensitiveTest.java:577)
	at org.openmrs.test.BaseContextSensitiveTest.initializeInMemoryDatabase(BaseContextSensitiveTest.java:489)
	at org.openmrs.test.BaseContextSensitiveTest.baseSetupWithStandardDataAndAuthentication(BaseContextSensitiveTest.java:778)
(33 more lines...)
Collapse Failed ShowGraphServletTest getToDate_shouldReturnNextMonthsDateIfParameterIsNull History
1 sec
org.dbunit.dataset.NoSuchTableException: person
	at org.dbunit.database.DatabaseDataSet.getTableMetaData(DatabaseDataSet.java:282)
	at org.dbunit.operation.AbstractOperation.getOperationMetaData(AbstractOperation.java:80)
	at org.dbunit.operation.RefreshOperation.execute(RefreshOperation.java:98)
	at org.openmrs.test.BaseContextSensitiveTest.executeDataSet(BaseContextSensitiveTest.java:682)
	at org.openmrs.test.BaseContextSensitiveTest.executeDataSet(BaseContextSensitiveTest.java:577)
	at org.openmrs.test.BaseContextSensitiveTest.initializeInMemoryDatabase(BaseContextSensitiveTest.java:489)
	at org.openmrs.test.BaseContextSensitiveTest.baseSetupWithStandardDataAndAuthentication(BaseContextSensitiveTest.java:778)
(33 more lines...)
Collapse Failed ShowGraphServletTest getToDate_shouldSetHourMinuteAndSecondToZero History
1 sec
org.dbunit.dataset.NoSuchTableException: person
	at org.dbunit.database.DatabaseDataSet.getTableMetaData(DatabaseDataSet.java:282)
	at org.dbunit.operation.AbstractOperation.getOperationMetaData(AbstractOperation.java:80)
	at org.dbunit.operation.RefreshOperation.execute(RefreshOperation.java:98)
	at org.openmrs.test.BaseContextSensitiveTest.executeDataSet(BaseContextSensitiveTest.java:682)
	at org.openmrs.test.BaseContextSensitiveTest.executeDataSet(BaseContextSensitiveTest.java:577)
	at org.openmrs.test.BaseContextSensitiveTest.initializeInMemoryDatabase(BaseContextSensitiveTest.java:489)
	at org.openmrs.test.BaseContextSensitiveTest.baseSetupWithStandardDataAndAuthentication(BaseContextSensitiveTest.java:778)
(33 more lines...)
Collapse Failed ForEachEncounterTagTest doStartTag_shouldPassForAPatientWithNoEncounters History
< 1 sec
org.dbunit.dataset.NoSuchTableException: person
	at org.dbunit.database.DatabaseDataSet.getTableMetaData(DatabaseDataSet.java:282)
	at org.dbunit.operation.AbstractOperation.getOperationMetaData(AbstractOperation.java:80)
	at org.dbunit.operation.RefreshOperation.execute(RefreshOperation.java:98)
	at org.openmrs.test.BaseContextSensitiveTest.executeDataSet(BaseContextSensitiveTest.java:682)
	at org.openmrs.test.BaseContextSensitiveTest.executeDataSet(BaseContextSensitiveTest.java:577)
	at org.openmrs.test.BaseContextSensitiveTest.initializeInMemoryDatabase(BaseContextSensitiveTest.java:489)
	at org.openmrs.test.BaseContextSensitiveTest.baseSetupWithStandardDataAndAuthentication(BaseContextSensitiveTest.java:778)
(33 more lines...)
Collapse Failed ForEachEncounterTagTest doStartTag_shouldSortEncountersByEncounterDatetimeInDescendingOrder History
< 1 sec
org.dbunit.dataset.NoSuchTableException: person
	at org.dbunit.database.DatabaseDataSet.getTableMetaData(DatabaseDataSet.java:282)
	at org.dbunit.operation.AbstractOperation.getOperationMetaData(AbstractOperation.java:80)
	at org.dbunit.operation.RefreshOperation.execute(RefreshOperation.java:98)
	at org.openmrs.test.BaseContextSensitiveTest.executeDataSet(BaseContextSensitiveTest.java:682)
	at org.openmrs.test.BaseContextSensitiveTest.executeDataSet(BaseContextSensitiveTest.java:577)
	at org.openmrs.test.BaseContextSensitiveTest.initializeInMemoryDatabase(BaseContextSensitiveTest.java:489)
	at org.openmrs.test.BaseContextSensitiveTest.baseSetupWithStandardDataAndAuthentication(BaseContextSensitiveTest.java:778)
(33 more lines...)
Collapse Failed FormatTagTest doStartTag_shouldPrintAnyDomainObject History
< 1 sec
org.dbunit.dataset.NoSuchTableException: person
	at org.dbunit.database.DatabaseDataSet.getTableMetaData(DatabaseDataSet.java:282)
	at org.dbunit.operation.AbstractOperation.getOperationMetaData(AbstractOperation.java:80)
	at org.dbunit.operation.RefreshOperation.execute(RefreshOperation.java:98)
	at org.openmrs.test.BaseContextSensitiveTest.executeDataSet(BaseContextSensitiveTest.java:682)
	at org.openmrs.test.BaseContextSensitiveTest.executeDataSet(BaseContextSensitiveTest.java:577)
	at org.openmrs.test.BaseContextSensitiveTest.initializeInMemoryDatabase(BaseContextSensitiveTest.java:489)
	at org.openmrs.test.BaseContextSensitiveTest.baseSetupWithStandardDataAndAuthentication(BaseContextSensitiveTest.java:778)
(33 more lines...)
Collapse Failed FormatTagTest printConcept_shouldEscapeHtmlTags History
< 1 sec
org.dbunit.dataset.NoSuchTableException: person
	at org.dbunit.database.DatabaseDataSet.getTableMetaData(DatabaseDataSet.java:282)
	at org.dbunit.operation.AbstractOperation.getOperationMetaData(AbstractOperation.java:80)
	at org.dbunit.operation.RefreshOperation.execute(RefreshOperation.java:98)
	at org.openmrs.test.BaseContextSensitiveTest.executeDataSet(BaseContextSensitiveTest.java:682)
	at org.openmrs.test.BaseContextSensitiveTest.executeDataSet(BaseContextSensitiveTest.java:577)
	at org.openmrs.test.BaseContextSensitiveTest.initializeInMemoryDatabase(BaseContextSensitiveTest.java:489)
	at org.openmrs.test.BaseContextSensitiveTest.baseSetupWithStandardDataAndAuthentication(BaseContextSensitiveTest.java:778)
(33 more lines...)
Collapse Failed FormatTagTest printConcept_shouldPrintTheNameWithTheCorrectLocaleNameAndType History
< 1 sec
org.dbunit.dataset.NoSuchTableException: person
	at org.dbunit.database.DatabaseDataSet.getTableMetaData(DatabaseDataSet.java:282)
	at org.dbunit.operation.AbstractOperation.getOperationMetaData(AbstractOperation.java:80)
	at org.dbunit.operation.RefreshOperation.execute(RefreshOperation.java:98)
	at org.openmrs.test.BaseContextSensitiveTest.executeDataSet(BaseContextSensitiveTest.java:682)
	at org.openmrs.test.BaseContextSensitiveTest.executeDataSet(BaseContextSensitiveTest.java:577)
	at org.openmrs.test.BaseContextSensitiveTest.initializeInMemoryDatabase(BaseContextSensitiveTest.java:489)
	at org.openmrs.test.BaseContextSensitiveTest.baseSetupWithStandardDataAndAuthentication(BaseContextSensitiveTest.java:778)
(33 more lines...)
Collapse Failed OpenmrsMessageTagTest doEndTag_shouldEvaluateSpecifiedMessageResolvable History
< 1 sec
org.dbunit.dataset.NoSuchTableException: person
	at org.dbunit.database.DatabaseDataSet.getTableMetaData(DatabaseDataSet.java:282)
	at org.dbunit.operation.AbstractOperation.getOperationMetaData(AbstractOperation.java:80)
	at org.dbunit.operation.RefreshOperation.execute(RefreshOperation.java:98)
	at org.openmrs.test.BaseContextSensitiveTest.executeDataSet(BaseContextSensitiveTest.java:682)
	at org.openmrs.test.BaseContextSensitiveTest.executeDataSet(BaseContextSensitiveTest.java:577)
	at org.openmrs.test.BaseContextSensitiveTest.initializeInMemoryDatabase(BaseContextSensitiveTest.java:489)
	at org.openmrs.test.BaseContextSensitiveTest.baseSetupWithStandardDataAndAuthentication(BaseContextSensitiveTest.java:778)
(33 more lines...)
Collapse Failed OpenmrsMessageTagTest doEndTag_shouldIgnoreFallbacksIfTagLocaleDiffersFromContextLocale History
< 1 sec
org.dbunit.dataset.NoSuchTableException: person
	at org.dbunit.database.DatabaseDataSet.getTableMetaData(DatabaseDataSet.java:282)
	at org.dbunit.operation.AbstractOperation.getOperationMetaData(AbstractOperation.java:80)
	at org.dbunit.operation.RefreshOperation.execute(RefreshOperation.java:98)
	at org.openmrs.test.BaseContextSensitiveTest.executeDataSet(BaseContextSensitiveTest.java:682)
	at org.openmrs.test.BaseContextSensitiveTest.executeDataSet(BaseContextSensitiveTest.java:577)
	at org.openmrs.test.BaseContextSensitiveTest.initializeInMemoryDatabase(BaseContextSensitiveTest.java:489)
	at org.openmrs.test.BaseContextSensitiveTest.baseSetupWithStandardDataAndAuthentication(BaseContextSensitiveTest.java:778)
(33 more lines...)
Collapse Failed OpenmrsMessageTagTest doEndTag_shouldResolveMessageByCode History
< 1 sec
org.dbunit.dataset.NoSuchTableException: person
	at org.dbunit.database.DatabaseDataSet.getTableMetaData(DatabaseDataSet.java:282)
	at org.dbunit.operation.AbstractOperation.getOperationMetaData(AbstractOperation.java:80)
	at org.dbunit.operation.RefreshOperation.execute(RefreshOperation.java:98)
	at org.openmrs.test.BaseContextSensitiveTest.executeDataSet(BaseContextSensitiveTest.java:682)
	at org.openmrs.test.BaseContextSensitiveTest.executeDataSet(BaseContextSensitiveTest.java:577)
	at org.openmrs.test.BaseContextSensitiveTest.initializeInMemoryDatabase(BaseContextSensitiveTest.java:489)
	at org.openmrs.test.BaseContextSensitiveTest.baseSetupWithStandardDataAndAuthentication(BaseContextSensitiveTest.java:778)
(33 more lines...)
Collapse Failed OpenmrsMessageTagTest doEndTag_shouldResolveMessageInLocaleThatDifferentFromDefault History
< 1 sec
org.dbunit.dataset.NoSuchTableException: person
	at org.dbunit.database.DatabaseDataSet.getTableMetaData(DatabaseDataSet.java:282)
	at org.dbunit.operation.AbstractOperation.getOperationMetaData(AbstractOperation.java:80)
	at org.dbunit.operation.RefreshOperation.execute(RefreshOperation.java:98)
	at org.openmrs.test.BaseContextSensitiveTest.executeDataSet(BaseContextSensitiveTest.java:682)
	at org.openmrs.test.BaseContextSensitiveTest.executeDataSet(BaseContextSensitiveTest.java:577)
	at org.openmrs.test.BaseContextSensitiveTest.initializeInMemoryDatabase(BaseContextSensitiveTest.java:489)
	at org.openmrs.test.BaseContextSensitiveTest.baseSetupWithStandardDataAndAuthentication(BaseContextSensitiveTest.java:778)
(33 more lines...)
Collapse Failed OpenmrsMessageTagTest doEndTag_shouldReturnCodeIfNoMessageResolved History
< 1 sec
org.dbunit.dataset.NoSuchTableException: person
	at org.dbunit.database.DatabaseDataSet.getTableMetaData(DatabaseDataSet.java:282)
	at org.dbunit.operation.AbstractOperation.getOperationMetaData(AbstractOperation.java:80)
	at org.dbunit.operation.RefreshOperation.execute(RefreshOperation.java:98)
	at org.openmrs.test.BaseContextSensitiveTest.executeDataSet(BaseContextSensitiveTest.java:682)
	at org.openmrs.test.BaseContextSensitiveTest.executeDataSet(BaseContextSensitiveTest.java:577)
	at org.openmrs.test.BaseContextSensitiveTest.initializeInMemoryDatabase(BaseContextSensitiveTest.java:489)
	at org.openmrs.test.BaseContextSensitiveTest.baseSetupWithStandardDataAndAuthentication(BaseContextSensitiveTest.java:778)
(33 more lines...)
Collapse Failed OpenmrsMessageTagTest doEndTag_shouldUseBodyContentAsFallbackIfNoMessageResolved History
< 1 sec
org.dbunit.dataset.NoSuchTableException: person
	at org.dbunit.database.DatabaseDataSet.getTableMetaData(DatabaseDataSet.java:282)
	at org.dbunit.operation.AbstractOperation.getOperationMetaData(AbstractOperation.java:80)
	at org.dbunit.operation.RefreshOperation.execute(RefreshOperation.java:98)
	at org.openmrs.test.BaseContextSensitiveTest.executeDataSet(BaseContextSensitiveTest.java:682)
	at org.openmrs.test.BaseContextSensitiveTest.executeDataSet(BaseContextSensitiveTest.java:577)
	at org.openmrs.test.BaseContextSensitiveTest.initializeInMemoryDatabase(BaseContextSensitiveTest.java:489)
	at org.openmrs.test.BaseContextSensitiveTest.baseSetupWithStandardDataAndAuthentication(BaseContextSensitiveTest.java:778)
(33 more lines...)
Collapse Failed OpenmrsMessageTagTest doEndTag_shouldUseBodyContentInPriorToTextAttributeAsFallbackIfNoMessageResolved History
< 1 sec
org.dbunit.dataset.NoSuchTableException: person
	at org.dbunit.database.DatabaseDataSet.getTableMetaData(DatabaseDataSet.java:282)
	at org.dbunit.operation.AbstractOperation.getOperationMetaData(AbstractOperation.java:80)
	at org.dbunit.operation.RefreshOperation.execute(RefreshOperation.java:98)
	at org.openmrs.test.BaseContextSensitiveTest.executeDataSet(BaseContextSensitiveTest.java:682)
	at org.openmrs.test.BaseContextSensitiveTest.executeDataSet(BaseContextSensitiveTest.java:577)
	at org.openmrs.test.BaseContextSensitiveTest.initializeInMemoryDatabase(BaseContextSensitiveTest.java:489)
	at org.openmrs.test.BaseContextSensitiveTest.baseSetupWithStandardDataAndAuthentication(BaseContextSensitiveTest.java:778)
(33 more lines...)
Collapse Failed OpenmrsMessageTagTest doEndTag_shouldUseTextAttributeAsFallbackIfNoMessageResolved History
< 1 sec
org.dbunit.dataset.NoSuchTableException: person
	at org.dbunit.database.DatabaseDataSet.getTableMetaData(DatabaseDataSet.java:282)
	at org.dbunit.operation.AbstractOperation.getOperationMetaData(AbstractOperation.java:80)
	at org.dbunit.operation.RefreshOperation.execute(RefreshOperation.java:98)
	at org.openmrs.test.BaseContextSensitiveTest.executeDataSet(BaseContextSensitiveTest.java:682)
	at org.openmrs.test.BaseContextSensitiveTest.executeDataSet(BaseContextSensitiveTest.java:577)
	at org.openmrs.test.BaseContextSensitiveTest.initializeInMemoryDatabase(BaseContextSensitiveTest.java:489)
	at org.openmrs.test.BaseContextSensitiveTest.baseSetupWithStandardDataAndAuthentication(BaseContextSensitiveTest.java:778)
(33 more lines...)
Collapse Failed RequireTagTest doStartTag_shouldAllowUserToHaveAnyPrivilege History
< 1 sec
org.dbunit.dataset.NoSuchTableException: person
	at org.dbunit.database.DatabaseDataSet.getTableMetaData(DatabaseDataSet.java:282)
	at org.dbunit.operation.AbstractOperation.getOperationMetaData(AbstractOperation.java:80)
	at org.dbunit.operation.RefreshOperation.execute(RefreshOperation.java:98)
	at org.openmrs.test.BaseContextSensitiveTest.executeDataSet(BaseContextSensitiveTest.java:682)
	at org.openmrs.test.BaseContextSensitiveTest.executeDataSet(BaseContextSensitiveTest.java:577)
	at org.openmrs.test.BaseContextSensitiveTest.initializeInMemoryDatabase(BaseContextSensitiveTest.java:489)
	at org.openmrs.web.taglib.RequireTagTest.doStartTag_shouldAllowUserToHaveAnyPrivilege(RequireTagTest.java:41)
(35 more lines...)
Collapse Failed RequireTagTest doStartTag_shouldAllowUserWithAllPrivileges History
< 1 sec
org.dbunit.dataset.NoSuchTableException: person
	at org.dbunit.database.DatabaseDataSet.getTableMetaData(DatabaseDataSet.java:282)
	at org.dbunit.operation.AbstractOperation.getOperationMetaData(AbstractOperation.java:80)
	at org.dbunit.operation.RefreshOperation.execute(RefreshOperation.java:98)
	at org.openmrs.test.BaseContextSensitiveTest.executeDataSet(BaseContextSensitiveTest.java:682)
	at org.openmrs.test.BaseContextSensitiveTest.executeDataSet(BaseContextSensitiveTest.java:577)
	at org.openmrs.test.BaseContextSensitiveTest.initializeInMemoryDatabase(BaseContextSensitiveTest.java:489)
	at org.openmrs.web.taglib.RequireTagTest.doStartTag_shouldAllowUserWithAllPrivileges(RequireTagTest.java:62)
(35 more lines...)
Collapse Failed RequireTagTest doStartTag_shouldAllowUserWithThePrivilege History
< 1 sec
org.dbunit.dataset.NoSuchTableException: person
	at org.dbunit.database.DatabaseDataSet.getTableMetaData(DatabaseDataSet.java:282)
	at org.dbunit.operation.AbstractOperation.getOperationMetaData(AbstractOperation.java:80)
	at org.dbunit.operation.RefreshOperation.execute(RefreshOperation.java:98)
	at org.openmrs.test.BaseContextSensitiveTest.executeDataSet(BaseContextSensitiveTest.java:682)
	at org.openmrs.test.BaseContextSensitiveTest.executeDataSet(BaseContextSensitiveTest.java:577)
	at org.openmrs.test.BaseContextSensitiveTest.initializeInMemoryDatabase(BaseContextSensitiveTest.java:489)
	at org.openmrs.web.taglib.RequireTagTest.doStartTag_shouldAllowUserWithThePrivilege(RequireTagTest.java:83)
(35 more lines...)
Collapse Failed RequireTagTest doStartTag_shouldRejectUserWithoutAllOfThePrivileges History
< 1 sec
org.dbunit.dataset.NoSuchTableException: person
	at org.dbunit.database.DatabaseDataSet.getTableMetaData(DatabaseDataSet.java:282)
	at org.dbunit.operation.AbstractOperation.getOperationMetaData(AbstractOperation.java:80)
	at org.dbunit.operation.RefreshOperation.execute(RefreshOperation.java:98)
	at org.openmrs.test.BaseContextSensitiveTest.executeDataSet(BaseContextSensitiveTest.java:682)
	at org.openmrs.test.BaseContextSensitiveTest.executeDataSet(BaseContextSensitiveTest.java:577)
	at org.openmrs.test.BaseContextSensitiveTest.initializeInMemoryDatabase(BaseContextSensitiveTest.java:489)
	at org.openmrs.web.taglib.RequireTagTest.doStartTag_shouldRejectUserWithoutAllOfThePrivileges(RequireTagTest.java:104)
(35 more lines...)
Collapse Failed RequireTagTest doStartTag_shouldRejectUserWithoutAnyOfThePrivileges History
< 1 sec
org.dbunit.dataset.NoSuchTableException: person
	at org.dbunit.database.DatabaseDataSet.getTableMetaData(DatabaseDataSet.java:282)
	at org.dbunit.operation.AbstractOperation.getOperationMetaData(AbstractOperation.java:80)
	at org.dbunit.operation.RefreshOperation.execute(RefreshOperation.java:98)
	at org.openmrs.test.BaseContextSensitiveTest.executeDataSet(BaseContextSensitiveTest.java:682)
	at org.openmrs.test.BaseContextSensitiveTest.executeDataSet(BaseContextSensitiveTest.java:577)
	at org.openmrs.test.BaseContextSensitiveTest.initializeInMemoryDatabase(BaseContextSensitiveTest.java:489)
	at org.openmrs.web.taglib.RequireTagTest.doStartTag_shouldRejectUserWithoutAnyOfThePrivileges(RequireTagTest.java:125)
(35 more lines...)
Collapse Failed RequireTagTest doStartTag_shouldRejectUserWithoutThePrivilege History
< 1 sec
org.dbunit.dataset.NoSuchTableException: person
	at org.dbunit.database.DatabaseDataSet.getTableMetaData(DatabaseDataSet.java:282)
	at org.dbunit.operation.AbstractOperation.getOperationMetaData(AbstractOperation.java:80)
	at org.dbunit.operation.RefreshOperation.execute(RefreshOperation.java:98)
	at org.openmrs.test.BaseContextSensitiveTest.executeDataSet(BaseContextSensitiveTest.java:682)
	at org.openmrs.test.BaseContextSensitiveTest.executeDataSet(BaseContextSensitiveTest.java:577)
	at org.openmrs.test.BaseContextSensitiveTest.initializeInMemoryDatabase(BaseContextSensitiveTest.java:489)
	at org.openmrs.web.taglib.RequireTagTest.doStartTag_shouldRejectUserWithoutThePrivilege(RequireTagTest.java:146)
(35 more lines...)
Collapse Failed RequireTagTest doStartTag_shouldSetTheRefererAsTheDeniedPageUrlIfNoRedirectUrlIsSpecified History
1 sec
org.dbunit.dataset.NoSuchTableException: person
	at org.dbunit.database.DatabaseDataSet.getTableMetaData(DatabaseDataSet.java:282)
	at org.dbunit.operation.AbstractOperation.getOperationMetaData(AbstractOperation.java:80)
	at org.dbunit.operation.RefreshOperation.execute(RefreshOperation.java:98)
	at org.openmrs.test.BaseContextSensitiveTest.executeDataSet(BaseContextSensitiveTest.java:682)
	at org.openmrs.test.BaseContextSensitiveTest.executeDataSet(BaseContextSensitiveTest.java:577)
	at org.openmrs.test.BaseContextSensitiveTest.initializeInMemoryDatabase(BaseContextSensitiveTest.java:489)
	at org.openmrs.web.taglib.RequireTagTest.doStartTag_shouldSetTheRefererAsTheDeniedPageUrlIfNoRedirectUrlIsSpecified(RequireTagTest.java:196)
(35 more lines...)
Collapse Failed RequireTagTest doStartTag_shouldSetTheRightSessionAttributesIfTheAuthenticatedUserMissesSomePrivileges History
< 1 sec
org.dbunit.dataset.NoSuchTableException: person
	at org.dbunit.database.DatabaseDataSet.getTableMetaData(DatabaseDataSet.java:282)
	at org.dbunit.operation.AbstractOperation.getOperationMetaData(AbstractOperation.java:80)
	at org.dbunit.operation.RefreshOperation.execute(RefreshOperation.java:98)
	at org.openmrs.test.BaseContextSensitiveTest.executeDataSet(BaseContextSensitiveTest.java:682)
	at org.openmrs.test.BaseContextSensitiveTest.executeDataSet(BaseContextSensitiveTest.java:577)
	at org.openmrs.test.BaseContextSensitiveTest.initializeInMemoryDatabase(BaseContextSensitiveTest.java:489)
	at org.openmrs.web.taglib.RequireTagTest.doStartTag_shouldSetTheRightSessionAttributesIfTheAuthenticatedUserMissesSomePrivileges(RequireTagTest.java:167)
(35 more lines...)