Plan for OpenMRS Core 1.12.x

Build: #87 failed Changes by dkayiwa <kayiwadaniel@gmail.com>

Stages & jobs

  1. Build and Test

  2. Deploy

  3. Release

    Requires a user to start manually

Build result summary

Details

Completed
Duration
5 minutes
Labels
None
Revisions
Git
9cfb280df56e9c6c2dd5c739be96e3c6219d040d 9cfb280df56e9c6c2dd5c739be96e3c6219d040d
Release scripts
cb25741d3d6fa89e79187ec68f849228fcafce94 cb25741d3d6fa89e79187ec68f849228fcafce94
Total tests
3104
Fixed in
#88 (Changes by dkayiwa <kayiwadaniel@gmail.com>)

Tests

Responsible

No one has taken responsibility for this failure

Code commits

Git
Author Commit Message Commit date
dkayiwa <kayiwadaniel@gmail.com> dkayiwa <kayiwadaniel@gmail.com> 9cfb280df56e9c6c2dd5c739be96e3c6219d040d 9cfb280df56e9c6c2dd5c739be96e3c6219d040d test module1 is not expected to start before test module5 - TRUNK-5216 (cherry picked from commit 449e854c4a573f4d1048b383924c2b1b47fccbc1)
(cherry picked from commit cf8fc33f188f9424afa8aeae54613c1e66bf3462)
(cherry picked from commit ba13f07dc7b9c96ed12d51e2085b190ba785b179)
dkayiwa <kayiwadaniel@gmail.com> dkayiwa <kayiwadaniel@gmail.com> 4f7762d2534296b8e416b934fddc261336bdca67 4f7762d2534296b8e416b934fddc261336bdca67 StartModule cannot be used with more than one test case - TRUNK-5216 (cherry picked from commit 95b6148964ebcc435e86bbbdee374904d1a3429e)
(cherry picked from commit 712a688e8dc70f07c3cf02c595ccfca765039ff9)
(cherry picked from commit 833d6b97b1b510344322ed0e3e0238b6abe83d72)

Tests

New test failures 7
Status Test View job Duration
Collapse Failed SerializedObjectDAOTest getAllObjects_shouldReturnAllSavedObjectsWithTheGivenTypeAndPartialName History
Build and Test < 1 sec
org.openmrs.api.db.DAOException: Unable to deserialize object: Serialized org.openmrs.report.ReportSchema named <TestReport>
	at org.openmrs.api.db.hibernate.HibernateSerializedObjectDAO.convertSerializedObject(HibernateSerializedObjectDAO.java:300)
	at org.openmrs.api.db.hibernate.HibernateSerializedObjectDAO.getAllObjectsByName(HibernateSerializedObjectDAO.java:133)
	at org.openmrs.api.db.SerializedObjectDAOTest.getAllObjects_shouldReturnAllSavedObjectsWithTheGivenTypeAndPartialName(SerializedObjectDAOTest.java:124)
	at sun.reflect.NativeMethodAccessorImpl.invoke0(Native Method)
	at sun.reflect.NativeMethodAccessorImpl.invoke(NativeMethodAccessorImpl.java:57)
	at sun.reflect.DelegatingMethodAccessorImpl.invoke(DelegatingMethodAccessorImpl.java:43)
	at java.lang.reflect.Method.invoke(Method.java:606)
(34 more lines...)
Collapse Failed SerializedObjectDAOTest getObject_shouldReturnTheSavedObject History
Build and Test < 1 sec
org.openmrs.api.db.DAOException: Unable to deserialize object: Serialized org.openmrs.report.ReportSchema named <TestReport>
	at org.openmrs.api.db.hibernate.HibernateSerializedObjectDAO.convertSerializedObject(HibernateSerializedObjectDAO.java:300)
	at org.openmrs.api.db.hibernate.HibernateSerializedObjectDAO.getObject(HibernateSerializedObjectDAO.java:82)
	at org.openmrs.api.db.SerializedObjectDAOTest.getObject_shouldReturnTheSavedObject(SerializedObjectDAOTest.java:60)
	at sun.reflect.NativeMethodAccessorImpl.invoke0(Native Method)
	at sun.reflect.NativeMethodAccessorImpl.invoke(NativeMethodAccessorImpl.java:57)
	at sun.reflect.DelegatingMethodAccessorImpl.invoke(DelegatingMethodAccessorImpl.java:43)
	at java.lang.reflect.Method.invoke(Method.java:606)
(34 more lines...)
Collapse Failed SerializedObjectDAOTest getAllObjects_shouldReturnAllSavedObjectsOfThePassedType History
Build and Test < 1 sec
org.openmrs.api.db.DAOException: Unable to deserialize object: Serialized org.openmrs.report.ReportSchema named <TestReport>
	at org.openmrs.api.db.hibernate.HibernateSerializedObjectDAO.convertSerializedObject(HibernateSerializedObjectDAO.java:300)
	at org.openmrs.api.db.hibernate.HibernateSerializedObjectDAO.getAllObjects(HibernateSerializedObjectDAO.java:158)
	at org.openmrs.api.db.hibernate.HibernateSerializedObjectDAO.getAllObjects(HibernateSerializedObjectDAO.java:167)
	at org.openmrs.api.db.SerializedObjectDAOTest.getAllObjects_shouldReturnAllSavedObjectsOfThePassedType(SerializedObjectDAOTest.java:100)
	at sun.reflect.NativeMethodAccessorImpl.invoke0(Native Method)
	at sun.reflect.NativeMethodAccessorImpl.invoke(NativeMethodAccessorImpl.java:57)
	at sun.reflect.DelegatingMethodAccessorImpl.invoke(DelegatingMethodAccessorImpl.java:43)
(35 more lines...)
Collapse Failed SerializedObjectDAOTest getAllObjects_shouldReturnOnlyNonRetiredObjectsOfThePassedTypeIfNotIncludeRetired History
Build and Test < 1 sec
org.openmrs.api.db.DAOException: Unable to deserialize object: Serialized org.openmrs.report.ReportSchema named <TestReport>
	at org.openmrs.api.db.hibernate.HibernateSerializedObjectDAO.convertSerializedObject(HibernateSerializedObjectDAO.java:300)
	at org.openmrs.api.db.hibernate.HibernateSerializedObjectDAO.getAllObjects(HibernateSerializedObjectDAO.java:158)
	at org.openmrs.api.db.SerializedObjectDAOTest.getAllObjects_shouldReturnOnlyNonRetiredObjectsOfThePassedTypeIfNotIncludeRetired(SerializedObjectDAOTest.java:107)
	at sun.reflect.NativeMethodAccessorImpl.invoke0(Native Method)
	at sun.reflect.NativeMethodAccessorImpl.invoke(NativeMethodAccessorImpl.java:57)
	at sun.reflect.DelegatingMethodAccessorImpl.invoke(DelegatingMethodAccessorImpl.java:43)
	at java.lang.reflect.Method.invoke(Method.java:606)
(34 more lines...)
Collapse Failed SerializedObjectDAOTest getObjectByUuid_shouldReturnTheSavedObject History
Build and Test < 1 sec
org.openmrs.api.db.DAOException: Unable to deserialize object: Serialized org.openmrs.report.ReportSchema named <TestReport2>
	at org.openmrs.api.db.hibernate.HibernateSerializedObjectDAO.convertSerializedObject(HibernateSerializedObjectDAO.java:300)
	at org.openmrs.api.db.hibernate.HibernateSerializedObjectDAO.getObjectByUuid(HibernateSerializedObjectDAO.java:104)
	at org.openmrs.api.db.SerializedObjectDAOTest.getObjectByUuid_shouldReturnTheSavedObject(SerializedObjectDAOTest.java:68)
	at sun.reflect.NativeMethodAccessorImpl.invoke0(Native Method)
	at sun.reflect.NativeMethodAccessorImpl.invoke(NativeMethodAccessorImpl.java:57)
	at sun.reflect.DelegatingMethodAccessorImpl.invoke(DelegatingMethodAccessorImpl.java:43)
	at java.lang.reflect.Method.invoke(Method.java:606)
(34 more lines...)
Collapse Failed SerializedObjectDAOTest purgeObject_shouldDeleteTheObjectWithThePassedId History
Build and Test < 1 sec
org.openmrs.api.db.DAOException: Unable to deserialize object: Serialized org.openmrs.report.ReportSchema named <TestReport>
	at org.openmrs.api.db.hibernate.HibernateSerializedObjectDAO.convertSerializedObject(HibernateSerializedObjectDAO.java:300)
	at org.openmrs.api.db.hibernate.HibernateSerializedObjectDAO.getAllObjects(HibernateSerializedObjectDAO.java:158)
	at org.openmrs.api.db.hibernate.HibernateSerializedObjectDAO.getAllObjects(HibernateSerializedObjectDAO.java:167)
	at org.openmrs.api.db.SerializedObjectDAOTest.purgeObject_shouldDeleteTheObjectWithThePassedId(SerializedObjectDAOTest.java:131)
	at sun.reflect.NativeMethodAccessorImpl.invoke0(Native Method)
	at sun.reflect.NativeMethodAccessorImpl.invoke(NativeMethodAccessorImpl.java:57)
	at sun.reflect.DelegatingMethodAccessorImpl.invoke(DelegatingMethodAccessorImpl.java:43)
(35 more lines...)
Collapse Failed SerializedObjectDAOTest getAllObjects_shouldReturnAllSavedObjectsWithTheGivenTypeAndExactName History
Build and Test < 1 sec
org.openmrs.api.db.DAOException: Unable to deserialize object: Serialized org.openmrs.report.ReportSchema named <TestReport>
	at org.openmrs.api.db.hibernate.HibernateSerializedObjectDAO.convertSerializedObject(HibernateSerializedObjectDAO.java:300)
	at org.openmrs.api.db.hibernate.HibernateSerializedObjectDAO.getAllObjectsByName(HibernateSerializedObjectDAO.java:133)
	at org.openmrs.api.db.SerializedObjectDAOTest.getAllObjects_shouldReturnAllSavedObjectsWithTheGivenTypeAndExactName(SerializedObjectDAOTest.java:116)
	at sun.reflect.NativeMethodAccessorImpl.invoke0(Native Method)
	at sun.reflect.NativeMethodAccessorImpl.invoke(NativeMethodAccessorImpl.java:57)
	at sun.reflect.DelegatingMethodAccessorImpl.invoke(DelegatingMethodAccessorImpl.java:43)
	at java.lang.reflect.Method.invoke(Method.java:606)
(34 more lines...)

Jira issues

IssueDescriptionStatus
Unknown Issue TypeTRUNK-5216Could not obtain issue details from Jira