Plan for OpenMRS Core 1.12.x

Build: #87 failed Changes by dkayiwa <kayiwadaniel@gmail.com>

Stages & jobs

  1. Build and Test

  2. Deploy

  3. Release

    Requires a user to start manually

Test results

  • 3,104 tests in total
  • 7 tests failed
  • 7 failures are new
  • 28 tests were quarantined / skipped
  • 5 minutes taken in total.
New test failures 7
Status Test View job Duration
Collapse Failed SerializedObjectDAOTest getAllObjects_shouldReturnAllSavedObjectsWithTheGivenTypeAndPartialName History
Build and Test < 1 sec
org.openmrs.api.db.DAOException: Unable to deserialize object: Serialized org.openmrs.report.ReportSchema named <TestReport>
	at org.openmrs.api.db.hibernate.HibernateSerializedObjectDAO.convertSerializedObject(HibernateSerializedObjectDAO.java:300)
	at org.openmrs.api.db.hibernate.HibernateSerializedObjectDAO.getAllObjectsByName(HibernateSerializedObjectDAO.java:133)
	at org.openmrs.api.db.SerializedObjectDAOTest.getAllObjects_shouldReturnAllSavedObjectsWithTheGivenTypeAndPartialName(SerializedObjectDAOTest.java:124)
	at sun.reflect.NativeMethodAccessorImpl.invoke0(Native Method)
	at sun.reflect.NativeMethodAccessorImpl.invoke(NativeMethodAccessorImpl.java:57)
	at sun.reflect.DelegatingMethodAccessorImpl.invoke(DelegatingMethodAccessorImpl.java:43)
	at java.lang.reflect.Method.invoke(Method.java:606)
(34 more lines...)
Collapse Failed SerializedObjectDAOTest getObject_shouldReturnTheSavedObject History
Build and Test < 1 sec
org.openmrs.api.db.DAOException: Unable to deserialize object: Serialized org.openmrs.report.ReportSchema named <TestReport>
	at org.openmrs.api.db.hibernate.HibernateSerializedObjectDAO.convertSerializedObject(HibernateSerializedObjectDAO.java:300)
	at org.openmrs.api.db.hibernate.HibernateSerializedObjectDAO.getObject(HibernateSerializedObjectDAO.java:82)
	at org.openmrs.api.db.SerializedObjectDAOTest.getObject_shouldReturnTheSavedObject(SerializedObjectDAOTest.java:60)
	at sun.reflect.NativeMethodAccessorImpl.invoke0(Native Method)
	at sun.reflect.NativeMethodAccessorImpl.invoke(NativeMethodAccessorImpl.java:57)
	at sun.reflect.DelegatingMethodAccessorImpl.invoke(DelegatingMethodAccessorImpl.java:43)
	at java.lang.reflect.Method.invoke(Method.java:606)
(34 more lines...)
Collapse Failed SerializedObjectDAOTest getAllObjects_shouldReturnAllSavedObjectsOfThePassedType History
Build and Test < 1 sec
org.openmrs.api.db.DAOException: Unable to deserialize object: Serialized org.openmrs.report.ReportSchema named <TestReport>
	at org.openmrs.api.db.hibernate.HibernateSerializedObjectDAO.convertSerializedObject(HibernateSerializedObjectDAO.java:300)
	at org.openmrs.api.db.hibernate.HibernateSerializedObjectDAO.getAllObjects(HibernateSerializedObjectDAO.java:158)
	at org.openmrs.api.db.hibernate.HibernateSerializedObjectDAO.getAllObjects(HibernateSerializedObjectDAO.java:167)
	at org.openmrs.api.db.SerializedObjectDAOTest.getAllObjects_shouldReturnAllSavedObjectsOfThePassedType(SerializedObjectDAOTest.java:100)
	at sun.reflect.NativeMethodAccessorImpl.invoke0(Native Method)
	at sun.reflect.NativeMethodAccessorImpl.invoke(NativeMethodAccessorImpl.java:57)
	at sun.reflect.DelegatingMethodAccessorImpl.invoke(DelegatingMethodAccessorImpl.java:43)
(35 more lines...)
Collapse Failed SerializedObjectDAOTest getAllObjects_shouldReturnOnlyNonRetiredObjectsOfThePassedTypeIfNotIncludeRetired History
Build and Test < 1 sec
org.openmrs.api.db.DAOException: Unable to deserialize object: Serialized org.openmrs.report.ReportSchema named <TestReport>
	at org.openmrs.api.db.hibernate.HibernateSerializedObjectDAO.convertSerializedObject(HibernateSerializedObjectDAO.java:300)
	at org.openmrs.api.db.hibernate.HibernateSerializedObjectDAO.getAllObjects(HibernateSerializedObjectDAO.java:158)
	at org.openmrs.api.db.SerializedObjectDAOTest.getAllObjects_shouldReturnOnlyNonRetiredObjectsOfThePassedTypeIfNotIncludeRetired(SerializedObjectDAOTest.java:107)
	at sun.reflect.NativeMethodAccessorImpl.invoke0(Native Method)
	at sun.reflect.NativeMethodAccessorImpl.invoke(NativeMethodAccessorImpl.java:57)
	at sun.reflect.DelegatingMethodAccessorImpl.invoke(DelegatingMethodAccessorImpl.java:43)
	at java.lang.reflect.Method.invoke(Method.java:606)
(34 more lines...)
Collapse Failed SerializedObjectDAOTest getObjectByUuid_shouldReturnTheSavedObject History
Build and Test < 1 sec
org.openmrs.api.db.DAOException: Unable to deserialize object: Serialized org.openmrs.report.ReportSchema named <TestReport2>
	at org.openmrs.api.db.hibernate.HibernateSerializedObjectDAO.convertSerializedObject(HibernateSerializedObjectDAO.java:300)
	at org.openmrs.api.db.hibernate.HibernateSerializedObjectDAO.getObjectByUuid(HibernateSerializedObjectDAO.java:104)
	at org.openmrs.api.db.SerializedObjectDAOTest.getObjectByUuid_shouldReturnTheSavedObject(SerializedObjectDAOTest.java:68)
	at sun.reflect.NativeMethodAccessorImpl.invoke0(Native Method)
	at sun.reflect.NativeMethodAccessorImpl.invoke(NativeMethodAccessorImpl.java:57)
	at sun.reflect.DelegatingMethodAccessorImpl.invoke(DelegatingMethodAccessorImpl.java:43)
	at java.lang.reflect.Method.invoke(Method.java:606)
(34 more lines...)
Collapse Failed SerializedObjectDAOTest purgeObject_shouldDeleteTheObjectWithThePassedId History
Build and Test < 1 sec
org.openmrs.api.db.DAOException: Unable to deserialize object: Serialized org.openmrs.report.ReportSchema named <TestReport>
	at org.openmrs.api.db.hibernate.HibernateSerializedObjectDAO.convertSerializedObject(HibernateSerializedObjectDAO.java:300)
	at org.openmrs.api.db.hibernate.HibernateSerializedObjectDAO.getAllObjects(HibernateSerializedObjectDAO.java:158)
	at org.openmrs.api.db.hibernate.HibernateSerializedObjectDAO.getAllObjects(HibernateSerializedObjectDAO.java:167)
	at org.openmrs.api.db.SerializedObjectDAOTest.purgeObject_shouldDeleteTheObjectWithThePassedId(SerializedObjectDAOTest.java:131)
	at sun.reflect.NativeMethodAccessorImpl.invoke0(Native Method)
	at sun.reflect.NativeMethodAccessorImpl.invoke(NativeMethodAccessorImpl.java:57)
	at sun.reflect.DelegatingMethodAccessorImpl.invoke(DelegatingMethodAccessorImpl.java:43)
(35 more lines...)
Collapse Failed SerializedObjectDAOTest getAllObjects_shouldReturnAllSavedObjectsWithTheGivenTypeAndExactName History
Build and Test < 1 sec
org.openmrs.api.db.DAOException: Unable to deserialize object: Serialized org.openmrs.report.ReportSchema named <TestReport>
	at org.openmrs.api.db.hibernate.HibernateSerializedObjectDAO.convertSerializedObject(HibernateSerializedObjectDAO.java:300)
	at org.openmrs.api.db.hibernate.HibernateSerializedObjectDAO.getAllObjectsByName(HibernateSerializedObjectDAO.java:133)
	at org.openmrs.api.db.SerializedObjectDAOTest.getAllObjects_shouldReturnAllSavedObjectsWithTheGivenTypeAndExactName(SerializedObjectDAOTest.java:116)
	at sun.reflect.NativeMethodAccessorImpl.invoke0(Native Method)
	at sun.reflect.NativeMethodAccessorImpl.invoke(NativeMethodAccessorImpl.java:57)
	at sun.reflect.DelegatingMethodAccessorImpl.invoke(DelegatingMethodAccessorImpl.java:43)
	at java.lang.reflect.Method.invoke(Method.java:606)
(34 more lines...)
Skipped tests 28
Status Test Failing since View job
Skipped AdministrationServiceTest getPresentationLocales_shouldReturnAtLeastOneLocaleIfNoLocalesDefinedInDatabaseYet History
Build and Test
Skipped AdministrationServiceTest setImplementationId_shouldCreateImplementationIdInDatabase History
Build and Test
Skipped AdministrationServiceTest setImplementationId_shouldSetUuidOnImplementationIdGlobalProperty History
Build and Test
Skipped AdministrationServiceTest setImplementationId_shouldOverwriteImplementationIdInDatabaseIfExists History
Build and Test
Skipped ConceptServiceTest saveConcept_shouldNotSetAuditInfoIfTheConceptIsNotEdited History
Build and Test
Skipped EncounterServiceTest getEncounters_shouldNotReturnVoidedEncountersIfIncludeVoidedIsSetToTrue History
Build and Test
Skipped EncounterServiceTest saveEncounter_shouldVoidAndCreateNewObsWhenSavingEncounter History
Build and Test
Skipped EncounterServiceTest getEncounters_shouldGetAllTheUniqueEncountersThatMatchTheSpecifiedParameterValues History
Build and Test
Skipped NoteServiceTest org.openmrs.api.NoteServiceTest History
Build and Test
Skipped OpenmrsServiceTest shouldCheckThatAMethodIsNotRolledBackInCaseOfAnErrorInAnotherInvokedInsideIt History
Build and Test
Skipped PatientServiceTest voidPatient_shouldReturnNullWhenPatientIsNull History
Build and Test
Skipped PatientServiceTest checkPatientIdentifiers_shouldThrowErrorWhenPatientHasIdenticalIdentifiers History
Build and Test
Skipped ProviderServiceTest getCountOfProviders_shouldIncludeRetiredProvidersIfIncludeRetiredIsSetToTrue History
Build and Test
Skipped ProviderServiceTest getCountOfProviders_shouldExcludeRetiredProviders History
Build and Test
Skipped UserServiceTest changeQuestionAnswer_shouldChangeTheSecretQuestionAndAnswerForGivenUser History
Build and Test
Skipped ConceptDAOTest getConcepts_shouldReturnCorrectResultsIfAConceptNameContainsSameWordMoreThanOnce History
Build and Test
Skipped ConceptDAOTest getConcepts_shouldReturnCorrectResultsForConceptWithNamesThatContainsWordsWithMoreWeight History
Build and Test
Skipped ArdenServiceTest compileFile_shouldGetAndParseMlms History
Build and Test
Skipped HL7ServiceTest processHL7InQueue_shouldParseOruR01MessageUsingOverriddenParserProvidedByAModule History
Build and Test
Skipped HL7ServiceTest processHL7Message_shouldParseMessageTypeSuppliedByModule History
Build and Test
Skipped ModuleUtilIT getURL_shouldReturnAnUpdateRdfPageForOldHttpsModuleUrls History
Integration Test
Skipped ModuleUtilIT getURL_shouldReturnAnUpdateRdfPageForModuleUrls History
Integration Test
Skipped ModuleUtilIT getURL_shouldReturnAnUpdateRdfPageForOldHttpsDevUrls History
Integration Test
Skipped SchedulerServiceTest org.openmrs.scheduler.SchedulerServiceTest History
Build and Test
Skipped ConceptReferenceTermValidatorTest validate_shouldFailIfTheNameIsNull History
Build and Test
Skipped ConceptReferenceTermValidatorTest validate_shouldFailIfTheNameIsAnEmptyString History
Build and Test
Skipped ConceptReferenceTermValidatorTest validate_shouldFailIfTheNameIsAWhiteSpaceCharacter History
Build and Test
Skipped VisitValidatorTest validate_shouldFailIfAnAttributeIsBad History
Build and Test