Plan for OpenMRS Core 1.12.x

Build: #87 failed

Job: Build and Test failed

Stages & jobs

  1. Build and Test

  2. Deploy

  3. Release

    Requires a user to start manually

Build log

The build generated 4,057 lines of output.The output is too long and has been truncated to the last 1,000 lines. Download or view full build log

13-Sep-2017 18:45:23         at org.junit.runners.ParentRunner.runChildren(ParentRunner.java:236)
13-Sep-2017 18:45:23         at org.junit.runners.ParentRunner.access$000(ParentRunner.java:53)
13-Sep-2017 18:45:23         at org.junit.runners.ParentRunner$2.evaluate(ParentRunner.java:229)
13-Sep-2017 18:45:23         at org.springframework.test.context.junit4.statements.RunBeforeTestClassCallbacks.evaluate(RunBeforeTestClassCallbacks.java:61)
13-Sep-2017 18:45:23         at org.junit.internal.runners.statements.RunAfters.evaluate(RunAfters.java:27)
13-Sep-2017 18:45:23         at org.springframework.test.context.junit4.statements.RunAfterTestClassCallbacks.evaluate(RunAfterTestClassCallbacks.java:71)
13-Sep-2017 18:45:23         at org.junit.runners.ParentRunner.run(ParentRunner.java:309)
13-Sep-2017 18:45:23         at org.springframework.test.context.junit4.SpringJUnit4ClassRunner.run(SpringJUnit4ClassRunner.java:174)
13-Sep-2017 18:45:23         at org.apache.maven.surefire.junit4.JUnit4TestSet.execute(JUnit4TestSet.java:59)
13-Sep-2017 18:45:23         at org.apache.maven.surefire.suite.AbstractDirectoryTestSuite.executeTestSet(AbstractDirectoryTestSuite.java:115)
13-Sep-2017 18:45:23         at org.apache.maven.surefire.suite.AbstractDirectoryTestSuite.execute(AbstractDirectoryTestSuite.java:102)
13-Sep-2017 18:45:23         at org.apache.maven.surefire.Surefire.run(Surefire.java:180)
13-Sep-2017 18:45:23         at sun.reflect.NativeMethodAccessorImpl.invoke0(Native Method)
13-Sep-2017 18:45:23         at sun.reflect.NativeMethodAccessorImpl.invoke(NativeMethodAccessorImpl.java:57)
13-Sep-2017 18:45:23         at sun.reflect.DelegatingMethodAccessorImpl.invoke(DelegatingMethodAccessorImpl.java:43)
13-Sep-2017 18:45:23         at java.lang.reflect.Method.invoke(Method.java:606)
13-Sep-2017 18:45:23         at org.apache.maven.surefire.booter.SurefireBooter.runSuitesInProcess(SurefireBooter.java:350)
13-Sep-2017 18:45:23         at org.apache.maven.surefire.booter.SurefireBooter.main(SurefireBooter.java:1021)
13-Sep-2017 18:45:23 ERROR - EncounterSaveHandler.handle(47) |2017-09-13 18:45:23,135| Unable to save complex obs
13-Sep-2017 18:45:23 java.lang.NullPointerException
13-Sep-2017 18:45:23         at org.openmrs.api.handler.EncounterSaveHandler.handle(EncounterSaveHandler.java:39)
13-Sep-2017 18:45:23         at org.openmrs.api.handler.EncounterSaveHandler.handle(EncounterSaveHandler.java:25)
13-Sep-2017 18:45:23         at org.openmrs.aop.RequiredDataAdvice.recursivelyHandle(RequiredDataAdvice.java:261)
13-Sep-2017 18:45:23         at org.openmrs.aop.RequiredDataAdvice.recursivelyHandle(RequiredDataAdvice.java:224)
13-Sep-2017 18:45:23         at org.openmrs.aop.RequiredDataAdvice.before(RequiredDataAdvice.java:126)
13-Sep-2017 18:45:23         at org.springframework.aop.framework.adapter.MethodBeforeAdviceInterceptor.invoke(MethodBeforeAdviceInterceptor.java:50)
13-Sep-2017 18:45:23         at org.springframework.aop.framework.ReflectiveMethodInvocation.proceed(ReflectiveMethodInvocation.java:172)
13-Sep-2017 18:45:23         at org.springframework.aop.framework.adapter.MethodBeforeAdviceInterceptor.invoke(MethodBeforeAdviceInterceptor.java:51)
13-Sep-2017 18:45:23         at org.springframework.aop.framework.ReflectiveMethodInvocation.proceed(ReflectiveMethodInvocation.java:172)
13-Sep-2017 18:45:23         at org.springframework.aop.framework.JdkDynamicAopProxy.invoke(JdkDynamicAopProxy.java:204)
13-Sep-2017 18:45:23         at com.sun.proxy.$Proxy61.saveEncounter(Unknown Source)
13-Sep-2017 18:45:23         at org.openmrs.api.EncounterServiceTest.getEncounterWithEditPrivilege(EncounterServiceTest.java:2492)
13-Sep-2017 18:45:23         at org.openmrs.api.EncounterServiceTest.unvoidEncounter_shouldFailfIfUserIsNotSupposedToEditEncountersOfTypeOfGivenEncounter(EncounterServiceTest.java:2386)
13-Sep-2017 18:45:23         at sun.reflect.NativeMethodAccessorImpl.invoke0(Native Method)
13-Sep-2017 18:45:23         at sun.reflect.NativeMethodAccessorImpl.invoke(NativeMethodAccessorImpl.java:57)
13-Sep-2017 18:45:23         at sun.reflect.DelegatingMethodAccessorImpl.invoke(DelegatingMethodAccessorImpl.java:43)
13-Sep-2017 18:45:23         at java.lang.reflect.Method.invoke(Method.java:606)
13-Sep-2017 18:45:23         at org.junit.runners.model.FrameworkMethod$1.runReflectiveCall(FrameworkMethod.java:47)
13-Sep-2017 18:45:23         at org.junit.internal.runners.model.ReflectiveCallable.run(ReflectiveCallable.java:12)
13-Sep-2017 18:45:23         at org.junit.runners.model.FrameworkMethod.invokeExplosively(FrameworkMethod.java:44)
13-Sep-2017 18:45:23         at org.junit.internal.runners.statements.InvokeMethod.evaluate(InvokeMethod.java:17)
13-Sep-2017 18:45:23         at org.junit.internal.runners.statements.ExpectException.evaluate(ExpectException.java:19)
13-Sep-2017 18:45:23         at org.junit.internal.runners.statements.RunBefores.evaluate(RunBefores.java:26)
13-Sep-2017 18:45:23         at org.springframework.test.context.junit4.statements.RunBeforeTestMethodCallbacks.evaluate(RunBeforeTestMethodCallbacks.java:74)
13-Sep-2017 18:45:23         at org.junit.internal.runners.statements.RunAfters.evaluate(RunAfters.java:27)
13-Sep-2017 18:45:23         at org.springframework.test.context.junit4.statements.RunAfterTestMethodCallbacks.evaluate(RunAfterTestMethodCallbacks.java:83)
13-Sep-2017 18:45:23         at org.springframework.test.context.junit4.statements.SpringRepeat.evaluate(SpringRepeat.java:72)
13-Sep-2017 18:45:23         at org.springframework.test.context.junit4.SpringJUnit4ClassRunner.runChild(SpringJUnit4ClassRunner.java:231)
13-Sep-2017 18:45:23         at org.springframework.test.context.junit4.SpringJUnit4ClassRunner.runChild(SpringJUnit4ClassRunner.java:88)
13-Sep-2017 18:45:23         at org.junit.runners.ParentRunner$3.run(ParentRunner.java:238)
13-Sep-2017 18:45:23         at org.junit.runners.ParentRunner$1.schedule(ParentRunner.java:63)
13-Sep-2017 18:45:23         at org.junit.runners.ParentRunner.runChildren(ParentRunner.java:236)
13-Sep-2017 18:45:23         at org.junit.runners.ParentRunner.access$000(ParentRunner.java:53)
13-Sep-2017 18:45:23         at org.junit.runners.ParentRunner$2.evaluate(ParentRunner.java:229)
13-Sep-2017 18:45:23         at org.springframework.test.context.junit4.statements.RunBeforeTestClassCallbacks.evaluate(RunBeforeTestClassCallbacks.java:61)
13-Sep-2017 18:45:23         at org.junit.internal.runners.statements.RunAfters.evaluate(RunAfters.java:27)
13-Sep-2017 18:45:23         at org.springframework.test.context.junit4.statements.RunAfterTestClassCallbacks.evaluate(RunAfterTestClassCallbacks.java:71)
13-Sep-2017 18:45:23         at org.junit.runners.ParentRunner.run(ParentRunner.java:309)
13-Sep-2017 18:45:23         at org.springframework.test.context.junit4.SpringJUnit4ClassRunner.run(SpringJUnit4ClassRunner.java:174)
13-Sep-2017 18:45:23         at org.apache.maven.surefire.junit4.JUnit4TestSet.execute(JUnit4TestSet.java:59)
13-Sep-2017 18:45:23         at org.apache.maven.surefire.suite.AbstractDirectoryTestSuite.executeTestSet(AbstractDirectoryTestSuite.java:115)
13-Sep-2017 18:45:23         at org.apache.maven.surefire.suite.AbstractDirectoryTestSuite.execute(AbstractDirectoryTestSuite.java:102)
13-Sep-2017 18:45:23         at org.apache.maven.surefire.Surefire.run(Surefire.java:180)
13-Sep-2017 18:45:23         at sun.reflect.NativeMethodAccessorImpl.invoke0(Native Method)
13-Sep-2017 18:45:23         at sun.reflect.NativeMethodAccessorImpl.invoke(NativeMethodAccessorImpl.java:57)
13-Sep-2017 18:45:23         at sun.reflect.DelegatingMethodAccessorImpl.invoke(DelegatingMethodAccessorImpl.java:43)
13-Sep-2017 18:45:23         at java.lang.reflect.Method.invoke(Method.java:606)
13-Sep-2017 18:45:23         at org.apache.maven.surefire.booter.SurefireBooter.runSuitesInProcess(SurefireBooter.java:350)
13-Sep-2017 18:45:23         at org.apache.maven.surefire.booter.SurefireBooter.main(SurefireBooter.java:1021)
13-Sep-2017 18:45:23 ERROR - EncounterSaveHandler.handle(47) |2017-09-13 18:45:23,137| Unable to save complex obs
13-Sep-2017 18:45:23 java.lang.NullPointerException
13-Sep-2017 18:45:23         at org.openmrs.api.handler.EncounterSaveHandler.handle(EncounterSaveHandler.java:39)
13-Sep-2017 18:45:23         at org.openmrs.api.handler.EncounterSaveHandler.handle(EncounterSaveHandler.java:25)
13-Sep-2017 18:45:23         at org.openmrs.aop.RequiredDataAdvice.recursivelyHandle(RequiredDataAdvice.java:261)
13-Sep-2017 18:45:23         at org.openmrs.aop.RequiredDataAdvice.recursivelyHandle(RequiredDataAdvice.java:224)
13-Sep-2017 18:45:23         at org.openmrs.aop.RequiredDataAdvice.before(RequiredDataAdvice.java:126)
13-Sep-2017 18:45:23         at org.springframework.aop.framework.adapter.MethodBeforeAdviceInterceptor.invoke(MethodBeforeAdviceInterceptor.java:50)
13-Sep-2017 18:45:23         at org.springframework.aop.framework.ReflectiveMethodInvocation.proceed(ReflectiveMethodInvocation.java:172)
13-Sep-2017 18:45:23         at org.springframework.aop.framework.adapter.MethodBeforeAdviceInterceptor.invoke(MethodBeforeAdviceInterceptor.java:51)
13-Sep-2017 18:45:23         at org.springframework.aop.framework.ReflectiveMethodInvocation.proceed(ReflectiveMethodInvocation.java:172)
13-Sep-2017 18:45:23         at org.springframework.aop.framework.JdkDynamicAopProxy.invoke(JdkDynamicAopProxy.java:204)
13-Sep-2017 18:45:23         at com.sun.proxy.$Proxy61.saveEncounter(Unknown Source)
13-Sep-2017 18:45:23         at org.openmrs.api.EncounterServiceTest.getEncounterWithEditPrivilege(EncounterServiceTest.java:2492)
13-Sep-2017 18:45:23         at org.openmrs.api.EncounterServiceTest.unvoidEncounter_shouldFailfIfUserIsNotSupposedToEditEncountersOfTypeOfGivenEncounter(EncounterServiceTest.java:2386)
13-Sep-2017 18:45:23         at sun.reflect.NativeMethodAccessorImpl.invoke0(Native Method)
13-Sep-2017 18:45:23         at sun.reflect.NativeMethodAccessorImpl.invoke(NativeMethodAccessorImpl.java:57)
13-Sep-2017 18:45:23         at sun.reflect.DelegatingMethodAccessorImpl.invoke(DelegatingMethodAccessorImpl.java:43)
13-Sep-2017 18:45:23         at java.lang.reflect.Method.invoke(Method.java:606)
13-Sep-2017 18:45:23         at org.junit.runners.model.FrameworkMethod$1.runReflectiveCall(FrameworkMethod.java:47)
13-Sep-2017 18:45:23         at org.junit.internal.runners.model.ReflectiveCallable.run(ReflectiveCallable.java:12)
13-Sep-2017 18:45:23         at org.junit.runners.model.FrameworkMethod.invokeExplosively(FrameworkMethod.java:44)
13-Sep-2017 18:45:23         at org.junit.internal.runners.statements.InvokeMethod.evaluate(InvokeMethod.java:17)
13-Sep-2017 18:45:23         at org.junit.internal.runners.statements.ExpectException.evaluate(ExpectException.java:19)
13-Sep-2017 18:45:23         at org.junit.internal.runners.statements.RunBefores.evaluate(RunBefores.java:26)
13-Sep-2017 18:45:23         at org.springframework.test.context.junit4.statements.RunBeforeTestMethodCallbacks.evaluate(RunBeforeTestMethodCallbacks.java:74)
13-Sep-2017 18:45:23         at org.junit.internal.runners.statements.RunAfters.evaluate(RunAfters.java:27)
13-Sep-2017 18:45:23         at org.springframework.test.context.junit4.statements.RunAfterTestMethodCallbacks.evaluate(RunAfterTestMethodCallbacks.java:83)
13-Sep-2017 18:45:23         at org.springframework.test.context.junit4.statements.SpringRepeat.evaluate(SpringRepeat.java:72)
13-Sep-2017 18:45:23         at org.springframework.test.context.junit4.SpringJUnit4ClassRunner.runChild(SpringJUnit4ClassRunner.java:231)
13-Sep-2017 18:45:23         at org.springframework.test.context.junit4.SpringJUnit4ClassRunner.runChild(SpringJUnit4ClassRunner.java:88)
13-Sep-2017 18:45:23         at org.junit.runners.ParentRunner$3.run(ParentRunner.java:238)
13-Sep-2017 18:45:23         at org.junit.runners.ParentRunner$1.schedule(ParentRunner.java:63)
13-Sep-2017 18:45:23         at org.junit.runners.ParentRunner.runChildren(ParentRunner.java:236)
13-Sep-2017 18:45:23         at org.junit.runners.ParentRunner.access$000(ParentRunner.java:53)
13-Sep-2017 18:45:23         at org.junit.runners.ParentRunner$2.evaluate(ParentRunner.java:229)
13-Sep-2017 18:45:23         at org.springframework.test.context.junit4.statements.RunBeforeTestClassCallbacks.evaluate(RunBeforeTestClassCallbacks.java:61)
13-Sep-2017 18:45:23         at org.junit.internal.runners.statements.RunAfters.evaluate(RunAfters.java:27)
13-Sep-2017 18:45:23         at org.springframework.test.context.junit4.statements.RunAfterTestClassCallbacks.evaluate(RunAfterTestClassCallbacks.java:71)
13-Sep-2017 18:45:23         at org.junit.runners.ParentRunner.run(ParentRunner.java:309)
13-Sep-2017 18:45:23         at org.springframework.test.context.junit4.SpringJUnit4ClassRunner.run(SpringJUnit4ClassRunner.java:174)
13-Sep-2017 18:45:23         at org.apache.maven.surefire.junit4.JUnit4TestSet.execute(JUnit4TestSet.java:59)
13-Sep-2017 18:45:23         at org.apache.maven.surefire.suite.AbstractDirectoryTestSuite.executeTestSet(AbstractDirectoryTestSuite.java:115)
13-Sep-2017 18:45:23         at org.apache.maven.surefire.suite.AbstractDirectoryTestSuite.execute(AbstractDirectoryTestSuite.java:102)
13-Sep-2017 18:45:23         at org.apache.maven.surefire.Surefire.run(Surefire.java:180)
13-Sep-2017 18:45:23         at sun.reflect.NativeMethodAccessorImpl.invoke0(Native Method)
13-Sep-2017 18:45:23         at sun.reflect.NativeMethodAccessorImpl.invoke(NativeMethodAccessorImpl.java:57)
13-Sep-2017 18:45:23         at sun.reflect.DelegatingMethodAccessorImpl.invoke(DelegatingMethodAccessorImpl.java:43)
13-Sep-2017 18:45:23         at java.lang.reflect.Method.invoke(Method.java:606)
13-Sep-2017 18:45:23         at org.apache.maven.surefire.booter.SurefireBooter.runSuitesInProcess(SurefireBooter.java:350)
13-Sep-2017 18:45:23         at org.apache.maven.surefire.booter.SurefireBooter.main(SurefireBooter.java:1021)
13-Sep-2017 18:45:23 ERROR - EncounterSaveHandler.handle(47) |2017-09-13 18:45:23,503| Unable to save complex obs
13-Sep-2017 18:45:23 java.lang.NullPointerException
13-Sep-2017 18:45:23         at org.openmrs.api.handler.EncounterSaveHandler.handle(EncounterSaveHandler.java:39)
13-Sep-2017 18:45:23         at org.openmrs.api.handler.EncounterSaveHandler.handle(EncounterSaveHandler.java:25)
13-Sep-2017 18:45:23         at org.openmrs.aop.RequiredDataAdvice.recursivelyHandle(RequiredDataAdvice.java:261)
13-Sep-2017 18:45:23         at org.openmrs.aop.RequiredDataAdvice.recursivelyHandle(RequiredDataAdvice.java:224)
13-Sep-2017 18:45:23         at org.openmrs.aop.RequiredDataAdvice.before(RequiredDataAdvice.java:126)
13-Sep-2017 18:45:23         at org.springframework.aop.framework.adapter.MethodBeforeAdviceInterceptor.invoke(MethodBeforeAdviceInterceptor.java:50)
13-Sep-2017 18:45:23         at org.springframework.aop.framework.ReflectiveMethodInvocation.proceed(ReflectiveMethodInvocation.java:172)
13-Sep-2017 18:45:23         at org.springframework.aop.framework.adapter.MethodBeforeAdviceInterceptor.invoke(MethodBeforeAdviceInterceptor.java:51)
13-Sep-2017 18:45:23         at org.springframework.aop.framework.ReflectiveMethodInvocation.proceed(ReflectiveMethodInvocation.java:172)
13-Sep-2017 18:45:23         at org.springframework.aop.framework.JdkDynamicAopProxy.invoke(JdkDynamicAopProxy.java:204)
13-Sep-2017 18:45:23         at com.sun.proxy.$Proxy61.saveEncounter(Unknown Source)
13-Sep-2017 18:45:23         at org.openmrs.api.EncounterServiceTest.saveEncounter_shouldCascadeChangeOfLocationInEncounterToContainedObs(EncounterServiceTest.java:219)
13-Sep-2017 18:45:23         at sun.reflect.NativeMethodAccessorImpl.invoke0(Native Method)
13-Sep-2017 18:45:23         at sun.reflect.NativeMethodAccessorImpl.invoke(NativeMethodAccessorImpl.java:57)
13-Sep-2017 18:45:23         at sun.reflect.DelegatingMethodAccessorImpl.invoke(DelegatingMethodAccessorImpl.java:43)
13-Sep-2017 18:45:23         at java.lang.reflect.Method.invoke(Method.java:606)
13-Sep-2017 18:45:23         at org.junit.runners.model.FrameworkMethod$1.runReflectiveCall(FrameworkMethod.java:47)
13-Sep-2017 18:45:23         at org.junit.internal.runners.model.ReflectiveCallable.run(ReflectiveCallable.java:12)
13-Sep-2017 18:45:23         at org.junit.runners.model.FrameworkMethod.invokeExplosively(FrameworkMethod.java:44)
13-Sep-2017 18:45:23         at org.junit.internal.runners.statements.InvokeMethod.evaluate(InvokeMethod.java:17)
13-Sep-2017 18:45:23         at org.junit.internal.runners.statements.RunBefores.evaluate(RunBefores.java:26)
13-Sep-2017 18:45:23         at org.springframework.test.context.junit4.statements.RunBeforeTestMethodCallbacks.evaluate(RunBeforeTestMethodCallbacks.java:74)
13-Sep-2017 18:45:23         at org.junit.internal.runners.statements.RunAfters.evaluate(RunAfters.java:27)
13-Sep-2017 18:45:23         at org.springframework.test.context.junit4.statements.RunAfterTestMethodCallbacks.evaluate(RunAfterTestMethodCallbacks.java:83)
13-Sep-2017 18:45:23         at org.springframework.test.context.junit4.statements.SpringRepeat.evaluate(SpringRepeat.java:72)
13-Sep-2017 18:45:23         at org.springframework.test.context.junit4.SpringJUnit4ClassRunner.runChild(SpringJUnit4ClassRunner.java:231)
13-Sep-2017 18:45:23         at org.springframework.test.context.junit4.SpringJUnit4ClassRunner.runChild(SpringJUnit4ClassRunner.java:88)
13-Sep-2017 18:45:23         at org.junit.runners.ParentRunner$3.run(ParentRunner.java:238)
13-Sep-2017 18:45:23         at org.junit.runners.ParentRunner$1.schedule(ParentRunner.java:63)
13-Sep-2017 18:45:23         at org.junit.runners.ParentRunner.runChildren(ParentRunner.java:236)
13-Sep-2017 18:45:23         at org.junit.runners.ParentRunner.access$000(ParentRunner.java:53)
13-Sep-2017 18:45:23         at org.junit.runners.ParentRunner$2.evaluate(ParentRunner.java:229)
13-Sep-2017 18:45:23         at org.springframework.test.context.junit4.statements.RunBeforeTestClassCallbacks.evaluate(RunBeforeTestClassCallbacks.java:61)
13-Sep-2017 18:45:23         at org.junit.internal.runners.statements.RunAfters.evaluate(RunAfters.java:27)
13-Sep-2017 18:45:23         at org.springframework.test.context.junit4.statements.RunAfterTestClassCallbacks.evaluate(RunAfterTestClassCallbacks.java:71)
13-Sep-2017 18:45:23         at org.junit.runners.ParentRunner.run(ParentRunner.java:309)
13-Sep-2017 18:45:23         at org.springframework.test.context.junit4.SpringJUnit4ClassRunner.run(SpringJUnit4ClassRunner.java:174)
13-Sep-2017 18:45:23         at org.apache.maven.surefire.junit4.JUnit4TestSet.execute(JUnit4TestSet.java:59)
13-Sep-2017 18:45:23         at org.apache.maven.surefire.suite.AbstractDirectoryTestSuite.executeTestSet(AbstractDirectoryTestSuite.java:115)
13-Sep-2017 18:45:23         at org.apache.maven.surefire.suite.AbstractDirectoryTestSuite.execute(AbstractDirectoryTestSuite.java:102)
13-Sep-2017 18:45:23         at org.apache.maven.surefire.Surefire.run(Surefire.java:180)
13-Sep-2017 18:45:23         at sun.reflect.NativeMethodAccessorImpl.invoke0(Native Method)
13-Sep-2017 18:45:23         at sun.reflect.NativeMethodAccessorImpl.invoke(NativeMethodAccessorImpl.java:57)
13-Sep-2017 18:45:23         at sun.reflect.DelegatingMethodAccessorImpl.invoke(DelegatingMethodAccessorImpl.java:43)
13-Sep-2017 18:45:23         at java.lang.reflect.Method.invoke(Method.java:606)
13-Sep-2017 18:45:23         at org.apache.maven.surefire.booter.SurefireBooter.runSuitesInProcess(SurefireBooter.java:350)
13-Sep-2017 18:45:23         at org.apache.maven.surefire.booter.SurefireBooter.main(SurefireBooter.java:1021)
13-Sep-2017 18:45:23 ERROR - EncounterSaveHandler.handle(47) |2017-09-13 18:45:23,508| Unable to save complex obs
13-Sep-2017 18:45:23 java.lang.NullPointerException
13-Sep-2017 18:45:23         at org.openmrs.api.handler.EncounterSaveHandler.handle(EncounterSaveHandler.java:39)
13-Sep-2017 18:45:23         at org.openmrs.api.handler.EncounterSaveHandler.handle(EncounterSaveHandler.java:25)
13-Sep-2017 18:45:23         at org.openmrs.aop.RequiredDataAdvice.recursivelyHandle(RequiredDataAdvice.java:261)
13-Sep-2017 18:45:23         at org.openmrs.aop.RequiredDataAdvice.recursivelyHandle(RequiredDataAdvice.java:224)
13-Sep-2017 18:45:23         at org.openmrs.aop.RequiredDataAdvice.before(RequiredDataAdvice.java:126)
13-Sep-2017 18:45:23         at org.springframework.aop.framework.adapter.MethodBeforeAdviceInterceptor.invoke(MethodBeforeAdviceInterceptor.java:50)
13-Sep-2017 18:45:23         at org.springframework.aop.framework.ReflectiveMethodInvocation.proceed(ReflectiveMethodInvocation.java:172)
13-Sep-2017 18:45:23         at org.springframework.aop.framework.adapter.MethodBeforeAdviceInterceptor.invoke(MethodBeforeAdviceInterceptor.java:51)
13-Sep-2017 18:45:23         at org.springframework.aop.framework.ReflectiveMethodInvocation.proceed(ReflectiveMethodInvocation.java:172)
13-Sep-2017 18:45:23         at org.springframework.aop.framework.JdkDynamicAopProxy.invoke(JdkDynamicAopProxy.java:204)
13-Sep-2017 18:45:23         at com.sun.proxy.$Proxy61.saveEncounter(Unknown Source)
13-Sep-2017 18:45:23         at org.openmrs.api.EncounterServiceTest.saveEncounter_shouldCascadeChangeOfLocationInEncounterToContainedObs(EncounterServiceTest.java:222)
13-Sep-2017 18:45:23         at sun.reflect.NativeMethodAccessorImpl.invoke0(Native Method)
13-Sep-2017 18:45:23         at sun.reflect.NativeMethodAccessorImpl.invoke(NativeMethodAccessorImpl.java:57)
13-Sep-2017 18:45:23         at sun.reflect.DelegatingMethodAccessorImpl.invoke(DelegatingMethodAccessorImpl.java:43)
13-Sep-2017 18:45:23         at java.lang.reflect.Method.invoke(Method.java:606)
13-Sep-2017 18:45:23         at org.junit.runners.model.FrameworkMethod$1.runReflectiveCall(FrameworkMethod.java:47)
13-Sep-2017 18:45:23         at org.junit.internal.runners.model.ReflectiveCallable.run(ReflectiveCallable.java:12)
13-Sep-2017 18:45:23         at org.junit.runners.model.FrameworkMethod.invokeExplosively(FrameworkMethod.java:44)
13-Sep-2017 18:45:23         at org.junit.internal.runners.statements.InvokeMethod.evaluate(InvokeMethod.java:17)
13-Sep-2017 18:45:23         at org.junit.internal.runners.statements.RunBefores.evaluate(RunBefores.java:26)
13-Sep-2017 18:45:23         at org.springframework.test.context.junit4.statements.RunBeforeTestMethodCallbacks.evaluate(RunBeforeTestMethodCallbacks.java:74)
13-Sep-2017 18:45:23         at org.junit.internal.runners.statements.RunAfters.evaluate(RunAfters.java:27)
13-Sep-2017 18:45:23         at org.springframework.test.context.junit4.statements.RunAfterTestMethodCallbacks.evaluate(RunAfterTestMethodCallbacks.java:83)
13-Sep-2017 18:45:23         at org.springframework.test.context.junit4.statements.SpringRepeat.evaluate(SpringRepeat.java:72)
13-Sep-2017 18:45:23         at org.springframework.test.context.junit4.SpringJUnit4ClassRunner.runChild(SpringJUnit4ClassRunner.java:231)
13-Sep-2017 18:45:23         at org.springframework.test.context.junit4.SpringJUnit4ClassRunner.runChild(SpringJUnit4ClassRunner.java:88)
13-Sep-2017 18:45:23         at org.junit.runners.ParentRunner$3.run(ParentRunner.java:238)
13-Sep-2017 18:45:23         at org.junit.runners.ParentRunner$1.schedule(ParentRunner.java:63)
13-Sep-2017 18:45:23         at org.junit.runners.ParentRunner.runChildren(ParentRunner.java:236)
13-Sep-2017 18:45:23         at org.junit.runners.ParentRunner.access$000(ParentRunner.java:53)
13-Sep-2017 18:45:23         at org.junit.runners.ParentRunner$2.evaluate(ParentRunner.java:229)
13-Sep-2017 18:45:23         at org.springframework.test.context.junit4.statements.RunBeforeTestClassCallbacks.evaluate(RunBeforeTestClassCallbacks.java:61)
13-Sep-2017 18:45:23         at org.junit.internal.runners.statements.RunAfters.evaluate(RunAfters.java:27)
13-Sep-2017 18:45:23         at org.springframework.test.context.junit4.statements.RunAfterTestClassCallbacks.evaluate(RunAfterTestClassCallbacks.java:71)
13-Sep-2017 18:45:23         at org.junit.runners.ParentRunner.run(ParentRunner.java:309)
13-Sep-2017 18:45:23         at org.springframework.test.context.junit4.SpringJUnit4ClassRunner.run(SpringJUnit4ClassRunner.java:174)
13-Sep-2017 18:45:23         at org.apache.maven.surefire.junit4.JUnit4TestSet.execute(JUnit4TestSet.java:59)
13-Sep-2017 18:45:23         at org.apache.maven.surefire.suite.AbstractDirectoryTestSuite.executeTestSet(AbstractDirectoryTestSuite.java:115)
13-Sep-2017 18:45:23         at org.apache.maven.surefire.suite.AbstractDirectoryTestSuite.execute(AbstractDirectoryTestSuite.java:102)
13-Sep-2017 18:45:23         at org.apache.maven.surefire.Surefire.run(Surefire.java:180)
13-Sep-2017 18:45:23         at sun.reflect.NativeMethodAccessorImpl.invoke0(Native Method)
13-Sep-2017 18:45:23         at sun.reflect.NativeMethodAccessorImpl.invoke(NativeMethodAccessorImpl.java:57)
13-Sep-2017 18:45:23         at sun.reflect.DelegatingMethodAccessorImpl.invoke(DelegatingMethodAccessorImpl.java:43)
13-Sep-2017 18:45:23         at java.lang.reflect.Method.invoke(Method.java:606)
13-Sep-2017 18:45:23         at org.apache.maven.surefire.booter.SurefireBooter.runSuitesInProcess(SurefireBooter.java:350)
13-Sep-2017 18:45:23         at org.apache.maven.surefire.booter.SurefireBooter.main(SurefireBooter.java:1021)
13-Sep-2017 18:45:23 ERROR - EncounterSaveHandler.handle(47) |2017-09-13 18:45:23,845| Unable to save complex obs
13-Sep-2017 18:45:23 java.lang.NullPointerException
13-Sep-2017 18:45:23         at org.openmrs.api.handler.EncounterSaveHandler.handle(EncounterSaveHandler.java:39)
13-Sep-2017 18:45:23         at org.openmrs.api.handler.EncounterSaveHandler.handle(EncounterSaveHandler.java:25)
13-Sep-2017 18:45:23         at org.openmrs.aop.RequiredDataAdvice.recursivelyHandle(RequiredDataAdvice.java:261)
13-Sep-2017 18:45:23         at org.openmrs.aop.RequiredDataAdvice.recursivelyHandle(RequiredDataAdvice.java:224)
13-Sep-2017 18:45:23         at org.openmrs.aop.RequiredDataAdvice.before(RequiredDataAdvice.java:126)
13-Sep-2017 18:45:23         at org.springframework.aop.framework.adapter.MethodBeforeAdviceInterceptor.invoke(MethodBeforeAdviceInterceptor.java:50)
13-Sep-2017 18:45:23         at org.springframework.aop.framework.ReflectiveMethodInvocation.proceed(ReflectiveMethodInvocation.java:172)
13-Sep-2017 18:45:23         at org.springframework.aop.framework.adapter.MethodBeforeAdviceInterceptor.invoke(MethodBeforeAdviceInterceptor.java:51)
13-Sep-2017 18:45:23         at org.springframework.aop.framework.ReflectiveMethodInvocation.proceed(ReflectiveMethodInvocation.java:172)
13-Sep-2017 18:45:23         at org.springframework.aop.framework.JdkDynamicAopProxy.invoke(JdkDynamicAopProxy.java:204)
13-Sep-2017 18:45:23         at com.sun.proxy.$Proxy61.saveEncounter(Unknown Source)
13-Sep-2017 18:45:23         at org.openmrs.api.EncounterServiceTest.getEncounterWithEditPrivilege(EncounterServiceTest.java:2492)
13-Sep-2017 18:45:23         at org.openmrs.api.EncounterServiceTest.voidEncounter_shouldFailfIfUserIsNotSupposedToEditEncountersOfTypeOfGivenEncounter(EncounterServiceTest.java:2364)
13-Sep-2017 18:45:23         at sun.reflect.NativeMethodAccessorImpl.invoke0(Native Method)
13-Sep-2017 18:45:23         at sun.reflect.NativeMethodAccessorImpl.invoke(NativeMethodAccessorImpl.java:57)
13-Sep-2017 18:45:23         at sun.reflect.DelegatingMethodAccessorImpl.invoke(DelegatingMethodAccessorImpl.java:43)
13-Sep-2017 18:45:23         at java.lang.reflect.Method.invoke(Method.java:606)
13-Sep-2017 18:45:23         at org.junit.runners.model.FrameworkMethod$1.runReflectiveCall(FrameworkMethod.java:47)
13-Sep-2017 18:45:23         at org.junit.internal.runners.model.ReflectiveCallable.run(ReflectiveCallable.java:12)
13-Sep-2017 18:45:23         at org.junit.runners.model.FrameworkMethod.invokeExplosively(FrameworkMethod.java:44)
13-Sep-2017 18:45:23         at org.junit.internal.runners.statements.InvokeMethod.evaluate(InvokeMethod.java:17)
13-Sep-2017 18:45:23         at org.junit.internal.runners.statements.ExpectException.evaluate(ExpectException.java:19)
13-Sep-2017 18:45:23         at org.junit.internal.runners.statements.RunBefores.evaluate(RunBefores.java:26)
13-Sep-2017 18:45:23         at org.springframework.test.context.junit4.statements.RunBeforeTestMethodCallbacks.evaluate(RunBeforeTestMethodCallbacks.java:74)
13-Sep-2017 18:45:23         at org.junit.internal.runners.statements.RunAfters.evaluate(RunAfters.java:27)
13-Sep-2017 18:45:23         at org.springframework.test.context.junit4.statements.RunAfterTestMethodCallbacks.evaluate(RunAfterTestMethodCallbacks.java:83)
13-Sep-2017 18:45:23         at org.springframework.test.context.junit4.statements.SpringRepeat.evaluate(SpringRepeat.java:72)
13-Sep-2017 18:45:23         at org.springframework.test.context.junit4.SpringJUnit4ClassRunner.runChild(SpringJUnit4ClassRunner.java:231)
13-Sep-2017 18:45:23         at org.springframework.test.context.junit4.SpringJUnit4ClassRunner.runChild(SpringJUnit4ClassRunner.java:88)
13-Sep-2017 18:45:23         at org.junit.runners.ParentRunner$3.run(ParentRunner.java:238)
13-Sep-2017 18:45:23         at org.junit.runners.ParentRunner$1.schedule(ParentRunner.java:63)
13-Sep-2017 18:45:23         at org.junit.runners.ParentRunner.runChildren(ParentRunner.java:236)
13-Sep-2017 18:45:23         at org.junit.runners.ParentRunner.access$000(ParentRunner.java:53)
13-Sep-2017 18:45:23         at org.junit.runners.ParentRunner$2.evaluate(ParentRunner.java:229)
13-Sep-2017 18:45:23         at org.springframework.test.context.junit4.statements.RunBeforeTestClassCallbacks.evaluate(RunBeforeTestClassCallbacks.java:61)
13-Sep-2017 18:45:23         at org.junit.internal.runners.statements.RunAfters.evaluate(RunAfters.java:27)
13-Sep-2017 18:45:23         at org.springframework.test.context.junit4.statements.RunAfterTestClassCallbacks.evaluate(RunAfterTestClassCallbacks.java:71)
13-Sep-2017 18:45:23         at org.junit.runners.ParentRunner.run(ParentRunner.java:309)
13-Sep-2017 18:45:23         at org.springframework.test.context.junit4.SpringJUnit4ClassRunner.run(SpringJUnit4ClassRunner.java:174)
13-Sep-2017 18:45:23         at org.apache.maven.surefire.junit4.JUnit4TestSet.execute(JUnit4TestSet.java:59)
13-Sep-2017 18:45:23         at org.apache.maven.surefire.suite.AbstractDirectoryTestSuite.executeTestSet(AbstractDirectoryTestSuite.java:115)
13-Sep-2017 18:45:23         at org.apache.maven.surefire.suite.AbstractDirectoryTestSuite.execute(AbstractDirectoryTestSuite.java:102)
13-Sep-2017 18:45:23         at org.apache.maven.surefire.Surefire.run(Surefire.java:180)
13-Sep-2017 18:45:23         at sun.reflect.NativeMethodAccessorImpl.invoke0(Native Method)
13-Sep-2017 18:45:23         at sun.reflect.NativeMethodAccessorImpl.invoke(NativeMethodAccessorImpl.java:57)
13-Sep-2017 18:45:23         at sun.reflect.DelegatingMethodAccessorImpl.invoke(DelegatingMethodAccessorImpl.java:43)
13-Sep-2017 18:45:23         at java.lang.reflect.Method.invoke(Method.java:606)
13-Sep-2017 18:45:23         at org.apache.maven.surefire.booter.SurefireBooter.runSuitesInProcess(SurefireBooter.java:350)
13-Sep-2017 18:45:23         at org.apache.maven.surefire.booter.SurefireBooter.main(SurefireBooter.java:1021)
13-Sep-2017 18:45:23 ERROR - EncounterSaveHandler.handle(47) |2017-09-13 18:45:23,846| Unable to save complex obs
13-Sep-2017 18:45:23 java.lang.NullPointerException
13-Sep-2017 18:45:23         at org.openmrs.api.handler.EncounterSaveHandler.handle(EncounterSaveHandler.java:39)
13-Sep-2017 18:45:23         at org.openmrs.api.handler.EncounterSaveHandler.handle(EncounterSaveHandler.java:25)
13-Sep-2017 18:45:23         at org.openmrs.aop.RequiredDataAdvice.recursivelyHandle(RequiredDataAdvice.java:261)
13-Sep-2017 18:45:23         at org.openmrs.aop.RequiredDataAdvice.recursivelyHandle(RequiredDataAdvice.java:224)
13-Sep-2017 18:45:23         at org.openmrs.aop.RequiredDataAdvice.before(RequiredDataAdvice.java:126)
13-Sep-2017 18:45:23         at org.springframework.aop.framework.adapter.MethodBeforeAdviceInterceptor.invoke(MethodBeforeAdviceInterceptor.java:50)
13-Sep-2017 18:45:23         at org.springframework.aop.framework.ReflectiveMethodInvocation.proceed(ReflectiveMethodInvocation.java:172)
13-Sep-2017 18:45:23         at org.springframework.aop.framework.adapter.MethodBeforeAdviceInterceptor.invoke(MethodBeforeAdviceInterceptor.java:51)
13-Sep-2017 18:45:23         at org.springframework.aop.framework.ReflectiveMethodInvocation.proceed(ReflectiveMethodInvocation.java:172)
13-Sep-2017 18:45:23         at org.springframework.aop.framework.JdkDynamicAopProxy.invoke(JdkDynamicAopProxy.java:204)
13-Sep-2017 18:45:23         at com.sun.proxy.$Proxy61.saveEncounter(Unknown Source)
13-Sep-2017 18:45:23         at org.openmrs.api.EncounterServiceTest.getEncounterWithEditPrivilege(EncounterServiceTest.java:2492)
13-Sep-2017 18:45:23         at org.openmrs.api.EncounterServiceTest.voidEncounter_shouldFailfIfUserIsNotSupposedToEditEncountersOfTypeOfGivenEncounter(EncounterServiceTest.java:2364)
13-Sep-2017 18:45:23         at sun.reflect.NativeMethodAccessorImpl.invoke0(Native Method)
13-Sep-2017 18:45:23         at sun.reflect.NativeMethodAccessorImpl.invoke(NativeMethodAccessorImpl.java:57)
13-Sep-2017 18:45:23         at sun.reflect.DelegatingMethodAccessorImpl.invoke(DelegatingMethodAccessorImpl.java:43)
13-Sep-2017 18:45:23         at java.lang.reflect.Method.invoke(Method.java:606)
13-Sep-2017 18:45:23         at org.junit.runners.model.FrameworkMethod$1.runReflectiveCall(FrameworkMethod.java:47)
13-Sep-2017 18:45:23         at org.junit.internal.runners.model.ReflectiveCallable.run(ReflectiveCallable.java:12)
13-Sep-2017 18:45:23         at org.junit.runners.model.FrameworkMethod.invokeExplosively(FrameworkMethod.java:44)
13-Sep-2017 18:45:23         at org.junit.internal.runners.statements.InvokeMethod.evaluate(InvokeMethod.java:17)
13-Sep-2017 18:45:23         at org.junit.internal.runners.statements.ExpectException.evaluate(ExpectException.java:19)
13-Sep-2017 18:45:23         at org.junit.internal.runners.statements.RunBefores.evaluate(RunBefores.java:26)
13-Sep-2017 18:45:23         at org.springframework.test.context.junit4.statements.RunBeforeTestMethodCallbacks.evaluate(RunBeforeTestMethodCallbacks.java:74)
13-Sep-2017 18:45:23         at org.junit.internal.runners.statements.RunAfters.evaluate(RunAfters.java:27)
13-Sep-2017 18:45:23         at org.springframework.test.context.junit4.statements.RunAfterTestMethodCallbacks.evaluate(RunAfterTestMethodCallbacks.java:83)
13-Sep-2017 18:45:23         at org.springframework.test.context.junit4.statements.SpringRepeat.evaluate(SpringRepeat.java:72)
13-Sep-2017 18:45:23         at org.springframework.test.context.junit4.SpringJUnit4ClassRunner.runChild(SpringJUnit4ClassRunner.java:231)
13-Sep-2017 18:45:23         at org.springframework.test.context.junit4.SpringJUnit4ClassRunner.runChild(SpringJUnit4ClassRunner.java:88)
13-Sep-2017 18:45:23         at org.junit.runners.ParentRunner$3.run(ParentRunner.java:238)
13-Sep-2017 18:45:23         at org.junit.runners.ParentRunner$1.schedule(ParentRunner.java:63)
13-Sep-2017 18:45:23         at org.junit.runners.ParentRunner.runChildren(ParentRunner.java:236)
13-Sep-2017 18:45:23         at org.junit.runners.ParentRunner.access$000(ParentRunner.java:53)
13-Sep-2017 18:45:23         at org.junit.runners.ParentRunner$2.evaluate(ParentRunner.java:229)
13-Sep-2017 18:45:23         at org.springframework.test.context.junit4.statements.RunBeforeTestClassCallbacks.evaluate(RunBeforeTestClassCallbacks.java:61)
13-Sep-2017 18:45:23         at org.junit.internal.runners.statements.RunAfters.evaluate(RunAfters.java:27)
13-Sep-2017 18:45:23         at org.springframework.test.context.junit4.statements.RunAfterTestClassCallbacks.evaluate(RunAfterTestClassCallbacks.java:71)
13-Sep-2017 18:45:23         at org.junit.runners.ParentRunner.run(ParentRunner.java:309)
13-Sep-2017 18:45:23         at org.springframework.test.context.junit4.SpringJUnit4ClassRunner.run(SpringJUnit4ClassRunner.java:174)
13-Sep-2017 18:45:23         at org.apache.maven.surefire.junit4.JUnit4TestSet.execute(JUnit4TestSet.java:59)
13-Sep-2017 18:45:23         at org.apache.maven.surefire.suite.AbstractDirectoryTestSuite.executeTestSet(AbstractDirectoryTestSuite.java:115)
13-Sep-2017 18:45:23         at org.apache.maven.surefire.suite.AbstractDirectoryTestSuite.execute(AbstractDirectoryTestSuite.java:102)
13-Sep-2017 18:45:23         at org.apache.maven.surefire.Surefire.run(Surefire.java:180)
13-Sep-2017 18:45:23         at sun.reflect.NativeMethodAccessorImpl.invoke0(Native Method)
13-Sep-2017 18:45:23         at sun.reflect.NativeMethodAccessorImpl.invoke(NativeMethodAccessorImpl.java:57)
13-Sep-2017 18:45:23         at sun.reflect.DelegatingMethodAccessorImpl.invoke(DelegatingMethodAccessorImpl.java:43)
13-Sep-2017 18:45:23         at java.lang.reflect.Method.invoke(Method.java:606)
13-Sep-2017 18:45:23         at org.apache.maven.surefire.booter.SurefireBooter.runSuitesInProcess(SurefireBooter.java:350)
13-Sep-2017 18:45:23         at org.apache.maven.surefire.booter.SurefireBooter.main(SurefireBooter.java:1021)
13-Sep-2017 18:45:23 ERROR - EncounterSaveHandler.handle(47) |2017-09-13 18:45:23,848| Unable to save complex obs
13-Sep-2017 18:45:23 java.lang.NullPointerException
13-Sep-2017 18:45:23         at org.openmrs.api.handler.EncounterSaveHandler.handle(EncounterSaveHandler.java:39)
13-Sep-2017 18:45:23         at org.openmrs.api.handler.EncounterSaveHandler.handle(EncounterSaveHandler.java:25)
13-Sep-2017 18:45:23         at org.openmrs.aop.RequiredDataAdvice.recursivelyHandle(RequiredDataAdvice.java:261)
13-Sep-2017 18:45:23         at org.openmrs.aop.RequiredDataAdvice.recursivelyHandle(RequiredDataAdvice.java:224)
13-Sep-2017 18:45:23         at org.openmrs.aop.RequiredDataAdvice.before(RequiredDataAdvice.java:126)
13-Sep-2017 18:45:23         at org.springframework.aop.framework.adapter.MethodBeforeAdviceInterceptor.invoke(MethodBeforeAdviceInterceptor.java:50)
13-Sep-2017 18:45:23         at org.springframework.aop.framework.ReflectiveMethodInvocation.proceed(ReflectiveMethodInvocation.java:172)
13-Sep-2017 18:45:23         at org.springframework.aop.framework.adapter.MethodBeforeAdviceInterceptor.invoke(MethodBeforeAdviceInterceptor.java:51)
13-Sep-2017 18:45:23         at org.springframework.aop.framework.ReflectiveMethodInvocation.proceed(ReflectiveMethodInvocation.java:172)
13-Sep-2017 18:45:23         at org.springframework.aop.framework.JdkDynamicAopProxy.invoke(JdkDynamicAopProxy.java:204)
13-Sep-2017 18:45:23         at com.sun.proxy.$Proxy61.saveEncounter(Unknown Source)
13-Sep-2017 18:45:23         at org.openmrs.api.EncounterServiceTest.getEncounterWithEditPrivilege(EncounterServiceTest.java:2492)
13-Sep-2017 18:45:23         at org.openmrs.api.EncounterServiceTest.voidEncounter_shouldFailfIfUserIsNotSupposedToEditEncountersOfTypeOfGivenEncounter(EncounterServiceTest.java:2364)
13-Sep-2017 18:45:23         at sun.reflect.NativeMethodAccessorImpl.invoke0(Native Method)
13-Sep-2017 18:45:23         at sun.reflect.NativeMethodAccessorImpl.invoke(NativeMethodAccessorImpl.java:57)
13-Sep-2017 18:45:23         at sun.reflect.DelegatingMethodAccessorImpl.invoke(DelegatingMethodAccessorImpl.java:43)
13-Sep-2017 18:45:23         at java.lang.reflect.Method.invoke(Method.java:606)
13-Sep-2017 18:45:23         at org.junit.runners.model.FrameworkMethod$1.runReflectiveCall(FrameworkMethod.java:47)
13-Sep-2017 18:45:23         at org.junit.internal.runners.model.ReflectiveCallable.run(ReflectiveCallable.java:12)
13-Sep-2017 18:45:23         at org.junit.runners.model.FrameworkMethod.invokeExplosively(FrameworkMethod.java:44)
13-Sep-2017 18:45:23         at org.junit.internal.runners.statements.InvokeMethod.evaluate(InvokeMethod.java:17)
13-Sep-2017 18:45:23         at org.junit.internal.runners.statements.ExpectException.evaluate(ExpectException.java:19)
13-Sep-2017 18:45:23         at org.junit.internal.runners.statements.RunBefores.evaluate(RunBefores.java:26)
13-Sep-2017 18:45:23         at org.springframework.test.context.junit4.statements.RunBeforeTestMethodCallbacks.evaluate(RunBeforeTestMethodCallbacks.java:74)
13-Sep-2017 18:45:23         at org.junit.internal.runners.statements.RunAfters.evaluate(RunAfters.java:27)
13-Sep-2017 18:45:23         at org.springframework.test.context.junit4.statements.RunAfterTestMethodCallbacks.evaluate(RunAfterTestMethodCallbacks.java:83)
13-Sep-2017 18:45:23         at org.springframework.test.context.junit4.statements.SpringRepeat.evaluate(SpringRepeat.java:72)
13-Sep-2017 18:45:23         at org.springframework.test.context.junit4.SpringJUnit4ClassRunner.runChild(SpringJUnit4ClassRunner.java:231)
13-Sep-2017 18:45:23         at org.springframework.test.context.junit4.SpringJUnit4ClassRunner.runChild(SpringJUnit4ClassRunner.java:88)
13-Sep-2017 18:45:23         at org.junit.runners.ParentRunner$3.run(ParentRunner.java:238)
13-Sep-2017 18:45:23         at org.junit.runners.ParentRunner$1.schedule(ParentRunner.java:63)
13-Sep-2017 18:45:23         at org.junit.runners.ParentRunner.runChildren(ParentRunner.java:236)
13-Sep-2017 18:45:23         at org.junit.runners.ParentRunner.access$000(ParentRunner.java:53)
13-Sep-2017 18:45:23         at org.junit.runners.ParentRunner$2.evaluate(ParentRunner.java:229)
13-Sep-2017 18:45:23         at org.springframework.test.context.junit4.statements.RunBeforeTestClassCallbacks.evaluate(RunBeforeTestClassCallbacks.java:61)
13-Sep-2017 18:45:23         at org.junit.internal.runners.statements.RunAfters.evaluate(RunAfters.java:27)
13-Sep-2017 18:45:23         at org.springframework.test.context.junit4.statements.RunAfterTestClassCallbacks.evaluate(RunAfterTestClassCallbacks.java:71)
13-Sep-2017 18:45:23         at org.junit.runners.ParentRunner.run(ParentRunner.java:309)
13-Sep-2017 18:45:23         at org.springframework.test.context.junit4.SpringJUnit4ClassRunner.run(SpringJUnit4ClassRunner.java:174)
13-Sep-2017 18:45:23         at org.apache.maven.surefire.junit4.JUnit4TestSet.execute(JUnit4TestSet.java:59)
13-Sep-2017 18:45:23         at org.apache.maven.surefire.suite.AbstractDirectoryTestSuite.executeTestSet(AbstractDirectoryTestSuite.java:115)
13-Sep-2017 18:45:23         at org.apache.maven.surefire.suite.AbstractDirectoryTestSuite.execute(AbstractDirectoryTestSuite.java:102)
13-Sep-2017 18:45:23         at org.apache.maven.surefire.Surefire.run(Surefire.java:180)
13-Sep-2017 18:45:23         at sun.reflect.NativeMethodAccessorImpl.invoke0(Native Method)
13-Sep-2017 18:45:23         at sun.reflect.NativeMethodAccessorImpl.invoke(NativeMethodAccessorImpl.java:57)
13-Sep-2017 18:45:23         at sun.reflect.DelegatingMethodAccessorImpl.invoke(DelegatingMethodAccessorImpl.java:43)
13-Sep-2017 18:45:23         at java.lang.reflect.Method.invoke(Method.java:606)
13-Sep-2017 18:45:23         at org.apache.maven.surefire.booter.SurefireBooter.runSuitesInProcess(SurefireBooter.java:350)
13-Sep-2017 18:45:23         at org.apache.maven.surefire.booter.SurefireBooter.main(SurefireBooter.java:1021)
13-Sep-2017 18:45:24 ERROR - EncounterSaveHandler.handle(47) |2017-09-13 18:45:24,128| Unable to save complex obs
13-Sep-2017 18:45:24 java.lang.NullPointerException
13-Sep-2017 18:45:24         at org.openmrs.api.handler.EncounterSaveHandler.handle(EncounterSaveHandler.java:39)
13-Sep-2017 18:45:24         at org.openmrs.api.handler.EncounterSaveHandler.handle(EncounterSaveHandler.java:25)
13-Sep-2017 18:45:24         at org.openmrs.aop.RequiredDataAdvice.recursivelyHandle(RequiredDataAdvice.java:261)
13-Sep-2017 18:45:24         at org.openmrs.aop.RequiredDataAdvice.recursivelyHandle(RequiredDataAdvice.java:224)
13-Sep-2017 18:45:24         at org.openmrs.aop.RequiredDataAdvice.before(RequiredDataAdvice.java:126)
13-Sep-2017 18:45:24         at org.springframework.aop.framework.adapter.MethodBeforeAdviceInterceptor.invoke(MethodBeforeAdviceInterceptor.java:50)
13-Sep-2017 18:45:24         at org.springframework.aop.framework.ReflectiveMethodInvocation.proceed(ReflectiveMethodInvocation.java:172)
13-Sep-2017 18:45:24         at org.springframework.aop.framework.adapter.MethodBeforeAdviceInterceptor.invoke(MethodBeforeAdviceInterceptor.java:51)
13-Sep-2017 18:45:24         at org.springframework.aop.framework.ReflectiveMethodInvocation.proceed(ReflectiveMethodInvocation.java:172)
13-Sep-2017 18:45:24         at org.springframework.aop.framework.JdkDynamicAopProxy.invoke(JdkDynamicAopProxy.java:204)
13-Sep-2017 18:45:24         at com.sun.proxy.$Proxy61.saveEncounter(Unknown Source)
13-Sep-2017 18:45:24         at org.openmrs.api.EncounterServiceTest.getEncounterWithEditPrivilege(EncounterServiceTest.java:2492)
13-Sep-2017 18:45:24         at org.openmrs.api.EncounterServiceTest.purgeEncounter_shouldFailfIfUserIsNotSupposedToEditEncountersOfTypeOfGivenEncounter(EncounterServiceTest.java:2408)
13-Sep-2017 18:45:24         at sun.reflect.NativeMethodAccessorImpl.invoke0(Native Method)
13-Sep-2017 18:45:24         at sun.reflect.NativeMethodAccessorImpl.invoke(NativeMethodAccessorImpl.java:57)
13-Sep-2017 18:45:24         at sun.reflect.DelegatingMethodAccessorImpl.invoke(DelegatingMethodAccessorImpl.java:43)
13-Sep-2017 18:45:24         at java.lang.reflect.Method.invoke(Method.java:606)
13-Sep-2017 18:45:24         at org.junit.runners.model.FrameworkMethod$1.runReflectiveCall(FrameworkMethod.java:47)
13-Sep-2017 18:45:24         at org.junit.internal.runners.model.ReflectiveCallable.run(ReflectiveCallable.java:12)
13-Sep-2017 18:45:24         at org.junit.runners.model.FrameworkMethod.invokeExplosively(FrameworkMethod.java:44)
13-Sep-2017 18:45:24         at org.junit.internal.runners.statements.InvokeMethod.evaluate(InvokeMethod.java:17)
13-Sep-2017 18:45:24         at org.junit.internal.runners.statements.ExpectException.evaluate(ExpectException.java:19)
13-Sep-2017 18:45:24         at org.junit.internal.runners.statements.RunBefores.evaluate(RunBefores.java:26)
13-Sep-2017 18:45:24         at org.springframework.test.context.junit4.statements.RunBeforeTestMethodCallbacks.evaluate(RunBeforeTestMethodCallbacks.java:74)
13-Sep-2017 18:45:24         at org.junit.internal.runners.statements.RunAfters.evaluate(RunAfters.java:27)
13-Sep-2017 18:45:24         at org.springframework.test.context.junit4.statements.RunAfterTestMethodCallbacks.evaluate(RunAfterTestMethodCallbacks.java:83)
13-Sep-2017 18:45:24         at org.springframework.test.context.junit4.statements.SpringRepeat.evaluate(SpringRepeat.java:72)
13-Sep-2017 18:45:24         at org.springframework.test.context.junit4.SpringJUnit4ClassRunner.runChild(SpringJUnit4ClassRunner.java:231)
13-Sep-2017 18:45:24         at org.springframework.test.context.junit4.SpringJUnit4ClassRunner.runChild(SpringJUnit4ClassRunner.java:88)
13-Sep-2017 18:45:24         at org.junit.runners.ParentRunner$3.run(ParentRunner.java:238)
13-Sep-2017 18:45:24         at org.junit.runners.ParentRunner$1.schedule(ParentRunner.java:63)
13-Sep-2017 18:45:24         at org.junit.runners.ParentRunner.runChildren(ParentRunner.java:236)
13-Sep-2017 18:45:24         at org.junit.runners.ParentRunner.access$000(ParentRunner.java:53)
13-Sep-2017 18:45:24         at org.junit.runners.ParentRunner$2.evaluate(ParentRunner.java:229)
13-Sep-2017 18:45:24         at org.springframework.test.context.junit4.statements.RunBeforeTestClassCallbacks.evaluate(RunBeforeTestClassCallbacks.java:61)
13-Sep-2017 18:45:24         at org.junit.internal.runners.statements.RunAfters.evaluate(RunAfters.java:27)
13-Sep-2017 18:45:24         at org.springframework.test.context.junit4.statements.RunAfterTestClassCallbacks.evaluate(RunAfterTestClassCallbacks.java:71)
13-Sep-2017 18:45:24         at org.junit.runners.ParentRunner.run(ParentRunner.java:309)
13-Sep-2017 18:45:24         at org.springframework.test.context.junit4.SpringJUnit4ClassRunner.run(SpringJUnit4ClassRunner.java:174)
13-Sep-2017 18:45:24         at org.apache.maven.surefire.junit4.JUnit4TestSet.execute(JUnit4TestSet.java:59)
13-Sep-2017 18:45:24         at org.apache.maven.surefire.suite.AbstractDirectoryTestSuite.executeTestSet(AbstractDirectoryTestSuite.java:115)
13-Sep-2017 18:45:24         at org.apache.maven.surefire.suite.AbstractDirectoryTestSuite.execute(AbstractDirectoryTestSuite.java:102)
13-Sep-2017 18:45:24         at org.apache.maven.surefire.Surefire.run(Surefire.java:180)
13-Sep-2017 18:45:24         at sun.reflect.NativeMethodAccessorImpl.invoke0(Native Method)
13-Sep-2017 18:45:24         at sun.reflect.NativeMethodAccessorImpl.invoke(NativeMethodAccessorImpl.java:57)
13-Sep-2017 18:45:24         at sun.reflect.DelegatingMethodAccessorImpl.invoke(DelegatingMethodAccessorImpl.java:43)
13-Sep-2017 18:45:24         at java.lang.reflect.Method.invoke(Method.java:606)
13-Sep-2017 18:45:24         at org.apache.maven.surefire.booter.SurefireBooter.runSuitesInProcess(SurefireBooter.java:350)
13-Sep-2017 18:45:24         at org.apache.maven.surefire.booter.SurefireBooter.main(SurefireBooter.java:1021)
13-Sep-2017 18:45:24 ERROR - EncounterSaveHandler.handle(47) |2017-09-13 18:45:24,129| Unable to save complex obs
13-Sep-2017 18:45:24 java.lang.NullPointerException
13-Sep-2017 18:45:24         at org.openmrs.api.handler.EncounterSaveHandler.handle(EncounterSaveHandler.java:39)
13-Sep-2017 18:45:24         at org.openmrs.api.handler.EncounterSaveHandler.handle(EncounterSaveHandler.java:25)
13-Sep-2017 18:45:24         at org.openmrs.aop.RequiredDataAdvice.recursivelyHandle(RequiredDataAdvice.java:261)
13-Sep-2017 18:45:24         at org.openmrs.aop.RequiredDataAdvice.recursivelyHandle(RequiredDataAdvice.java:224)
13-Sep-2017 18:45:24         at org.openmrs.aop.RequiredDataAdvice.before(RequiredDataAdvice.java:126)
13-Sep-2017 18:45:24         at org.springframework.aop.framework.adapter.MethodBeforeAdviceInterceptor.invoke(MethodBeforeAdviceInterceptor.java:50)
13-Sep-2017 18:45:24         at org.springframework.aop.framework.ReflectiveMethodInvocation.proceed(ReflectiveMethodInvocation.java:172)
13-Sep-2017 18:45:24         at org.springframework.aop.framework.adapter.MethodBeforeAdviceInterceptor.invoke(MethodBeforeAdviceInterceptor.java:51)
13-Sep-2017 18:45:24         at org.springframework.aop.framework.ReflectiveMethodInvocation.proceed(ReflectiveMethodInvocation.java:172)
13-Sep-2017 18:45:24         at org.springframework.aop.framework.JdkDynamicAopProxy.invoke(JdkDynamicAopProxy.java:204)
13-Sep-2017 18:45:24         at com.sun.proxy.$Proxy61.saveEncounter(Unknown Source)
13-Sep-2017 18:45:24         at org.openmrs.api.EncounterServiceTest.getEncounterWithEditPrivilege(EncounterServiceTest.java:2492)
13-Sep-2017 18:45:24         at org.openmrs.api.EncounterServiceTest.purgeEncounter_shouldFailfIfUserIsNotSupposedToEditEncountersOfTypeOfGivenEncounter(EncounterServiceTest.java:2408)
13-Sep-2017 18:45:24         at sun.reflect.NativeMethodAccessorImpl.invoke0(Native Method)
13-Sep-2017 18:45:24         at sun.reflect.NativeMethodAccessorImpl.invoke(NativeMethodAccessorImpl.java:57)
13-Sep-2017 18:45:24         at sun.reflect.DelegatingMethodAccessorImpl.invoke(DelegatingMethodAccessorImpl.java:43)
13-Sep-2017 18:45:24         at java.lang.reflect.Method.invoke(Method.java:606)
13-Sep-2017 18:45:24         at org.junit.runners.model.FrameworkMethod$1.runReflectiveCall(FrameworkMethod.java:47)
13-Sep-2017 18:45:24         at org.junit.internal.runners.model.ReflectiveCallable.run(ReflectiveCallable.java:12)
13-Sep-2017 18:45:24         at org.junit.runners.model.FrameworkMethod.invokeExplosively(FrameworkMethod.java:44)
13-Sep-2017 18:45:24         at org.junit.internal.runners.statements.InvokeMethod.evaluate(InvokeMethod.java:17)
13-Sep-2017 18:45:24         at org.junit.internal.runners.statements.ExpectException.evaluate(ExpectException.java:19)
13-Sep-2017 18:45:24         at org.junit.internal.runners.statements.RunBefores.evaluate(RunBefores.java:26)
13-Sep-2017 18:45:24         at org.springframework.test.context.junit4.statements.RunBeforeTestMethodCallbacks.evaluate(RunBeforeTestMethodCallbacks.java:74)
13-Sep-2017 18:45:24         at org.junit.internal.runners.statements.RunAfters.evaluate(RunAfters.java:27)
13-Sep-2017 18:45:24         at org.springframework.test.context.junit4.statements.RunAfterTestMethodCallbacks.evaluate(RunAfterTestMethodCallbacks.java:83)
13-Sep-2017 18:45:24         at org.springframework.test.context.junit4.statements.SpringRepeat.evaluate(SpringRepeat.java:72)
13-Sep-2017 18:45:24         at org.springframework.test.context.junit4.SpringJUnit4ClassRunner.runChild(SpringJUnit4ClassRunner.java:231)
13-Sep-2017 18:45:24         at org.springframework.test.context.junit4.SpringJUnit4ClassRunner.runChild(SpringJUnit4ClassRunner.java:88)
13-Sep-2017 18:45:24         at org.junit.runners.ParentRunner$3.run(ParentRunner.java:238)
13-Sep-2017 18:45:24         at org.junit.runners.ParentRunner$1.schedule(ParentRunner.java:63)
13-Sep-2017 18:45:24         at org.junit.runners.ParentRunner.runChildren(ParentRunner.java:236)
13-Sep-2017 18:45:24         at org.junit.runners.ParentRunner.access$000(ParentRunner.java:53)
13-Sep-2017 18:45:24         at org.junit.runners.ParentRunner$2.evaluate(ParentRunner.java:229)
13-Sep-2017 18:45:24         at org.springframework.test.context.junit4.statements.RunBeforeTestClassCallbacks.evaluate(RunBeforeTestClassCallbacks.java:61)
13-Sep-2017 18:45:24         at org.junit.internal.runners.statements.RunAfters.evaluate(RunAfters.java:27)
13-Sep-2017 18:45:24         at org.springframework.test.context.junit4.statements.RunAfterTestClassCallbacks.evaluate(RunAfterTestClassCallbacks.java:71)
13-Sep-2017 18:45:24         at org.junit.runners.ParentRunner.run(ParentRunner.java:309)
13-Sep-2017 18:45:24         at org.springframework.test.context.junit4.SpringJUnit4ClassRunner.run(SpringJUnit4ClassRunner.java:174)
13-Sep-2017 18:45:24         at org.apache.maven.surefire.junit4.JUnit4TestSet.execute(JUnit4TestSet.java:59)
13-Sep-2017 18:45:24         at org.apache.maven.surefire.suite.AbstractDirectoryTestSuite.executeTestSet(AbstractDirectoryTestSuite.java:115)
13-Sep-2017 18:45:24         at org.apache.maven.surefire.suite.AbstractDirectoryTestSuite.execute(AbstractDirectoryTestSuite.java:102)
13-Sep-2017 18:45:24         at org.apache.maven.surefire.Surefire.run(Surefire.java:180)
13-Sep-2017 18:45:24         at sun.reflect.NativeMethodAccessorImpl.invoke0(Native Method)
13-Sep-2017 18:45:24         at sun.reflect.NativeMethodAccessorImpl.invoke(NativeMethodAccessorImpl.java:57)
13-Sep-2017 18:45:24         at sun.reflect.DelegatingMethodAccessorImpl.invoke(DelegatingMethodAccessorImpl.java:43)
13-Sep-2017 18:45:24         at java.lang.reflect.Method.invoke(Method.java:606)
13-Sep-2017 18:45:24         at org.apache.maven.surefire.booter.SurefireBooter.runSuitesInProcess(SurefireBooter.java:350)
13-Sep-2017 18:45:24         at org.apache.maven.surefire.booter.SurefireBooter.main(SurefireBooter.java:1021)
13-Sep-2017 18:45:24 ERROR - EncounterSaveHandler.handle(47) |2017-09-13 18:45:24,130| Unable to save complex obs
13-Sep-2017 18:45:24 java.lang.NullPointerException
13-Sep-2017 18:45:24         at org.openmrs.api.handler.EncounterSaveHandler.handle(EncounterSaveHandler.java:39)
13-Sep-2017 18:45:24         at org.openmrs.api.handler.EncounterSaveHandler.handle(EncounterSaveHandler.java:25)
13-Sep-2017 18:45:24         at org.openmrs.aop.RequiredDataAdvice.recursivelyHandle(RequiredDataAdvice.java:261)
13-Sep-2017 18:45:24         at org.openmrs.aop.RequiredDataAdvice.recursivelyHandle(RequiredDataAdvice.java:224)
13-Sep-2017 18:45:24         at org.openmrs.aop.RequiredDataAdvice.before(RequiredDataAdvice.java:126)
13-Sep-2017 18:45:24         at org.springframework.aop.framework.adapter.MethodBeforeAdviceInterceptor.invoke(MethodBeforeAdviceInterceptor.java:50)
13-Sep-2017 18:45:24         at org.springframework.aop.framework.ReflectiveMethodInvocation.proceed(ReflectiveMethodInvocation.java:172)
13-Sep-2017 18:45:24         at org.springframework.aop.framework.adapter.MethodBeforeAdviceInterceptor.invoke(MethodBeforeAdviceInterceptor.java:51)
13-Sep-2017 18:45:24         at org.springframework.aop.framework.ReflectiveMethodInvocation.proceed(ReflectiveMethodInvocation.java:172)
13-Sep-2017 18:45:24         at org.springframework.aop.framework.JdkDynamicAopProxy.invoke(JdkDynamicAopProxy.java:204)
13-Sep-2017 18:45:24         at com.sun.proxy.$Proxy61.saveEncounter(Unknown Source)
13-Sep-2017 18:45:24         at org.openmrs.api.EncounterServiceTest.getEncounterWithEditPrivilege(EncounterServiceTest.java:2492)
13-Sep-2017 18:45:24         at org.openmrs.api.EncounterServiceTest.purgeEncounter_shouldFailfIfUserIsNotSupposedToEditEncountersOfTypeOfGivenEncounter(EncounterServiceTest.java:2408)
13-Sep-2017 18:45:24         at sun.reflect.NativeMethodAccessorImpl.invoke0(Native Method)
13-Sep-2017 18:45:24         at sun.reflect.NativeMethodAccessorImpl.invoke(NativeMethodAccessorImpl.java:57)
13-Sep-2017 18:45:24         at sun.reflect.DelegatingMethodAccessorImpl.invoke(DelegatingMethodAccessorImpl.java:43)
13-Sep-2017 18:45:24         at java.lang.reflect.Method.invoke(Method.java:606)
13-Sep-2017 18:45:24         at org.junit.runners.model.FrameworkMethod$1.runReflectiveCall(FrameworkMethod.java:47)
13-Sep-2017 18:45:24         at org.junit.internal.runners.model.ReflectiveCallable.run(ReflectiveCallable.java:12)
13-Sep-2017 18:45:24         at org.junit.runners.model.FrameworkMethod.invokeExplosively(FrameworkMethod.java:44)
13-Sep-2017 18:45:24         at org.junit.internal.runners.statements.InvokeMethod.evaluate(InvokeMethod.java:17)
13-Sep-2017 18:45:24         at org.junit.internal.runners.statements.ExpectException.evaluate(ExpectException.java:19)
13-Sep-2017 18:45:24         at org.junit.internal.runners.statements.RunBefores.evaluate(RunBefores.java:26)
13-Sep-2017 18:45:24         at org.springframework.test.context.junit4.statements.RunBeforeTestMethodCallbacks.evaluate(RunBeforeTestMethodCallbacks.java:74)
13-Sep-2017 18:45:24         at org.junit.internal.runners.statements.RunAfters.evaluate(RunAfters.java:27)
13-Sep-2017 18:45:24         at org.springframework.test.context.junit4.statements.RunAfterTestMethodCallbacks.evaluate(RunAfterTestMethodCallbacks.java:83)
13-Sep-2017 18:45:24         at org.springframework.test.context.junit4.statements.SpringRepeat.evaluate(SpringRepeat.java:72)
13-Sep-2017 18:45:24         at org.springframework.test.context.junit4.SpringJUnit4ClassRunner.runChild(SpringJUnit4ClassRunner.java:231)
13-Sep-2017 18:45:24         at org.springframework.test.context.junit4.SpringJUnit4ClassRunner.runChild(SpringJUnit4ClassRunner.java:88)
13-Sep-2017 18:45:24         at org.junit.runners.ParentRunner$3.run(ParentRunner.java:238)
13-Sep-2017 18:45:24         at org.junit.runners.ParentRunner$1.schedule(ParentRunner.java:63)
13-Sep-2017 18:45:24         at org.junit.runners.ParentRunner.runChildren(ParentRunner.java:236)
13-Sep-2017 18:45:24         at org.junit.runners.ParentRunner.access$000(ParentRunner.java:53)
13-Sep-2017 18:45:24         at org.junit.runners.ParentRunner$2.evaluate(ParentRunner.java:229)
13-Sep-2017 18:45:24         at org.springframework.test.context.junit4.statements.RunBeforeTestClassCallbacks.evaluate(RunBeforeTestClassCallbacks.java:61)
13-Sep-2017 18:45:24         at org.junit.internal.runners.statements.RunAfters.evaluate(RunAfters.java:27)
13-Sep-2017 18:45:24         at org.springframework.test.context.junit4.statements.RunAfterTestClassCallbacks.evaluate(RunAfterTestClassCallbacks.java:71)
13-Sep-2017 18:45:24         at org.junit.runners.ParentRunner.run(ParentRunner.java:309)
13-Sep-2017 18:45:24         at org.springframework.test.context.junit4.SpringJUnit4ClassRunner.run(SpringJUnit4ClassRunner.java:174)
13-Sep-2017 18:45:24         at org.apache.maven.surefire.junit4.JUnit4TestSet.execute(JUnit4TestSet.java:59)
13-Sep-2017 18:45:24         at org.apache.maven.surefire.suite.AbstractDirectoryTestSuite.executeTestSet(AbstractDirectoryTestSuite.java:115)
13-Sep-2017 18:45:24         at org.apache.maven.surefire.suite.AbstractDirectoryTestSuite.execute(AbstractDirectoryTestSuite.java:102)
13-Sep-2017 18:45:24         at org.apache.maven.surefire.Surefire.run(Surefire.java:180)
13-Sep-2017 18:45:24         at sun.reflect.NativeMethodAccessorImpl.invoke0(Native Method)
13-Sep-2017 18:45:24         at sun.reflect.NativeMethodAccessorImpl.invoke(NativeMethodAccessorImpl.java:57)
13-Sep-2017 18:45:24         at sun.reflect.DelegatingMethodAccessorImpl.invoke(DelegatingMethodAccessorImpl.java:43)
13-Sep-2017 18:45:24         at java.lang.reflect.Method.invoke(Method.java:606)
13-Sep-2017 18:45:24         at org.apache.maven.surefire.booter.SurefireBooter.runSuitesInProcess(SurefireBooter.java:350)
13-Sep-2017 18:45:24         at org.apache.maven.surefire.booter.SurefireBooter.main(SurefireBooter.java:1021)
13-Sep-2017 18:45:24 Tests run: 132, Failures: 0, Errors: 0, Skipped: 3, Time elapsed: 8.491 sec
13-Sep-2017 18:45:24 Running org.openmrs.report.ReportSchemaXmlTest
13-Sep-2017 18:45:24 Tests run: 2, Failures: 0, Errors: 0, Skipped: 0, Time elapsed: 0.111 sec
13-Sep-2017 18:45:24 Running org.openmrs.validator.BaseAttributeTypeValidatorTest
13-Sep-2017 18:45:24 Tests run: 7, Failures: 0, Errors: 0, Skipped: 0, Time elapsed: 0.055 sec
13-Sep-2017 18:45:24 Running org.openmrs.api.handler.BaseUnretireHandlerTest
13-Sep-2017 18:45:24 Tests run: 6, Failures: 0, Errors: 0, Skipped: 0, Time elapsed: 0.004 sec
13-Sep-2017 18:45:24 Running org.openmrs.propertyeditor.ConceptDatatypeEditorTest
13-Sep-2017 18:45:25 Tests run: 2, Failures: 0, Errors: 0, Skipped: 0, Time elapsed: 0.029 sec
13-Sep-2017 18:45:25 Running org.openmrs.validator.ObsValidatorTest
13-Sep-2017 18:45:25 Tests run: 15, Failures: 0, Errors: 0, Skipped: 0, Time elapsed: 0.19 sec
13-Sep-2017 18:45:25 Running org.openmrs.api.db.ConceptDAOTest
13-Sep-2017 18:45:25 Tests run: 13, Failures: 0, Errors: 0, Skipped: 2, Time elapsed: 0.274 sec
13-Sep-2017 18:45:25 Running org.openmrs.validator.RelationshipValidatorTest
13-Sep-2017 18:45:25 Tests run: 2, Failures: 0, Errors: 0, Skipped: 0, Time elapsed: 0.024 sec
13-Sep-2017 18:45:25 Running org.openmrs.module.ModuleUtilTest
13-Sep-2017 18:45:26 Tests run: 43, Failures: 0, Errors: 0, Skipped: 0, Time elapsed: 0.616 sec
13-Sep-2017 18:45:26 Running org.openmrs.propertyeditor.OrderEditorTest
13-Sep-2017 18:45:26 Tests run: 2, Failures: 0, Errors: 0, Skipped: 0, Time elapsed: 0.027 sec
13-Sep-2017 18:45:26 Running org.openmrs.aop.RequiredDataAdviceTest
13-Sep-2017 18:45:26 Tests run: 26, Failures: 0, Errors: 0, Skipped: 0, Time elapsed: 0.488 sec
13-Sep-2017 18:45:26 Running org.openmrs.util.DatabaseUpdaterTest
13-Sep-2017 18:45:27 INFO 9/13/17 6:45 PM:liquibase: Creating database history table with name: LIQUIBASECHANGELOG
13-Sep-2017 18:45:28 INFO 9/13/17 6:45 PM:liquibase: Reading from LIQUIBASECHANGELOG
13-Sep-2017 18:45:29 Tests run: 1, Failures: 0, Errors: 0, Skipped: 0, Time elapsed: 2.916 sec
13-Sep-2017 18:45:29 Running org.openmrs.api.db.hibernate.AuditableInterceptorTest
13-Sep-2017 18:45:29 Tests run: 15, Failures: 0, Errors: 0, Skipped: 0, Time elapsed: 0.219 sec
13-Sep-2017 18:45:29 Running org.openmrs.messagesource.MessageSourceServiceTest
13-Sep-2017 18:45:29 Tests run: 1, Failures: 0, Errors: 0, Skipped: 0, Time elapsed: 0.019 sec
13-Sep-2017 18:45:29 Running org.openmrs.ProviderTest
13-Sep-2017 18:45:29 Tests run: 3, Failures: 0, Errors: 0, Skipped: 0, Time elapsed: 0.003 sec
13-Sep-2017 18:45:29 Running org.openmrs.validator.ConceptDrugValidatorTest
13-Sep-2017 18:45:29 Tests run: 3, Failures: 0, Errors: 0, Skipped: 0, Time elapsed: 0.003 sec
13-Sep-2017 18:45:29 Running org.openmrs.ConceptReferenceTermTest
13-Sep-2017 18:45:29 Tests run: 3, Failures: 0, Errors: 0, Skipped: 0, Time elapsed: 0.003 sec
13-Sep-2017 18:45:29 Running org.openmrs.propertyeditor.ProviderEditorTest
13-Sep-2017 18:45:29 Tests run: 2, Failures: 0, Errors: 0, Skipped: 0, Time elapsed: 0.023 sec
13-Sep-2017 18:45:29 Running org.openmrs.api.ProgramWorkflowServiceUnitTest
13-Sep-2017 18:45:29 Tests run: 3, Failures: 0, Errors: 0, Skipped: 0, Time elapsed: 0.013 sec
13-Sep-2017 18:45:29 Running org.openmrs.api.db.hibernate.HibernateObsDAOTest
13-Sep-2017 18:45:29 Tests run: 1, Failures: 0, Errors: 0, Skipped: 0, Time elapsed: 0.036 sec
13-Sep-2017 18:45:29 Running org.openmrs.propertyeditor.ConceptAnswerEditorTest
13-Sep-2017 18:45:29 Tests run: 2, Failures: 0, Errors: 0, Skipped: 0, Time elapsed: 0.04 sec
13-Sep-2017 18:45:29 Running org.openmrs.module.ModuleFileParserTest
13-Sep-2017 18:45:29 Tests run: 5, Failures: 0, Errors: 0, Skipped: 0, Time elapsed: 0.019 sec
13-Sep-2017 18:45:29 Running org.openmrs.annotation.StartModuleAnnotationReuseTest
13-Sep-2017 18:45:29 INFO 9/13/17 6:45 PM:liquibase: liquibase.xml is using schema version 1.9 rather than version 2.0
13-Sep-2017 18:45:29 INFO 9/13/17 6:45 PM:liquibase: Reading from LIQUIBASECHANGELOG
13-Sep-2017 18:45:30 INFO 9/13/17 6:45 PM:liquibase: Successfully acquired change log lock
13-Sep-2017 18:45:30 INFO 9/13/17 6:45 PM:liquibase: liquibase.xml is using schema version 1.9 rather than version 2.0
13-Sep-2017 18:45:30 INFO 9/13/17 6:45 PM:liquibase: Successfully released change log lock
13-Sep-2017 18:45:30 Tests run: 1, Failures: 0, Errors: 0, Skipped: 0, Time elapsed: 0.225 sec
13-Sep-2017 18:45:30 Running org.openmrs.report.PatientSearchTest
13-Sep-2017 18:45:30 Tests run: 1, Failures: 0, Errors: 0, Skipped: 0, Time elapsed: 0.219 sec
13-Sep-2017 18:45:30 Running org.openmrs.api.ProgramWorkflowServiceTest
13-Sep-2017 18:45:31 Tests run: 25, Failures: 0, Errors: 0, Skipped: 0, Time elapsed: 1.128 sec
13-Sep-2017 18:45:31 Running org.openmrs.api.db.EncounterDAOTest
13-Sep-2017 18:45:31 Tests run: 1, Failures: 0, Errors: 0, Skipped: 0, Time elapsed: 0.05 sec
13-Sep-2017 18:45:31 Running org.openmrs.propertyeditor.FormEditorTest
13-Sep-2017 18:45:31 Tests run: 2, Failures: 0, Errors: 0, Skipped: 0, Time elapsed: 0.029 sec
13-Sep-2017 18:45:31 Running org.openmrs.validator.FieldValidatorTest
13-Sep-2017 18:45:31 Tests run: 6, Failures: 0, Errors: 0, Skipped: 0, Time elapsed: 0.061 sec
13-Sep-2017 18:45:31 Running org.openmrs.serialization.SimpleXStreamSerializerTest
13-Sep-2017 18:45:31 Tests run: 5, Failures: 0, Errors: 0, Skipped: 0, Time elapsed: 0.035 sec
13-Sep-2017 18:45:31 Running org.openmrs.propertyeditor.ProgramWorkflowStateEditorTest
13-Sep-2017 18:45:31 Tests run: 2, Failures: 0, Errors: 0, Skipped: 0, Time elapsed: 0.036 sec
13-Sep-2017 18:45:31 Running org.openmrs.api.db.ProgramWorkflowDAOTest
13-Sep-2017 18:45:31 Tests run: 4, Failures: 0, Errors: 0, Skipped: 0, Time elapsed: 0.047 sec
13-Sep-2017 18:45:31 Running org.openmrs.api.handler.BaseUnvoidHandlerTest
13-Sep-2017 18:45:31 Tests run: 6, Failures: 0, Errors: 0, Skipped: 0, Time elapsed: 0.004 sec
13-Sep-2017 18:45:31 Running org.openmrs.api.db.hibernate.HibernateConceptDAOTest
13-Sep-2017 18:45:33 Tests run: 10, Failures: 0, Errors: 0, Skipped: 0, Time elapsed: 1.312 sec
13-Sep-2017 18:45:33 Running org.openmrs.validator.ValidateUtilTest
13-Sep-2017 18:45:33 Tests run: 5, Failures: 0, Errors: 0, Skipped: 0, Time elapsed: 0.063 sec
13-Sep-2017 18:45:33 Running org.openmrs.validator.OrderTypeValidatorTest
13-Sep-2017 18:45:33 Tests run: 12, Failures: 0, Errors: 0, Skipped: 0, Time elapsed: 0.115 sec
13-Sep-2017 18:45:33 Running org.openmrs.report.EvaluationContextTest
13-Sep-2017 18:45:33 Tests run: 1, Failures: 0, Errors: 0, Skipped: 0, Time elapsed: 0.005 sec
13-Sep-2017 18:45:33 Running org.openmrs.module.ModuleActivatorTest
13-Sep-2017 18:45:33 INFO 9/13/17 6:45 PM:liquibase: liquibase.xml is using schema version 1.9 rather than version 2.0
13-Sep-2017 18:45:33 INFO 9/13/17 6:45 PM:liquibase: Reading from LIQUIBASECHANGELOG
13-Sep-2017 18:45:33 INFO 9/13/17 6:45 PM:liquibase: Successfully acquired change log lock
13-Sep-2017 18:45:33 INFO 9/13/17 6:45 PM:liquibase: liquibase.xml is using schema version 1.9 rather than version 2.0
13-Sep-2017 18:45:33 INFO 9/13/17 6:45 PM:liquibase: Successfully released change log lock
13-Sep-2017 18:45:33 INFO 9/13/17 6:45 PM:liquibase: liquibase.xml is using schema version 1.9 rather than version 2.0
13-Sep-2017 18:45:33 INFO 9/13/17 6:45 PM:liquibase: Reading from LIQUIBASECHANGELOG
13-Sep-2017 18:45:33 INFO 9/13/17 6:45 PM:liquibase: Successfully acquired change log lock
13-Sep-2017 18:45:33 INFO 9/13/17 6:45 PM:liquibase: liquibase.xml is using schema version 1.9 rather than version 2.0
13-Sep-2017 18:45:33 INFO 9/13/17 6:45 PM:liquibase: Successfully released change log lock
13-Sep-2017 18:45:33 INFO 9/13/17 6:45 PM:liquibase: liquibase.xml is using schema version 1.9 rather than version 2.0
13-Sep-2017 18:45:33 INFO 9/13/17 6:45 PM:liquibase: Reading from LIQUIBASECHANGELOG
13-Sep-2017 18:45:33 INFO 9/13/17 6:45 PM:liquibase: Successfully acquired change log lock
13-Sep-2017 18:45:33 INFO 9/13/17 6:45 PM:liquibase: liquibase.xml is using schema version 1.9 rather than version 2.0
13-Sep-2017 18:45:33 INFO 9/13/17 6:45 PM:liquibase: Successfully released change log lock
13-Sep-2017 18:45:33 INFO 9/13/17 6:45 PM:liquibase: liquibase.xml is using schema version 1.9 rather than version 2.0
13-Sep-2017 18:45:33 INFO 9/13/17 6:45 PM:liquibase: Reading from LIQUIBASECHANGELOG
13-Sep-2017 18:45:33 INFO 9/13/17 6:45 PM:liquibase: Successfully acquired change log lock
13-Sep-2017 18:45:33 INFO 9/13/17 6:45 PM:liquibase: liquibase.xml is using schema version 1.9 rather than version 2.0
13-Sep-2017 18:45:33 INFO 9/13/17 6:45 PM:liquibase: Successfully released change log lock
13-Sep-2017 18:45:34 INFO 9/13/17 6:45 PM:liquibase: liquibase.xml is using schema version 1.9 rather than version 2.0
13-Sep-2017 18:45:34 INFO 9/13/17 6:45 PM:liquibase: Reading from LIQUIBASECHANGELOG
13-Sep-2017 18:45:34 INFO 9/13/17 6:45 PM:liquibase: Successfully acquired change log lock
13-Sep-2017 18:45:34 INFO 9/13/17 6:45 PM:liquibase: liquibase.xml is using schema version 1.9 rather than version 2.0
13-Sep-2017 18:45:34 INFO 9/13/17 6:45 PM:liquibase: Successfully released change log lock
13-Sep-2017 18:45:34 INFO 9/13/17 6:45 PM:liquibase: liquibase.xml is using schema version 1.9 rather than version 2.0
13-Sep-2017 18:45:34 INFO 9/13/17 6:45 PM:liquibase: Reading from LIQUIBASECHANGELOG
13-Sep-2017 18:45:34 INFO 9/13/17 6:45 PM:liquibase: Successfully acquired change log lock
13-Sep-2017 18:45:34 INFO 9/13/17 6:45 PM:liquibase: liquibase.xml is using schema version 1.9 rather than version 2.0
13-Sep-2017 18:45:34 INFO 9/13/17 6:45 PM:liquibase: Successfully released change log lock
13-Sep-2017 18:45:34 INFO 9/13/17 6:45 PM:liquibase: liquibase.xml is using schema version 1.9 rather than version 2.0
13-Sep-2017 18:45:34 INFO 9/13/17 6:45 PM:liquibase: Reading from LIQUIBASECHANGELOG
13-Sep-2017 18:45:34 INFO 9/13/17 6:45 PM:liquibase: Successfully acquired change log lock
13-Sep-2017 18:45:34 INFO 9/13/17 6:45 PM:liquibase: liquibase.xml is using schema version 1.9 rather than version 2.0
13-Sep-2017 18:45:34 INFO 9/13/17 6:45 PM:liquibase: Successfully released change log lock
13-Sep-2017 18:45:34 INFO 9/13/17 6:45 PM:liquibase: liquibase.xml is using schema version 1.9 rather than version 2.0
13-Sep-2017 18:45:34 INFO 9/13/17 6:45 PM:liquibase: Reading from LIQUIBASECHANGELOG
13-Sep-2017 18:45:34 INFO 9/13/17 6:45 PM:liquibase: Successfully acquired change log lock
13-Sep-2017 18:45:34 INFO 9/13/17 6:45 PM:liquibase: liquibase.xml is using schema version 1.9 rather than version 2.0
13-Sep-2017 18:45:34 INFO 9/13/17 6:45 PM:liquibase: Successfully released change log lock
13-Sep-2017 18:45:34 INFO 9/13/17 6:45 PM:liquibase: liquibase.xml is using schema version 1.9 rather than version 2.0
13-Sep-2017 18:45:34 INFO 9/13/17 6:45 PM:liquibase: Reading from LIQUIBASECHANGELOG
13-Sep-2017 18:45:34 INFO 9/13/17 6:45 PM:liquibase: Successfully acquired change log lock
13-Sep-2017 18:45:34 INFO 9/13/17 6:45 PM:liquibase: liquibase.xml is using schema version 1.9 rather than version 2.0
13-Sep-2017 18:45:34 INFO 9/13/17 6:45 PM:liquibase: Successfully released change log lock
13-Sep-2017 18:45:34 INFO 9/13/17 6:45 PM:liquibase: liquibase.xml is using schema version 1.9 rather than version 2.0
13-Sep-2017 18:45:34 INFO 9/13/17 6:45 PM:liquibase: Reading from LIQUIBASECHANGELOG
13-Sep-2017 18:45:34 INFO 9/13/17 6:45 PM:liquibase: Successfully acquired change log lock
13-Sep-2017 18:45:34 INFO 9/13/17 6:45 PM:liquibase: liquibase.xml is using schema version 1.9 rather than version 2.0
13-Sep-2017 18:45:34 INFO 9/13/17 6:45 PM:liquibase: Successfully released change log lock
13-Sep-2017 18:45:35 INFO 9/13/17 6:45 PM:liquibase: liquibase.xml is using schema version 1.9 rather than version 2.0
13-Sep-2017 18:45:35 INFO 9/13/17 6:45 PM:liquibase: Reading from LIQUIBASECHANGELOG
13-Sep-2017 18:45:35 INFO 9/13/17 6:45 PM:liquibase: Successfully acquired change log lock
13-Sep-2017 18:45:35 INFO 9/13/17 6:45 PM:liquibase: liquibase.xml is using schema version 1.9 rather than version 2.0
13-Sep-2017 18:45:35 INFO 9/13/17 6:45 PM:liquibase: Successfully released change log lock
13-Sep-2017 18:45:35 INFO 9/13/17 6:45 PM:liquibase: liquibase.xml is using schema version 1.9 rather than version 2.0
13-Sep-2017 18:45:35 INFO 9/13/17 6:45 PM:liquibase: Reading from LIQUIBASECHANGELOG
13-Sep-2017 18:45:35 INFO 9/13/17 6:45 PM:liquibase: Successfully acquired change log lock
13-Sep-2017 18:45:35 INFO 9/13/17 6:45 PM:liquibase: liquibase.xml is using schema version 1.9 rather than version 2.0
13-Sep-2017 18:45:35 INFO 9/13/17 6:45 PM:liquibase: Successfully released change log lock
13-Sep-2017 18:45:35 INFO 9/13/17 6:45 PM:liquibase: liquibase.xml is using schema version 1.9 rather than version 2.0
13-Sep-2017 18:45:35 INFO 9/13/17 6:45 PM:liquibase: Reading from LIQUIBASECHANGELOG
13-Sep-2017 18:45:35 INFO 9/13/17 6:45 PM:liquibase: Successfully acquired change log lock
13-Sep-2017 18:45:35 INFO 9/13/17 6:45 PM:liquibase: liquibase.xml is using schema version 1.9 rather than version 2.0
13-Sep-2017 18:45:35 INFO 9/13/17 6:45 PM:liquibase: Successfully released change log lock
13-Sep-2017 18:45:35 INFO 9/13/17 6:45 PM:liquibase: liquibase.xml is using schema version 1.9 rather than version 2.0
13-Sep-2017 18:45:35 INFO 9/13/17 6:45 PM:liquibase: Reading from LIQUIBASECHANGELOG
13-Sep-2017 18:45:35 INFO 9/13/17 6:45 PM:liquibase: Successfully acquired change log lock
13-Sep-2017 18:45:35 INFO 9/13/17 6:45 PM:liquibase: liquibase.xml is using schema version 1.9 rather than version 2.0
13-Sep-2017 18:45:35 INFO 9/13/17 6:45 PM:liquibase: Successfully released change log lock
13-Sep-2017 18:45:35 INFO 9/13/17 6:45 PM:liquibase: liquibase.xml is using schema version 1.9 rather than version 2.0
13-Sep-2017 18:45:35 INFO 9/13/17 6:45 PM:liquibase: Reading from LIQUIBASECHANGELOG
13-Sep-2017 18:45:35 INFO 9/13/17 6:45 PM:liquibase: Successfully acquired change log lock
13-Sep-2017 18:45:35 INFO 9/13/17 6:45 PM:liquibase: liquibase.xml is using schema version 1.9 rather than version 2.0
13-Sep-2017 18:45:35 INFO 9/13/17 6:45 PM:liquibase: Successfully released change log lock
13-Sep-2017 18:45:35 INFO 9/13/17 6:45 PM:liquibase: liquibase.xml is using schema version 1.9 rather than version 2.0
13-Sep-2017 18:45:35 INFO 9/13/17 6:45 PM:liquibase: Reading from LIQUIBASECHANGELOG
13-Sep-2017 18:45:35 INFO 9/13/17 6:45 PM:liquibase: Successfully acquired change log lock
13-Sep-2017 18:45:35 INFO 9/13/17 6:45 PM:liquibase: liquibase.xml is using schema version 1.9 rather than version 2.0
13-Sep-2017 18:45:35 INFO 9/13/17 6:45 PM:liquibase: Successfully released change log lock
13-Sep-2017 18:45:35 INFO 9/13/17 6:45 PM:liquibase: liquibase.xml is using schema version 1.9 rather than version 2.0
13-Sep-2017 18:45:35 INFO 9/13/17 6:45 PM:liquibase: Reading from LIQUIBASECHANGELOG
13-Sep-2017 18:45:35 INFO 9/13/17 6:45 PM:liquibase: Successfully acquired change log lock
13-Sep-2017 18:45:35 INFO 9/13/17 6:45 PM:liquibase: liquibase.xml is using schema version 1.9 rather than version 2.0
13-Sep-2017 18:45:35 INFO 9/13/17 6:45 PM:liquibase: Successfully released change log lock
13-Sep-2017 18:45:35 INFO 9/13/17 6:45 PM:liquibase: liquibase.xml is using schema version 1.9 rather than version 2.0
13-Sep-2017 18:45:35 INFO 9/13/17 6:45 PM:liquibase: Reading from LIQUIBASECHANGELOG
13-Sep-2017 18:45:35 INFO 9/13/17 6:45 PM:liquibase: Successfully acquired change log lock
13-Sep-2017 18:45:35 INFO 9/13/17 6:45 PM:liquibase: liquibase.xml is using schema version 1.9 rather than version 2.0
13-Sep-2017 18:45:35 INFO 9/13/17 6:45 PM:liquibase: Successfully released change log lock
13-Sep-2017 18:45:36 INFO 9/13/17 6:45 PM:liquibase: liquibase.xml is using schema version 1.9 rather than version 2.0
13-Sep-2017 18:45:36 INFO 9/13/17 6:45 PM:liquibase: Reading from LIQUIBASECHANGELOG
13-Sep-2017 18:45:36 INFO 9/13/17 6:45 PM:liquibase: Successfully acquired change log lock
13-Sep-2017 18:45:36 INFO 9/13/17 6:45 PM:liquibase: liquibase.xml is using schema version 1.9 rather than version 2.0
13-Sep-2017 18:45:36 INFO 9/13/17 6:45 PM:liquibase: Successfully released change log lock
13-Sep-2017 18:45:36 INFO 9/13/17 6:45 PM:liquibase: liquibase.xml is using schema version 1.9 rather than version 2.0
13-Sep-2017 18:45:36 INFO 9/13/17 6:45 PM:liquibase: Reading from LIQUIBASECHANGELOG
13-Sep-2017 18:45:36 INFO 9/13/17 6:45 PM:liquibase: Successfully acquired change log lock
13-Sep-2017 18:45:36 INFO 9/13/17 6:45 PM:liquibase: liquibase.xml is using schema version 1.9 rather than version 2.0
13-Sep-2017 18:45:36 INFO 9/13/17 6:45 PM:liquibase: Successfully released change log lock
13-Sep-2017 18:45:36 INFO 9/13/17 6:45 PM:liquibase: liquibase.xml is using schema version 1.9 rather than version 2.0
13-Sep-2017 18:45:36 INFO 9/13/17 6:45 PM:liquibase: Reading from LIQUIBASECHANGELOG
13-Sep-2017 18:45:36 INFO 9/13/17 6:45 PM:liquibase: Successfully acquired change log lock
13-Sep-2017 18:45:36 INFO 9/13/17 6:45 PM:liquibase: liquibase.xml is using schema version 1.9 rather than version 2.0
13-Sep-2017 18:45:36 INFO 9/13/17 6:45 PM:liquibase: Successfully released change log lock
13-Sep-2017 18:45:36 INFO 9/13/17 6:45 PM:liquibase: liquibase.xml is using schema version 1.9 rather than version 2.0
13-Sep-2017 18:45:36 INFO 9/13/17 6:45 PM:liquibase: Reading from LIQUIBASECHANGELOG
13-Sep-2017 18:45:36 INFO 9/13/17 6:45 PM:liquibase: Successfully acquired change log lock
13-Sep-2017 18:45:36 INFO 9/13/17 6:45 PM:liquibase: liquibase.xml is using schema version 1.9 rather than version 2.0
13-Sep-2017 18:45:36 INFO 9/13/17 6:45 PM:liquibase: Successfully released change log lock
13-Sep-2017 18:45:36 Tests run: 11, Failures: 0, Errors: 0, Skipped: 0, Time elapsed: 3.222 sec
13-Sep-2017 18:45:36 Running org.openmrs.hl7.HL7UtilTest
13-Sep-2017 18:45:36 Tests run: 5, Failures: 0, Errors: 0, Skipped: 0, Time elapsed: 0.008 sec
13-Sep-2017 18:45:36 Running org.openmrs.messagesource.impl.CachedMessageSourceTest
13-Sep-2017 18:45:36 Tests run: 2, Failures: 0, Errors: 0, Skipped: 0, Time elapsed: 0.026 sec
13-Sep-2017 18:45:36 Running org.openmrs.api.db.hibernate.ProviderDAOTest
13-Sep-2017 18:45:36 Tests run: 3, Failures: 0, Errors: 0, Skipped: 0, Time elapsed: 0.079 sec
13-Sep-2017 18:45:36 Running org.openmrs.messagesource.PresentationMessageMapTest
13-Sep-2017 18:45:36 Tests run: 2, Failures: 0, Errors: 0, Skipped: 0, Time elapsed: 0.003 sec
13-Sep-2017 18:45:36 Running org.openmrs.arden.ArdenServiceTest
13-Sep-2017 18:45:36 Tests run: 1, Failures: 0, Errors: 0, Skipped: 1, Time elapsed: 0.004 sec
13-Sep-2017 18:45:36 Running org.openmrs.propertyeditor.LocationEditorTest
13-Sep-2017 18:45:36 Tests run: 2, Failures: 0, Errors: 0, Skipped: 0, Time elapsed: 0.029 sec
13-Sep-2017 18:45:36 Running org.openmrs.module.ModuleInteroperabilityTest
13-Sep-2017 18:45:37 Tests run: 1, Failures: 0, Errors: 0, Skipped: 0, Time elapsed: 0.78 sec
13-Sep-2017 18:45:37 Running org.openmrs.api.handler.RequiredReasonVoidSaveHandlerTest
13-Sep-2017 18:45:37 Tests run: 5, Failures: 0, Errors: 0, Skipped: 0, Time elapsed: 0.303 sec
13-Sep-2017 18:45:37 Running org.openmrs.LocationTest
13-Sep-2017 18:45:37 Tests run: 3, Failures: 0, Errors: 0, Skipped: 0, Time elapsed: 0.003 sec
13-Sep-2017 18:45:37 Running org.openmrs.patient.impl.VerhoeffIdentifierValidatorTest
13-Sep-2017 18:45:37 Tests run: 2, Failures: 0, Errors: 0, Skipped: 0, Time elapsed: 0.003 sec
13-Sep-2017 18:45:37 Running org.openmrs.report.PepfarReportSerializationTest
13-Sep-2017 18:45:37 <conceptClass id=\"1\" conceptClassId=\"123\"/>
13-Sep-2017 18:45:38 Tests run: 4, Failures: 0, Errors: 0, Skipped: 0, Time elapsed: 0.99 sec
13-Sep-2017 18:45:38 Running org.openmrs.api.LocationServiceTest
13-Sep-2017 18:45:40 Tests run: 70, Failures: 0, Errors: 0, Skipped: 0, Time elapsed: 2.002 sec
13-Sep-2017 18:45:40 Running org.openmrs.module.ModuleClassLoaderTest
13-Sep-2017 18:45:40 Tests run: 8, Failures: 0, Errors: 0, Skipped: 0, Time elapsed: 0.094 sec
13-Sep-2017 18:45:40 Running org.openmrs.DrugOrderTest
13-Sep-2017 18:45:40 Tests run: 22, Failures: 0, Errors: 0, Skipped: 0, Time elapsed: 0.098 sec
13-Sep-2017 18:45:40 Running org.openmrs.DurationTest
13-Sep-2017 18:45:41 Tests run: 11, Failures: 0, Errors: 0, Skipped: 0, Time elapsed: 0.096 sec
13-Sep-2017 18:45:41 Running org.openmrs.report.PepfarReportTest
13-Sep-2017 18:45:41 Tests run: 1, Failures: 0, Errors: 0, Skipped: 0, Time elapsed: 0.14 sec
13-Sep-2017 18:45:41 Running org.openmrs.api.OpenmrsServiceTest
13-Sep-2017 18:45:41 Tests run: 1, Failures: 0, Errors: 0, Skipped: 1, Time elapsed: 0.003 sec
13-Sep-2017 18:45:41 Running org.openmrs.validator.DrugValidatorTest
13-Sep-2017 18:45:41 Tests run: 7, Failures: 0, Errors: 0, Skipped: 0, Time elapsed: 0.146 sec
13-Sep-2017 18:45:41 Running org.openmrs.propertyeditor.RoleEditorTest
13-Sep-2017 18:45:41 Tests run: 2, Failures: 0, Errors: 0, Skipped: 0, Time elapsed: 0.028 sec
13-Sep-2017 18:45:41 Running org.openmrs.validator.FormValidatorTest
13-Sep-2017 18:45:41 Tests run: 6, Failures: 0, Errors: 0, Skipped: 0, Time elapsed: 0.049 sec
13-Sep-2017 18:45:41 Running org.openmrs.report.PepfarReportFromXmlTest
13-Sep-2017 18:45:41 Tests run: 2, Failures: 0, Errors: 0, Skipped: 0, Time elapsed: 0.544 sec
13-Sep-2017 18:45:41 Running org.openmrs.validator.RequireNameValidatorTest
13-Sep-2017 18:45:41 Tests run: 2, Failures: 0, Errors: 0, Skipped: 0, Time elapsed: 0.003 sec
13-Sep-2017 18:45:41 Running org.openmrs.validator.OrderFrequencyValidatorTest
13-Sep-2017 18:45:42 Tests run: 7, Failures: 0, Errors: 0, Skipped: 0, Time elapsed: 0.112 sec
13-Sep-2017 18:45:42 Running org.openmrs.validator.PersonAttributeTypeValidatorTest
13-Sep-2017 18:45:42 Tests run: 5, Failures: 0, Errors: 0, Skipped: 0, Time elapsed: 0.053 sec
13-Sep-2017 18:45:42 Running org.openmrs.propertyeditor.ConceptClassEditorTest
13-Sep-2017 18:45:42 Tests run: 2, Failures: 0, Errors: 0, Skipped: 0, Time elapsed: 0.029 sec
13-Sep-2017 18:45:42 Running org.openmrs.util.ExceptionUtilTest
13-Sep-2017 18:45:42 Tests run: 1, Failures: 0, Errors: 0, Skipped: 0, Time elapsed: 0.004 sec
13-Sep-2017 18:45:42 Running org.openmrs.validator.PersonNameValidatorTest
13-Sep-2017 18:45:42 Tests run: 47, Failures: 0, Errors: 0, Skipped: 0, Time elapsed: 0.47 sec
13-Sep-2017 18:45:42 Running org.openmrs.api.PatientSetServiceTest
13-Sep-2017 18:45:42 Tests run: 28, Failures: 0, Errors: 0, Skipped: 0, Time elapsed: 0.362 sec
13-Sep-2017 18:45:42 Running org.openmrs.validator.LocationValidatorTest
13-Sep-2017 18:45:43 Tests run: 7, Failures: 0, Errors: 0, Skipped: 0, Time elapsed: 0.062 sec
13-Sep-2017 18:45:43 Running org.openmrs.annotation.OpenmrsProfileExcludeFilterTest
13-Sep-2017 18:45:43 Tests run: 7, Failures: 0, Errors: 0, Skipped: 0, Time elapsed: 0.066 sec
13-Sep-2017 18:45:43 Running org.openmrs.reporting.export.DataExportTest
13-Sep-2017 18:46:00 Tests run: 12, Failures: 0, Errors: 0, Skipped: 0, Time elapsed: 17.191 sec
13-Sep-2017 18:46:00 Running org.openmrs.validator.RelationshipTypeValidatorTest
13-Sep-2017 18:46:00 Tests run: 4, Failures: 0, Errors: 0, Skipped: 0, Time elapsed: 0.05 sec
13-Sep-2017 18:46:00 Running org.openmrs.api.UserServiceTest
13-Sep-2017 18:46:03 Tests run: 74, Failures: 0, Errors: 0, Skipped: 1, Time elapsed: 3.267 sec
13-Sep-2017 18:46:03 Running org.openmrs.api.db.ContextDAOTest
13-Sep-2017 18:46:03 ERROR - HibernateContextDAO.authenticate(183) |2017-09-13 18:46:03,629| Unable to convert the global property security.allowedFailedLoginsBeforeLockoutto a valid integer. Using default value of 7
13-Sep-2017 18:46:03 ERROR - HibernateContextDAO.authenticate(183) |2017-09-13 18:46:03,649| Unable to convert the global property security.allowedFailedLoginsBeforeLockoutto a valid integer. Using default value of 7
13-Sep-2017 18:46:03 ERROR - HibernateContextDAO.authenticate(183) |2017-09-13 18:46:03,652| Unable to convert the global property security.allowedFailedLoginsBeforeLockoutto a valid integer. Using default value of 7
13-Sep-2017 18:46:03 ERROR - HibernateContextDAO.authenticate(183) |2017-09-13 18:46:03,655| Unable to convert the global property security.allowedFailedLoginsBeforeLockoutto a valid integer. Using default value of 7
13-Sep-2017 18:46:03 ERROR - HibernateContextDAO.authenticate(183) |2017-09-13 18:46:03,657| Unable to convert the global property security.allowedFailedLoginsBeforeLockoutto a valid integer. Using default value of 7
13-Sep-2017 18:46:03 ERROR - HibernateContextDAO.authenticate(183) |2017-09-13 18:46:03,659| Unable to convert the global property security.allowedFailedLoginsBeforeLockoutto a valid integer. Using default value of 7
13-Sep-2017 18:46:03 ERROR - HibernateContextDAO.authenticate(183) |2017-09-13 18:46:03,661| Unable to convert the global property security.allowedFailedLoginsBeforeLockoutto a valid integer. Using default value of 7
13-Sep-2017 18:46:03 ERROR - HibernateContextDAO.authenticate(183) |2017-09-13 18:46:03,663| Unable to convert the global property security.allowedFailedLoginsBeforeLockoutto a valid integer. Using default value of 7
13-Sep-2017 18:46:03 ERROR - HibernateContextDAO.authenticate(183) |2017-09-13 18:46:03,666| Unable to convert the global property security.allowedFailedLoginsBeforeLockoutto a valid integer. Using default value of 7
13-Sep-2017 18:46:03 ERROR - HibernateContextDAO.authenticate(183) |2017-09-13 18:46:03,668| Unable to convert the global property security.allowedFailedLoginsBeforeLockoutto a valid integer. Using default value of 7
13-Sep-2017 18:46:03 ERROR - HibernateContextDAO.authenticate(183) |2017-09-13 18:46:03,705| Unable to convert the global property security.allowedFailedLoginsBeforeLockoutto a valid integer. Using default value of 7
13-Sep-2017 18:46:03 ERROR - HibernateContextDAO.authenticate(183) |2017-09-13 18:46:03,766| Unable to convert the global property security.allowedFailedLoginsBeforeLockoutto a valid integer. Using default value of 7
13-Sep-2017 18:46:03 ERROR - HibernateContextDAO.authenticate(183) |2017-09-13 18:46:03,908| Unable to convert the global property security.allowedFailedLoginsBeforeLockoutto a valid integer. Using default value of 7
13-Sep-2017 18:46:03 ERROR - HibernateContextDAO.authenticate(183) |2017-09-13 18:46:03,910| Unable to convert the global property security.allowedFailedLoginsBeforeLockoutto a valid integer. Using default value of 7
13-Sep-2017 18:46:03 ERROR - HibernateContextDAO.authenticate(183) |2017-09-13 18:46:03,912| Unable to convert the global property security.allowedFailedLoginsBeforeLockoutto a valid integer. Using default value of 7
13-Sep-2017 18:46:03 ERROR - HibernateContextDAO.authenticate(183) |2017-09-13 18:46:03,914| Unable to convert the global property security.allowedFailedLoginsBeforeLockoutto a valid integer. Using default value of 7
13-Sep-2017 18:46:03 ERROR - HibernateContextDAO.authenticate(183) |2017-09-13 18:46:03,916| Unable to convert the global property security.allowedFailedLoginsBeforeLockoutto a valid integer. Using default value of 7
13-Sep-2017 18:46:03 ERROR - HibernateContextDAO.authenticate(183) |2017-09-13 18:46:03,919| Unable to convert the global property security.allowedFailedLoginsBeforeLockoutto a valid integer. Using default value of 7
13-Sep-2017 18:46:03 ERROR - HibernateContextDAO.authenticate(183) |2017-09-13 18:46:03,921| Unable to convert the global property security.allowedFailedLoginsBeforeLockoutto a valid integer. Using default value of 7
13-Sep-2017 18:46:03 ERROR - HibernateContextDAO.authenticate(183) |2017-09-13 18:46:03,944| Unable to convert the global property security.allowedFailedLoginsBeforeLockoutto a valid integer. Using default value of 7
13-Sep-2017 18:46:03 ERROR - HibernateContextDAO.authenticate(183) |2017-09-13 18:46:03,972| Unable to convert the global property security.allowedFailedLoginsBeforeLockoutto a valid integer. Using default value of 7
13-Sep-2017 18:46:04 Tests run: 20, Failures: 0, Errors: 0, Skipped: 0, Time elapsed: 0.587 sec
13-Sep-2017 18:46:04 Running org.openmrs.reporting.CachingPatientFilterTest
13-Sep-2017 18:46:04 Tests run: 1, Failures: 0, Errors: 0, Skipped: 0, Time elapsed: 0.046 sec
13-Sep-2017 18:46:04 Running org.openmrs.validator.SchedulerFormValidatorTest
13-Sep-2017 18:46:04 Tests run: 8, Failures: 0, Errors: 0, Skipped: 0, Time elapsed: 0.011 sec
13-Sep-2017 18:46:04 Running org.openmrs.validator.PatientIdentifierTypeValidatorTest
13-Sep-2017 18:46:04 Tests run: 7, Failures: 0, Errors: 0, Skipped: 0, Time elapsed: 0.075 sec
13-Sep-2017 18:46:04 Running org.openmrs.validator.PatientProgramValidatorTest
13-Sep-2017 18:46:04 Tests run: 20, Failures: 0, Errors: 0, Skipped: 0, Time elapsed: 0.383 sec
13-Sep-2017 18:46:04 Running org.openmrs.api.db.hibernate.ImmutableEntityInterceptorTest
13-Sep-2017 18:46:04 Tests run: 4, Failures: 0, Errors: 0, Skipped: 0, Time elapsed: 0.004 sec
13-Sep-2017 18:46:04 Running org.openmrs.validator.ConceptMapTypeValidatorTest
13-Sep-2017 18:46:04 Tests run: 6, Failures: 0, Errors: 0, Skipped: 0, Time elapsed: 0.075 sec
13-Sep-2017 18:46:04 Running org.openmrs.validator.ImplementationIdValidatorTest
13-Sep-2017 18:46:04 Tests run: 7, Failures: 0, Errors: 0, Skipped: 0, Time elapsed: 0.097 sec
13-Sep-2017 18:46:04 Running org.openmrs.validator.UserValidatorTest
13-Sep-2017 18:46:05 Tests run: 17, Failures: 0, Errors: 0, Skipped: 0, Time elapsed: 0.197 sec
13-Sep-2017 18:46:05 Running org.openmrs.api.handler.ExistingVisitAssignmentHandlerTest
13-Sep-2017 18:46:05 Tests run: 3, Failures: 0, Errors: 0, Skipped: 0, Time elapsed: 0.281 sec
13-Sep-2017 18:46:05 Running org.openmrs.api.AdministrationServiceTest
13-Sep-2017 18:46:06 Tests run: 48, Failures: 0, Errors: 0, Skipped: 4, Time elapsed: 0.7 sec
13-Sep-2017 18:46:06 Running org.openmrs.report.RowPerObsDatasetTest
13-Sep-2017 18:46:06 Tests run: 1, Failures: 0, Errors: 0, Skipped: 0, Time elapsed: 0.17 sec
13-Sep-2017 18:46:06 Running org.openmrs.annotation.OpenmrsProfileIncludeFilterTest
13-Sep-2017 18:46:06 Tests run: 2, Failures: 0, Errors: 0, Skipped: 0, Time elapsed: 0.028 sec
13-Sep-2017 18:46:06 Running org.openmrs.api.PersonServiceTest
13-Sep-2017 18:46:09 Tests run: 119, Failures: 0, Errors: 0, Skipped: 0, Time elapsed: 2.791 sec
13-Sep-2017 18:46:09 Running org.openmrs.validator.ConceptDatatypeValidatorTest
13-Sep-2017 18:46:09 Tests run: 3, Failures: 0, Errors: 0, Skipped: 0, Time elapsed: 0.006 sec
13-Sep-2017 18:46:09 Running org.openmrs.api.ConceptServiceTest
13-Sep-2017 18:46:28 Tests run: 216, Failures: 0, Errors: 0, Skipped: 1, Time elapsed: 19.39 sec
13-Sep-2017 18:46:28 Running org.openmrs.patient.impl.LuhnIdentifierValidatorTest
13-Sep-2017 18:46:28 Tests run: 3, Failures: 0, Errors: 0, Skipped: 0, Time elapsed: 0.004 sec
13-Sep-2017 18:46:28 Running org.openmrs.util.DoubleRangeTest
13-Sep-2017 18:46:28 Tests run: 1, Failures: 0, Errors: 0, Skipped: 0, Time elapsed: 0.004 sec
13-Sep-2017 18:46:28 Running org.openmrs.api.db.UserDAOTest
13-Sep-2017 18:46:28 Tests run: 8, Failures: 0, Errors: 0, Skipped: 0, Time elapsed: 0.109 sec
13-Sep-2017 18:46:28 Running org.openmrs.validator.StateConversionValidatorTest
13-Sep-2017 18:46:28 Tests run: 4, Failures: 0, Errors: 0, Skipped: 0, Time elapsed: 0.053 sec
13-Sep-2017 18:46:28 Running org.openmrs.propertyeditor.UserEditorTest
13-Sep-2017 18:46:28 Tests run: 2, Failures: 0, Errors: 0, Skipped: 0, Time elapsed: 0.031 sec
13-Sep-2017 18:46:28 Running org.openmrs.api.PatientServiceTest
13-Sep-2017 18:46:38 Tests run: 173, Failures: 0, Errors: 0, Skipped: 2, Time elapsed: 9.385 sec
13-Sep-2017 18:46:38 Running org.openmrs.api.ObsServiceTest
13-Sep-2017 18:46:39 ERROR - ImageHandler.getObs(70) |2017-09-13 18:46:39,223| Trying to read file: /tmp/appdir-for-unit-tests-4556427572631612326/complex_obs/openmrs_logo_small.gif
13-Sep-2017 18:46:39 javax.imageio.IIOException: Can't read input file!
13-Sep-2017 18:46:39         at javax.imageio.ImageIO.read(ImageIO.java:1301)
13-Sep-2017 18:46:39         at org.openmrs.obs.handler.ImageHandler.getObs(ImageHandler.java:67)
13-Sep-2017 18:46:39         at org.openmrs.api.impl.ObsServiceImpl.getComplexObs(ObsServiceImpl.java:801)
13-Sep-2017 18:46:39         at sun.reflect.NativeMethodAccessorImpl.invoke0(Native Method)
13-Sep-2017 18:46:39         at sun.reflect.NativeMethodAccessorImpl.invoke(NativeMethodAccessorImpl.java:57)
13-Sep-2017 18:46:39         at sun.reflect.DelegatingMethodAccessorImpl.invoke(DelegatingMethodAccessorImpl.java:43)
13-Sep-2017 18:46:39         at java.lang.reflect.Method.invoke(Method.java:606)
13-Sep-2017 18:46:39         at org.springframework.aop.support.AopUtils.invokeJoinpointUsingReflection(AopUtils.java:317)
13-Sep-2017 18:46:39         at org.springframework.aop.framework.ReflectiveMethodInvocation.invokeJoinpoint(ReflectiveMethodInvocation.java:183)
13-Sep-2017 18:46:39         at org.springframework.aop.framework.ReflectiveMethodInvocation.proceed(ReflectiveMethodInvocation.java:150)
13-Sep-2017 18:46:39         at org.springframework.transaction.interceptor.TransactionInterceptor$1.proceedWithInvocation(TransactionInterceptor.java:96)
13-Sep-2017 18:46:39         at org.springframework.transaction.interceptor.TransactionAspectSupport.invokeWithinTransaction(TransactionAspectSupport.java:260)
13-Sep-2017 18:46:39         at org.springframework.transaction.interceptor.TransactionInterceptor.invoke(TransactionInterceptor.java:94)
13-Sep-2017 18:46:39         at org.springframework.aop.framework.ReflectiveMethodInvocation.proceed(ReflectiveMethodInvocation.java:172)
13-Sep-2017 18:46:39         at org.springframework.aop.framework.JdkDynamicAopProxy.invoke(JdkDynamicAopProxy.java:204)
13-Sep-2017 18:46:39         at com.sun.proxy.$Proxy58.getComplexObs(Unknown Source)
13-Sep-2017 18:46:39         at sun.reflect.NativeMethodAccessorImpl.invoke0(Native Method)
13-Sep-2017 18:46:39         at sun.reflect.NativeMethodAccessorImpl.invoke(NativeMethodAccessorImpl.java:57)
13-Sep-2017 18:46:39         at sun.reflect.DelegatingMethodAccessorImpl.invoke(DelegatingMethodAccessorImpl.java:43)
13-Sep-2017 18:46:39         at java.lang.reflect.Method.invoke(Method.java:606)
13-Sep-2017 18:46:39         at org.springframework.aop.support.AopUtils.invokeJoinpointUsingReflection(AopUtils.java:317)
13-Sep-2017 18:46:39         at org.springframework.aop.framework.ReflectiveMethodInvocation.invokeJoinpoint(ReflectiveMethodInvocation.java:183)
13-Sep-2017 18:46:39         at org.springframework.aop.framework.ReflectiveMethodInvocation.proceed(ReflectiveMethodInvocation.java:150)
13-Sep-2017 18:46:39         at org.openmrs.aop.LoggingAdvice.invoke(LoggingAdvice.java:121)
13-Sep-2017 18:46:39         at org.springframework.aop.framework.ReflectiveMethodInvocation.proceed(ReflectiveMethodInvocation.java:172)
13-Sep-2017 18:46:39         at org.springframework.aop.framework.adapter.MethodBeforeAdviceInterceptor.invoke(MethodBeforeAdviceInterceptor.java:51)
13-Sep-2017 18:46:39         at org.springframework.aop.framework.ReflectiveMethodInvocation.proceed(ReflectiveMethodInvocation.java:172)
13-Sep-2017 18:46:39         at org.springframework.aop.framework.adapter.MethodBeforeAdviceInterceptor.invoke(MethodBeforeAdviceInterceptor.java:51)
13-Sep-2017 18:46:39         at org.springframework.aop.framework.ReflectiveMethodInvocation.proceed(ReflectiveMethodInvocation.java:172)
13-Sep-2017 18:46:39         at org.springframework.aop.framework.JdkDynamicAopProxy.invoke(JdkDynamicAopProxy.java:204)
13-Sep-2017 18:46:39         at com.sun.proxy.$Proxy59.getComplexObs(Unknown Source)
13-Sep-2017 18:46:39         at org.openmrs.api.ObsServiceTest.purgeObs_shouldDeleteTheGivenObsFromTheDatabase(ObsServiceTest.java:1336)
13-Sep-2017 18:46:39         at sun.reflect.NativeMethodAccessorImpl.invoke0(Native Method)
13-Sep-2017 18:46:39         at sun.reflect.NativeMethodAccessorImpl.invoke(NativeMethodAccessorImpl.java:57)
13-Sep-2017 18:46:39         at sun.reflect.DelegatingMethodAccessorImpl.invoke(DelegatingMethodAccessorImpl.java:43)
13-Sep-2017 18:46:39         at java.lang.reflect.Method.invoke(Method.java:606)
13-Sep-2017 18:46:39         at org.junit.runners.model.FrameworkMethod$1.runReflectiveCall(FrameworkMethod.java:47)
13-Sep-2017 18:46:39         at org.junit.internal.runners.model.ReflectiveCallable.run(ReflectiveCallable.java:12)
13-Sep-2017 18:46:39         at org.junit.runners.model.FrameworkMethod.invokeExplosively(FrameworkMethod.java:44)
13-Sep-2017 18:46:39         at org.junit.internal.runners.statements.InvokeMethod.evaluate(InvokeMethod.java:17)
13-Sep-2017 18:46:39         at org.junit.internal.runners.statements.RunBefores.evaluate(RunBefores.java:26)
13-Sep-2017 18:46:39         at org.springframework.test.context.junit4.statements.RunBeforeTestMethodCallbacks.evaluate(RunBeforeTestMethodCallbacks.java:74)
13-Sep-2017 18:46:39         at org.junit.internal.runners.statements.RunAfters.evaluate(RunAfters.java:27)
13-Sep-2017 18:46:39         at org.springframework.test.context.junit4.statements.RunAfterTestMethodCallbacks.evaluate(RunAfterTestMethodCallbacks.java:83)
13-Sep-2017 18:46:39         at org.springframework.test.context.junit4.statements.SpringRepeat.evaluate(SpringRepeat.java:72)
13-Sep-2017 18:46:39         at org.springframework.test.context.junit4.SpringJUnit4ClassRunner.runChild(SpringJUnit4ClassRunner.java:231)
13-Sep-2017 18:46:39         at org.springframework.test.context.junit4.SpringJUnit4ClassRunner.runChild(SpringJUnit4ClassRunner.java:88)
13-Sep-2017 18:46:39         at org.junit.runners.ParentRunner$3.run(ParentRunner.java:238)
13-Sep-2017 18:46:39         at org.junit.runners.ParentRunner$1.schedule(ParentRunner.java:63)
13-Sep-2017 18:46:39         at org.junit.runners.ParentRunner.runChildren(ParentRunner.java:236)
13-Sep-2017 18:46:39         at org.junit.runners.ParentRunner.access$000(ParentRunner.java:53)
13-Sep-2017 18:46:39         at org.junit.runners.ParentRunner$2.evaluate(ParentRunner.java:229)
13-Sep-2017 18:46:39         at org.springframework.test.context.junit4.statements.RunBeforeTestClassCallbacks.evaluate(RunBeforeTestClassCallbacks.java:61)
13-Sep-2017 18:46:39         at org.junit.internal.runners.statements.RunAfters.evaluate(RunAfters.java:27)
13-Sep-2017 18:46:39         at org.springframework.test.context.junit4.statements.RunAfterTestClassCallbacks.evaluate(RunAfterTestClassCallbacks.java:71)
13-Sep-2017 18:46:39         at org.junit.runners.ParentRunner.run(ParentRunner.java:309)
13-Sep-2017 18:46:39         at org.springframework.test.context.junit4.SpringJUnit4ClassRunner.run(SpringJUnit4ClassRunner.java:174)
13-Sep-2017 18:46:39         at org.apache.maven.surefire.junit4.JUnit4TestSet.execute(JUnit4TestSet.java:59)
13-Sep-2017 18:46:39         at org.apache.maven.surefire.suite.AbstractDirectoryTestSuite.executeTestSet(AbstractDirectoryTestSuite.java:115)
13-Sep-2017 18:46:39         at org.apache.maven.surefire.suite.AbstractDirectoryTestSuite.execute(AbstractDirectoryTestSuite.java:102)
13-Sep-2017 18:46:39         at org.apache.maven.surefire.Surefire.run(Surefire.java:180)
13-Sep-2017 18:46:39         at sun.reflect.NativeMethodAccessorImpl.invoke0(Native Method)
13-Sep-2017 18:46:39         at sun.reflect.NativeMethodAccessorImpl.invoke(NativeMethodAccessorImpl.java:57)
13-Sep-2017 18:46:39         at sun.reflect.DelegatingMethodAccessorImpl.invoke(DelegatingMethodAccessorImpl.java:43)
13-Sep-2017 18:46:39         at java.lang.reflect.Method.invoke(Method.java:606)
13-Sep-2017 18:46:39         at org.apache.maven.surefire.booter.SurefireBooter.runSuitesInProcess(SurefireBooter.java:350)
13-Sep-2017 18:46:39         at org.apache.maven.surefire.booter.SurefireBooter.main(SurefireBooter.java:1021)
13-Sep-2017 18:46:39 Tests run: 68, Failures: 0, Errors: 0, Skipped: 0, Time elapsed: 1.437 sec
13-Sep-2017 18:46:39 Running org.openmrs.scheduler.SchedulerUtilTest
13-Sep-2017 18:46:39 Tests run: 1, Failures: 0, Errors: 0, Skipped: 0, Time elapsed: 0.005 sec
13-Sep-2017 18:46:39 Running org.openmrs.propertyeditor.ConceptSourceEditorTest
13-Sep-2017 18:46:39 Tests run: 2, Failures: 0, Errors: 0, Skipped: 0, Time elapsed: 0.024 sec
13-Sep-2017 18:46:39 Running org.openmrs.propertyeditor.PersonAttributeTypeEditorTest
13-Sep-2017 18:46:39 Tests run: 2, Failures: 0, Errors: 0, Skipped: 0, Time elapsed: 0.024 sec
13-Sep-2017 18:46:39 Running org.openmrs.hl7.HL7ServiceTest
13-Sep-2017 18:46:40 Tests run: 26, Failures: 0, Errors: 0, Skipped: 2, Time elapsed: 0.988 sec
13-Sep-2017 18:46:40 Running org.openmrs.notification.AlertServiceTest
13-Sep-2017 18:46:40 Tests run: 3, Failures: 0, Errors: 0, Skipped: 0, Time elapsed: 0.077 sec
13-Sep-2017 18:46:40 Running org.openmrs.report.RowPerProgramEnrollmentDatasetTest
13-Sep-2017 18:46:40 Tests run: 1, Failures: 0, Errors: 0, Skipped: 0, Time elapsed: 0.058 sec
13-Sep-2017 18:46:40
13-Sep-2017 18:46:40 Results :
13-Sep-2017 18:46:40
13-Sep-2017 18:46:40 Tests in error:
13-Sep-2017 18:46:40   getAllObjects_shouldReturnAllSavedObjectsWithTheGivenTypeAndExactName(org.openmrs.api.db.SerializedObjectDAOTest)
13-Sep-2017 18:46:40   getAllObjects_shouldReturnAllSavedObjectsWithTheGivenTypeAndPartialName(org.openmrs.api.db.SerializedObjectDAOTest)
13-Sep-2017 18:46:40   purgeObject_shouldDeleteTheObjectWithThePassedId(org.openmrs.api.db.SerializedObjectDAOTest)
13-Sep-2017 18:46:40   getObjectByUuid_shouldReturnTheSavedObject(org.openmrs.api.db.SerializedObjectDAOTest)
13-Sep-2017 18:46:40   getAllObjects_shouldReturnOnlyNonRetiredObjectsOfThePassedTypeIfNotIncludeRetired(org.openmrs.api.db.SerializedObjectDAOTest)
13-Sep-2017 18:46:40   getObject_shouldReturnTheSavedObject(org.openmrs.api.db.SerializedObjectDAOTest)
13-Sep-2017 18:46:40   getAllObjects_shouldReturnAllSavedObjectsOfThePassedType(org.openmrs.api.db.SerializedObjectDAOTest)
13-Sep-2017 18:46:40
13-Sep-2017 18:46:40 Tests run: 3052, Failures: 0, Errors: 7, Skipped: 25
13-Sep-2017 18:46:40
13-Sep-2017 18:46:40 [INFO] ------------------------------------------------------------------------
13-Sep-2017 18:46:40 [INFO] Reactor Summary:
13-Sep-2017 18:46:40 [INFO]
13-Sep-2017 18:46:40 [INFO] OpenMRS ............................................ SUCCESS [ 19.345 s]
13-Sep-2017 18:46:40 [INFO] openmrs-tools ...................................... SUCCESS [ 10.558 s]
13-Sep-2017 18:46:40 [INFO] openmrs-test ....................................... SUCCESS [  7.265 s]
13-Sep-2017 18:46:40 [INFO] openmrs-api ........................................ FAILURE [03:15 min]
13-Sep-2017 18:46:40 [INFO] openmrs-web ........................................ SKIPPED
13-Sep-2017 18:46:40 [INFO] openmrs-webapp ..................................... SKIPPED
13-Sep-2017 18:46:40 [INFO] ------------------------------------------------------------------------
13-Sep-2017 18:46:40 [INFO] BUILD FAILURE
13-Sep-2017 18:46:40 [INFO] ------------------------------------------------------------------------
13-Sep-2017 18:46:40 [INFO] Total time: 03:53 min
13-Sep-2017 18:46:40 [INFO] Finished at: 2017-09-13T18:46:40+00:00
13-Sep-2017 18:46:41 [INFO] Final Memory: 63M/680M
13-Sep-2017 18:46:41 [INFO] ------------------------------------------------------------------------
13-Sep-2017 18:46:41 [ERROR] Failed to execute goal org.apache.maven.plugins:maven-surefire-plugin:2.5:test (default-test) on project openmrs-api: There are test failures.
13-Sep-2017 18:46:41 [ERROR]
13-Sep-2017 18:46:41 [ERROR] Please refer to /home/bamboo-agent-2/bamboo-agent/xml-data/build-dir/TRUNK-OC12-JOB1/api/target/surefire-reports for the individual test results.
13-Sep-2017 18:46:41 [ERROR] -> [Help 1]
13-Sep-2017 18:46:41 [ERROR]
13-Sep-2017 18:46:41 [ERROR] To see the full stack trace of the errors, re-run Maven with the -e switch.
13-Sep-2017 18:46:41 [ERROR] Re-run Maven using the -X switch to enable full debug logging.
13-Sep-2017 18:46:41 [ERROR]
13-Sep-2017 18:46:41 [ERROR] For more information about the errors and possible solutions, please read the following articles:
13-Sep-2017 18:46:41 [ERROR] [Help 1] http://cwiki.apache.org/confluence/display/MAVEN/MojoFailureException
13-Sep-2017 18:46:41 [ERROR]
13-Sep-2017 18:46:41 [ERROR] After correcting the problems, you can resume the build with the command
13-Sep-2017 18:46:41 [ERROR]   mvn <goals> -rf :openmrs-api
13-Sep-2017 18:46:41 Failing task since return code of [/usr/share/apache-maven-3.2.3/bin/mvn --batch-mode -Djava.io.tmpdir=/home/bamboo-agent-2/bamboo-agent/.agent_tmp/TRUNK-OC12-JOB1 clean deploy] was 1 while expected 0
13-Sep-2017 18:46:41 Parsing test results under /home/bamboo-agent-2/bamboo-agent/xml-data/build-dir/TRUNK-OC12-JOB1...
13-Sep-2017 18:46:42 Finished task 'Maven 3.x' with result: Failed
13-Sep-2017 18:46:42 Running post build plugin 'Docker Container Cleanup'
13-Sep-2017 18:46:42 Running post build plugin 'NCover Results Collector'
13-Sep-2017 18:46:42 Running post build plugin 'Clover Results Collector'
13-Sep-2017 18:46:42 Running post build plugin 'Sauce OnDemand Post Runner'
13-Sep-2017 18:46:42 Running post build plugin 'npm Cache Cleanup'
13-Sep-2017 18:46:42 Running post build plugin 'Artifact Copier'
13-Sep-2017 18:46:42 Publishing an artifact: openmrs 1.12 war
13-Sep-2017 18:46:42 Unable to publish artifact [openmrs 1.12 war]: the source directory /home/bamboo-agent-2/bamboo-agent/xml-data/build-dir/TRUNK-OC12-JOB1/webapp/target does not exist.
13-Sep-2017 18:46:42 The artifact hasn't been successfully published after 53.05 ms
13-Sep-2017 18:46:42 Publishing an artifact: openmrs 1.12 api jar
13-Sep-2017 18:46:42 Unable to publish artifact [openmrs 1.12 api jar]: the source directory /home/bamboo-agent-2/bamboo-agent/xml-data/build-dir/TRUNK-OC12-JOB1/webapp/target/openmrs/WEB-INF/lib does not exist.
13-Sep-2017 18:46:42 The artifact hasn't been successfully published after 174.8 μs
13-Sep-2017 18:46:42 Finalising the build...
13-Sep-2017 18:46:42 Stopping timer.
13-Sep-2017 18:46:42 Build TRUNK-OC12-JOB1-87 completed.
13-Sep-2017 18:46:43 Running on server: post build plugin 'NCover Results Collector'
13-Sep-2017 18:46:43 Running on server: post build plugin 'Build Hanging Detection Configuration'
13-Sep-2017 18:46:43 Running on server: post build plugin 'Clover Delta Calculator'
13-Sep-2017 18:46:43 Running on server: post build plugin 'Maven Dependencies Postprocessor'
13-Sep-2017 18:46:43 All post build plugins have finished
13-Sep-2017 18:46:43 Generating build results summary...
13-Sep-2017 18:46:46 Saving build results to disk...
13-Sep-2017 18:46:47 Logging substituted variables...
13-Sep-2017 18:46:47 Indexing build results...
13-Sep-2017 18:46:47 Finished building TRUNK-OC12-JOB1-87.