Build #2,257

More details of the release in https://wiki.openmrs.org/x/i4DTAw

Build: #2257 failed

Job: Default Job failed

Stages & jobs

  1. Default Stage

  2. Release

    Requires a user to start manually

Job result summary

Completed
Duration
12 minutes
Revision
c34ca575794c751e05b426570eebe34c1e5684de c34ca575794c751e05b426570eebe34c1e5684de
Total tests
385
Fixed in
#2258 (Code changes detected)

Tests

  • 385 tests in total
  • 94 tests failed
  • 94 failures are new
  • 3 tests were quarantined / skipped
  • 6 minutes taken in total.
New test failures 94
Status Test Duration
Collapse Failed EmrApiActivatorComponentTest confirmThatMetadataSourceIsCreated History
< 1 sec
org.dbunit.dataset.NoSuchTableException: person
Collapse Failed EmrApiActivatorComponentTest confirmThatUnknownProviderCreated History
< 1 sec
org.dbunit.dataset.NoSuchTableException: person
Collapse Failed EmrApiActivatorComponentTest shouldCreateMappingIfProviderAlreadyExistsForCoreGlobalProperty History
< 1 sec
org.dbunit.dataset.NoSuchTableException: person
Collapse Failed EmrApiActivatorComponentTest shouldCreateMappingIfProviderAlreadyExistsForEmrApiGlobalProperty History
< 1 sec
org.dbunit.dataset.NoSuchTableException: person
Collapse Failed EmrApiActivatorComponentTest testExtraPatientIdentifierTypesMappedToSet History
< 1 sec
org.dbunit.dataset.NoSuchTableException: person
Collapse Failed EmrApiActivatorComponentTest testMetadataMappingsCreated History
< 1 sec
org.dbunit.dataset.NoSuchTableException: person
Collapse Failed EmrApiActivatorComponentTest testPrivilegeLevelsCreated History
< 1 sec
org.dbunit.dataset.NoSuchTableException: person
Collapse Failed AccountComponentTest shouldHandlePersonWithoutUser History
< 1 sec
org.dbunit.dataset.NoSuchTableException: person
Collapse Failed AccountComponentTest shouldLoadExistingPersonAndUserAndProvider History
< 1 sec
org.dbunit.dataset.NoSuchTableException: person
Collapse Failed AccountComponentTest shouldRetireExistingUser History
< 1 sec
org.dbunit.dataset.NoSuchTableException: person
Collapse Failed AccountComponentTest shouldSavePerson History
< 1 sec
org.dbunit.dataset.NoSuchTableException: person
Collapse Failed AccountComponentTest shouldSavePersonAndUserAndProvider History
< 1 sec
org.dbunit.dataset.NoSuchTableException: person
Collapse Failed AccountComponentTest shouldSetProviderRoleToNull History
< 1 sec
org.dbunit.dataset.NoSuchTableException: person
Collapse Failed AccountComponentTest shouldUnretireExistingUser History
< 1 sec
org.dbunit.dataset.NoSuchTableException: person
Collapse Failed AccountDomainWrapperComponentTest testThatBeanCanHavePropertiesAutowired History
< 1 sec
org.dbunit.dataset.NoSuchTableException: person
Collapse Failed AdtServiceComponentTest integrationTest_ADT_workflow History
< 1 sec
org.dbunit.dataset.NoSuchTableException: person
Collapse Failed AdtServiceComponentTest integrationTest_ADT_workflow_duplicate_visits History
< 1 sec
org.dbunit.dataset.NoSuchTableException: person
Collapse Failed AdtServiceComponentTest integrationTest_createRetrospectiveVisit History
< 1 sec
org.dbunit.dataset.NoSuchTableException: person
Collapse Failed AdtServiceComponentTest test_MergePatientsWithOverlappingVisits History
< 1 sec
org.dbunit.dataset.NoSuchTableException: person
Collapse Failed AdtServiceComponentTest test_shouldCloseActiveVisits History
< 1 sec
org.dbunit.dataset.NoSuchTableException: person
Collapse Failed AdtServiceComponentTest test_shouldNotCloseVisitIfMostRecentDispositionKeepsVisitOpen History
< 1 sec
org.dbunit.dataset.NoSuchTableException: person
Collapse Failed AdtServiceComponentTest test_shouldNotCloseVisitOpenedInDifferentLocation History
< 1 sec
org.dbunit.dataset.NoSuchTableException: person
Collapse Failed EncounterTypeToVisitTypeMapperTest testMappingWithDefaultEncounterTypeMapping History
< 1 sec
org.dbunit.dataset.NoSuchTableException: person
Collapse Failed EncounterTypeToVisitTypeMapperTest testMappingWithDefaultEncounterTypeMappingOverride History
< 1 sec
org.dbunit.dataset.NoSuchTableException: person
Collapse Failed EncounterTypeToVisitTypeMapperTest testMappingWithDefaultEncounterTypeMappingOverrideWithDefaultLast History
< 1 sec
org.dbunit.dataset.NoSuchTableException: person
Collapse Failed EncounterTypeToVisitTypeMapperTest testMappingWithEncounterTypeIds History
< 1 sec
org.dbunit.dataset.NoSuchTableException: person
Collapse Failed EncounterTypeToVisitTypeMapperTest testMappingWithEncounterTypeUuids History
< 1 sec
org.dbunit.dataset.NoSuchTableException: person
Collapse Failed EncounterTypeToVisitTypeMapperTest testMappingWithNoMappingString History
< 1 sec
org.dbunit.dataset.NoSuchTableException: person
Collapse Failed AwaitingAdmissionVisitQueryEvaluatorTest shouldFindVisitAwaitingAdmission History
< 1 sec
org.dbunit.dataset.NoSuchTableException: person
Collapse Failed AwaitingAdmissionVisitQueryEvaluatorTest shouldFindVisitEvenIfPatientHasMoreRecentVisitNoteWithoutAdmissionDisposition History
< 1 sec
org.dbunit.dataset.NoSuchTableException: person
Collapse Failed AwaitingAdmissionVisitQueryEvaluatorTest shouldFindVisitIfAtSameLocation History
< 1 sec
org.dbunit.dataset.NoSuchTableException: person
Collapse Failed AwaitingAdmissionVisitQueryEvaluatorTest shouldFindVisitWithDispositionOfAdmitIfFollowedByAdmissionDecisionThatIsNotDeny History
< 1 sec
org.dbunit.dataset.NoSuchTableException: person
Collapse Failed AwaitingAdmissionVisitQueryEvaluatorTest shouldFindVisitWithDispositionOfAdmitIfFollowedByAdmissionDenialObsFollowedByAnotherAdmissionDisposition History
< 1 sec
org.dbunit.dataset.NoSuchTableException: person
Collapse Failed AwaitingAdmissionVisitQueryEvaluatorTest shouldFindVisitWithDispositionOfAdmitIfFollowedByAdmissionDenialObsThatIsVoided History
< 1 sec
org.dbunit.dataset.NoSuchTableException: person
Collapse Failed AwaitingAdmissionVisitQueryEvaluatorTest shouldFindVisitWithDispositionOfAdmitIfPrecededByAdmissionDenialObs History
< 1 sec
org.dbunit.dataset.NoSuchTableException: person
Collapse Failed AwaitingAdmissionVisitQueryEvaluatorTest shouldNotConsiderVoidedAdmissionEncounter History
< 1 sec
org.dbunit.dataset.NoSuchTableException: person
Collapse Failed AwaitingAdmissionVisitQueryEvaluatorTest shouldNotCountDispositionOnVoidedEncounter History
< 1 sec
org.dbunit.dataset.NoSuchTableException: person
Collapse Failed AwaitingAdmissionVisitQueryEvaluatorTest shouldNotFindVisitAwaitingAdmissionIfPatientIsDead History
< 1 sec
org.dbunit.dataset.NoSuchTableException: person
Collapse Failed AwaitingAdmissionVisitQueryEvaluatorTest shouldNotFindVisitAwaitingAdmissionIfPatientNotInContext History
< 1 sec
org.dbunit.dataset.NoSuchTableException: person
Collapse Failed AwaitingAdmissionVisitQueryEvaluatorTest shouldNotFindVisitAwaitingAdmissionIfVisitNotInContext History
< 1 sec
org.dbunit.dataset.NoSuchTableException: person
Collapse Failed AwaitingAdmissionVisitQueryEvaluatorTest shouldNotFindVisitIfAtAnotherLocation History
< 1 sec
org.dbunit.dataset.NoSuchTableException: person
Collapse Failed AwaitingAdmissionVisitQueryEvaluatorTest shouldNotFindVisitIfNoAdmitDisposition History
< 1 sec
org.dbunit.dataset.NoSuchTableException: person
Collapse Failed AwaitingAdmissionVisitQueryEvaluatorTest shouldNotFindVisitIfPatientAdmitted History
< 1 sec
org.dbunit.dataset.NoSuchTableException: person
Collapse Failed AwaitingAdmissionVisitQueryEvaluatorTest shouldNotFindVisitWithDispositionOfAdmitIfFollowedByAdmissionDenialObs History
< 1 sec
org.dbunit.dataset.NoSuchTableException: person
Collapse Failed AwaitingAdmissionVisitQueryEvaluatorTest shouldNotFindVisitWithDispositionOfAdmitIfFollowedByAdmissionDenialObsFollowedByAnotherAdmissionDispositionFollowedByAnotherAdmissionDenial History
< 1 sec
org.dbunit.dataset.NoSuchTableException: person
Collapse Failed AwaitingAdmissionVisitQueryEvaluatorTest shouldNotReturnSameVisitTwice History
< 1 sec
org.dbunit.dataset.NoSuchTableException: person
Collapse Failed MostRecentAdmissionRequestVisitDataEvaluatorTest shouldReturnMostRecentAdmissionRequestForVisit History
< 1 sec
org.dbunit.dataset.NoSuchTableException: person
Collapse Failed EmrConceptServiceComponentTest testConceptSearchByIcd10Code History
< 1 sec
org.dbunit.dataset.NoSuchTableException: person
Collapse Failed EmrConceptServiceComponentTest testConceptSearchByName History
< 1 sec
org.dbunit.dataset.NoSuchTableException: person
Collapse Failed EmrConceptServiceComponentTest testConceptSearchForSetMembers History
< 1 sec
org.dbunit.dataset.NoSuchTableException: person

Error summary

The build generated some errors. See the full build log for more details.

        at org.hibernate.loader.Loader.doQuery(Loader.java:801)
        at org.hibernate.loader.Loader.doQueryAndInitializeNonLazyCollections(Loader.java:274)
        at org.hibernate.loader.Loader.doList(Loader.java:2533)
        ... 34 more
org.openmrs.module.ModuleException: Unable to run onStartup() method as Daemon
        at org.openmrs.api.context.Daemon.runStartupForService(Daemon.java:231)
        at org.openmrs.api.context.ServiceContext$1.run(ServiceContext.java:1001)
Caused by: org.hibernate.exception.SQLGrammarException: could not execute query
        at org.hibernate.exception.SQLStateConverter.convert(SQLStateConverter.java:92)
        at org.hibernate.exception.JDBCExceptionHelper.convert(JDBCExceptionHelper.java:66)
        at org.hibernate.loader.Loader.doList(Loader.java:2536)
        at org.hibernate.loader.Loader.listIgnoreQueryCache(Loader.java:2276)
        at org.hibernate.loader.Loader.list(Loader.java:2271)
        at org.hibernate.loader.hql.QueryLoader.list(QueryLoader.java:452)
        at org.hibernate.hql.ast.QueryTranslatorImpl.list(QueryTranslatorImpl.java:363)
        at org.hibernate.engine.query.HQLQueryPlan.performList(HQLQueryPlan.java:196)
        at org.hibernate.impl.SessionImpl.list(SessionImpl.java:1268)
        at org.hibernate.impl.QueryImpl.list(QueryImpl.java:102)
        at org.hibernate.impl.AbstractQueryImpl.uniqueResult(AbstractQueryImpl.java:890)
        at org.openmrs.api.db.hibernate.HibernateContextDAO.getUserByUuid(HibernateContextDAO.java:191)
        at sun.reflect.NativeMethodAccessorImpl.invoke0(Native Method)
        at sun.reflect.NativeMethodAccessorImpl.invoke(NativeMethodAccessorImpl.java:62)
        at sun.reflect.DelegatingMethodAccessorImpl.invoke(DelegatingMethodAccessorImpl.java:43)
        at java.lang.reflect.Method.invoke(Method.java:498)
        at org.springframework.aop.support.AopUtils.invokeJoinpointUsingReflection(AopUtils.java:309)
        at org.springframework.aop.framework.ReflectiveMethodInvocation.invokeJoinpoint(ReflectiveMethodInvocation.java:183)
        at org.springframework.aop.framework.ReflectiveMethodInvocation.proceed(ReflectiveMethodInvocation.java:150)
        at org.springframework.transaction.interceptor.TransactionInterceptor.invoke(TransactionInterceptor.java:110)
        at org.springframework.aop.framework.ReflectiveMethodInvocation.proceed(ReflectiveMethodInvocation.java:172)
        at org.springframework.aop.framework.JdkDynamicAopProxy.invoke(JdkDynamicAopProxy.java:202)
        at com.sun.proxy.$Proxy131.getUserByUuid(Unknown Source)
        at org.openmrs.api.context.Context.getAuthenticatedUser(Context.java:614)
        at org.openmrs.aop.AuthorizationAdvice.before(AuthorizationAdvice.java:48)
        at org.springframework.aop.framework.adapter.MethodBeforeAdviceInterceptor.invoke(MethodBeforeAdviceInterceptor.java:49)
        at org.springframework.aop.framework.ReflectiveMethodInvocation.proceed(ReflectiveMethodInvocation.java:172)
        at org.springframework.aop.framework.JdkDynamicAopProxy.invoke(JdkDynamicAopProxy.java:202)
        at com.sun.proxy.$Proxy101.onStartup(Unknown Source)
        at org.openmrs.api.context.Daemon$4.run(Daemon.java:205)
Caused by: org.h2.jdbc.JdbcSQLException: Table "USERS" not found; SQL statement:
select user0_.user_id as user1_41_, user0_.uuid as uuid41_, user0_.person_id as person3_41_, user0_.system_id as system4_41_, user0_.username as username41_, user0_.creator as creator41_, user0_.date_created as date7_41_, user0_.changed_by as changed8_41_, user0_.date_changed as date9_41_, user0_.retired as retired41_, user0_.retired_by as retired11_41_, user0_.date_retired as date12_41_, user0_.retire_reason as retire13_41_, user0_.secret_question as secret14_41_ from users user0_ where user0_.uuid=? [42102-135]
        at org.h2.message.DbException.getJdbcSQLException(DbException.java:327)
        at org.h2.message.DbException.get(DbException.java:167)
        at org.h2.message.DbException.get(DbException.java:144)
        at org.h2.command.Parser.readTableOrView(Parser.java:4386)
        at org.h2.command.Parser.readTableFilter(Parser.java:1002)
        at org.h2.command.Parser.parseSelectSimpleFromPart(Parser.java:1536)
        at org.h2.command.Parser.parseSelectSimple(Parser.java:1633)
        at org.h2.command.Parser.parseSelectSub(Parser.java:1530)
        at org.h2.command.Parser.parseSelectUnion(Parser.java:1375)
        at org.h2.command.Parser.parseSelect(Parser.java:1363)
        at org.h2.command.Parser.parsePrepared(Parser.java:395)
        at org.h2.command.Parser.parse(Parser.java:278)
        at org.h2.command.Parser.parse(Parser.java:250)
        at org.h2.command.Parser.prepareCommand(Parser.java:222)
        at org.h2.engine.Session.prepareLocal(Session.java:420)
        at org.h2.engine.Session.prepareCommand(Session.java:381)
        at org.h2.jdbc.JdbcConnection.prepareCommand(JdbcConnection.java:1071)
        at org.h2.jdbc.JdbcPreparedStatement.<init>(JdbcPreparedStatement.java:71)
        at org.h2.jdbc.JdbcConnection.prepareStatement(JdbcConnection.java:234)
        at com.mchange.v2.c3p0.impl.NewProxyConnection.prepareStatement(NewProxyConnection.java:213)
        at org.hibernate.jdbc.AbstractBatcher.getPreparedStatement(AbstractBatcher.java:534)
        at org.hibernate.jdbc.AbstractBatcher.getPreparedStatement(AbstractBatcher.java:452)
        at org.hibernate.jdbc.AbstractBatcher.prepareQueryStatement(AbstractBatcher.java:161)
        at org.hibernate.loader.Loader.prepareQueryStatement(Loader.java:1700)
        at org.hibernate.loader.Loader.doQuery(Loader.java:801)
        at org.hibernate.loader.Loader.doQueryAndInitializeNonLazyCollections(Loader.java:274)
        at org.hibernate.loader.Loader.doList(Loader.java:2533)
        ... 27 more
SLF4J: Class path contains multiple SLF4J bindings.
SLF4J: Found binding in [jar:file:/home/bamboo-agent/.m2/repository/org/slf4j/slf4j-log4j12/1.6.0/slf4j-log4j12-1.6.0.jar!/org/slf4j/impl/StaticLoggerBinder.class]
SLF4J: Found binding in [jar:file:/home/bamboo-agent/.m2/repository/org/slf4j/slf4j-log4j12/1.6.0/slf4j-log4j12-1.6.0.jar!/org/slf4j/impl/StaticLoggerBinder.class]
SLF4J: See http://www.slf4j.org/codes.html#multiple_bindings for an explanation.
SLF4J: Class path contains multiple SLF4J bindings.
SLF4J: Found binding in [jar:file:/home/bamboo-agent/.m2/repository/org/slf4j/slf4j-log4j12/1.6.0/slf4j-log4j12-1.6.0.jar!/org/slf4j/impl/StaticLoggerBinder.class]
SLF4J: Found binding in [jar:file:/home/bamboo-agent/.m2/repository/org/slf4j/slf4j-log4j12/1.6.0/slf4j-log4j12-1.6.0.jar!/org/slf4j/impl/StaticLoggerBinder.class]
SLF4J: See http://www.slf4j.org/codes.html#multiple_bindings for an explanation.
SLF4J: Class path contains multiple SLF4J bindings.
SLF4J: Found binding in [jar:file:/home/bamboo-agent/.m2/repository/org/slf4j/slf4j-log4j12/1.6.0/slf4j-log4j12-1.6.0.jar!/org/slf4j/impl/StaticLoggerBinder.class]
SLF4J: Found binding in [jar:file:/home/bamboo-agent/.m2/repository/org/slf4j/slf4j-log4j12/1.6.0/slf4j-log4j12-1.6.0.jar!/org/slf4j/impl/StaticLoggerBinder.class]
SLF4J: See http://www.slf4j.org/codes.html#multiple_bindings for an explanation.
SLF4J: Class path contains multiple SLF4J bindings.
SLF4J: Found binding in [jar:file:/home/bamboo-agent/.m2/repository/org/slf4j/slf4j-log4j12/1.6.0/slf4j-log4j12-1.6.0.jar!/org/slf4j/impl/StaticLoggerBinder.class]
SLF4J: Found binding in [jar:file:/home/bamboo-agent/.m2/repository/org/slf4j/slf4j-log4j12/1.6.0/slf4j-log4j12-1.6.0.jar!/org/slf4j/impl/StaticLoggerBinder.class]
SLF4J: See http://www.slf4j.org/codes.html#multiple_bindings for an explanation.
SLF4J: Class path contains multiple SLF4J bindings.
SLF4J: Found binding in [jar:file:/home/bamboo-agent/.m2/repository/org/slf4j/slf4j-log4j12/1.6.0/slf4j-log4j12-1.6.0.jar!/org/slf4j/impl/StaticLoggerBinder.class]
SLF4J: Found binding in [jar:file:/home/bamboo-agent/.m2/repository/org/slf4j/slf4j-log4j12/1.6.0/slf4j-log4j12-1.6.0.jar!/org/slf4j/impl/StaticLoggerBinder.class]
SLF4J: See http://www.slf4j.org/codes.html#multiple_bindings for an explanation.
SLF4J: Class path contains multiple SLF4J bindings.
SLF4J: Found binding in [jar:file:/home/bamboo-agent/.m2/repository/org/slf4j/slf4j-log4j12/1.6.0/slf4j-log4j12-1.6.0.jar!/org/slf4j/impl/StaticLoggerBinder.class]
SLF4J: Found binding in [jar:file:/home/bamboo-agent/.m2/repository/org/slf4j/slf4j-log4j12/1.6.0/slf4j-log4j12-1.6.0.jar!/org/slf4j/impl/StaticLoggerBinder.class]
SLF4J: See http://www.slf4j.org/codes.html#multiple_bindings for an explanation.
SLF4J: Class path contains multiple SLF4J bindings.
SLF4J: Found binding in [jar:file:/home/bamboo-agent/.m2/repository/org/slf4j/slf4j-log4j12/1.6.0/slf4j-log4j12-1.6.0.jar!/org/slf4j/impl/StaticLoggerBinder.class]
SLF4J: Found binding in [jar:file:/home/bamboo-agent/.m2/repository/org/slf4j/slf4j-log4j12/1.6.0/slf4j-log4j12-1.6.0.jar!/org/slf4j/impl/StaticLoggerBinder.class]
SLF4J: See http://www.slf4j.org/codes.html#multiple_bindings for an explanation.
SLF4J: Class path contains multiple SLF4J bindings.
SLF4J: Found binding in [jar:file:/home/bamboo-agent/.m2/repository/org/slf4j/slf4j-log4j12/1.6.0/slf4j-log4j12-1.6.0.jar!/org/slf4j/impl/StaticLoggerBinder.class]
SLF4J: Found binding in [jar:file:/home/bamboo-agent/.m2/repository/org/slf4j/slf4j-log4j12/1.6.0/slf4j-log4j12-1.6.0.jar!/org/slf4j/impl/StaticLoggerBinder.class]
SLF4J: See http://www.slf4j.org/codes.html#multiple_bindings for an explanation.