More details of the release in https://wiki.openmrs.org/x/i4DTAw

Build: #771 failed Manual run by Mark Goodrich

Stages & jobs

  1. Default Stage

  2. Release

    Requires a user to start manually

Build result summary

Details

Completed
Duration
5 minutes
Labels
None
Revisions
Git
2f011cbe3a23a2d6ae8b170cd71769113944ccda 2f011cbe3a23a2d6ae8b170cd71769113944ccda
Release scripts
8ad880e0b0c21a2d094411a51f7951e0b9148c4a 8ad880e0b0c21a2d094411a51f7951e0b9148c4a
Total tests
4350
Failing since
#770 (Manual run from the stage: Release by Mark Goodrich)
Fixed in
#773 (Changes by mgoodrich <mark.goodrich@live.com>)

Tests

Responsible

This build has been failing since #770
No one has taken responsibility

Tests

New test failures 6
Status Test View job Duration
Collapse Failed DefinitionServiceTest getDefinitionByUuid_shouldDeserializeCohortIndicatorAndDimensionDataSetDefinition History
Test against 1.11 < 1 sec
java.lang.AssertionError:  Expected: not null      but: was null
java.lang.AssertionError: 
Expected: not null
     but: was null
	at org.hamcrest.MatcherAssert.assertThat(MatcherAssert.java:20)
	at org.junit.Assert.assertThat(Assert.java:865)
	at org.junit.Assert.assertThat(Assert.java:832)
	at org.openmrs.module.reporting.definition.service.DefinitionServiceTest.getDefinitionByUuid_shouldDeserializeCohortIndicatorAndDimensionDataSetDefinition(DefinitionServiceTest.java:43)
(35 more lines...)
Collapse Failed DefinitionServiceTest getDefinitionByUuid_shouldDeserializeCohortIndicatorAndDimensionDataSetDefinition History
Test against 1.12 < 1 sec
java.lang.AssertionError:  Expected: not null      but: was null
java.lang.AssertionError: 
Expected: not null
     but: was null
	at org.hamcrest.MatcherAssert.assertThat(MatcherAssert.java:20)
	at org.junit.Assert.assertThat(Assert.java:865)
	at org.junit.Assert.assertThat(Assert.java:832)
	at org.openmrs.module.reporting.definition.service.DefinitionServiceTest.getDefinitionByUuid_shouldDeserializeCohortIndicatorAndDimensionDataSetDefinition(DefinitionServiceTest.java:43)
(35 more lines...)
Collapse Failed DefinitionServiceTest getDefinitionByUuid_shouldDeserializeCohortIndicatorAndDimensionDataSetDefinition History
Default Job < 1 sec
java.lang.AssertionError:  Expected: not null      but: was null
java.lang.AssertionError: 
Expected: not null
     but: was null
	at org.hamcrest.MatcherAssert.assertThat(MatcherAssert.java:20)
	at org.junit.Assert.assertThat(Assert.java:865)
	at org.junit.Assert.assertThat(Assert.java:832)
	at org.openmrs.module.reporting.definition.service.DefinitionServiceTest.getDefinitionByUuid_shouldDeserializeCohortIndicatorAndDimensionDataSetDefinition(DefinitionServiceTest.java:43)
(35 more lines...)
Collapse Failed DefinitionServiceTest getDefinitionByUuid_shouldDeserializeCohortIndicatorAndDimensionDataSetDefinition History
Test against 1.10 < 1 sec
java.lang.AssertionError:  Expected: not null      but: was null
java.lang.AssertionError: 
Expected: not null
     but: was null
	at org.hamcrest.MatcherAssert.assertThat(MatcherAssert.java:20)
	at org.junit.Assert.assertThat(Assert.java:865)
	at org.junit.Assert.assertThat(Assert.java:832)
	at org.openmrs.module.reporting.definition.service.DefinitionServiceTest.getDefinitionByUuid_shouldDeserializeCohortIndicatorAndDimensionDataSetDefinition(DefinitionServiceTest.java:43)
(35 more lines...)
Collapse Failed DefinitionServiceTest getDefinitionByUuid_shouldDeserializeCohortIndicatorAndDimensionDataSetDefinition History
Test against 2.0 < 1 sec
java.lang.AssertionError:  Expected: not null      but: was null
java.lang.AssertionError: 
Expected: not null
     but: was null
	at org.hamcrest.MatcherAssert.assertThat(MatcherAssert.java:20)
	at org.junit.Assert.assertThat(Assert.java:865)
	at org.junit.Assert.assertThat(Assert.java:832)
	at org.openmrs.module.reporting.definition.service.DefinitionServiceTest.getDefinitionByUuid_shouldDeserializeCohortIndicatorAndDimensionDataSetDefinition(DefinitionServiceTest.java:43)
(36 more lines...)
Collapse Failed DefinitionServiceTest getDefinitionByUuid_shouldDeserializeCohortIndicatorAndDimensionDataSetDefinition History
Test against 2.1 < 1 sec
java.lang.AssertionError:  Expected: not null      but: was null
java.lang.AssertionError: 
Expected: not null
     but: was null
	at org.hamcrest.MatcherAssert.assertThat(MatcherAssert.java:20)
	at org.junit.Assert.assertThat(Assert.java:865)
	at org.junit.Assert.assertThat(Assert.java:832)
	at org.openmrs.module.reporting.definition.service.DefinitionServiceTest.getDefinitionByUuid_shouldDeserializeCohortIndicatorAndDimensionDataSetDefinition(DefinitionServiceTest.java:43)
(36 more lines...)