More details of the release in https://wiki.openmrs.org/x/i4DTAw

Build: #771 failed Manual run by Mark Goodrich

Stages & jobs

  1. Default Stage

  2. Release

    Requires a user to start manually

Test results

  • 4,350 tests in total
  • 6 tests failed
  • 6 failures are new
  • 84 tests were quarantined / skipped
  • 12 minutes taken in total.
New test failures 6
Status Test View job Duration
Collapse Failed DefinitionServiceTest getDefinitionByUuid_shouldDeserializeCohortIndicatorAndDimensionDataSetDefinition History
Test against 1.11 < 1 sec
java.lang.AssertionError:  Expected: not null      but: was null
java.lang.AssertionError: 
Expected: not null
     but: was null
	at org.hamcrest.MatcherAssert.assertThat(MatcherAssert.java:20)
	at org.junit.Assert.assertThat(Assert.java:865)
	at org.junit.Assert.assertThat(Assert.java:832)
	at org.openmrs.module.reporting.definition.service.DefinitionServiceTest.getDefinitionByUuid_shouldDeserializeCohortIndicatorAndDimensionDataSetDefinition(DefinitionServiceTest.java:43)
(35 more lines...)
Collapse Failed DefinitionServiceTest getDefinitionByUuid_shouldDeserializeCohortIndicatorAndDimensionDataSetDefinition History
Test against 1.12 < 1 sec
java.lang.AssertionError:  Expected: not null      but: was null
java.lang.AssertionError: 
Expected: not null
     but: was null
	at org.hamcrest.MatcherAssert.assertThat(MatcherAssert.java:20)
	at org.junit.Assert.assertThat(Assert.java:865)
	at org.junit.Assert.assertThat(Assert.java:832)
	at org.openmrs.module.reporting.definition.service.DefinitionServiceTest.getDefinitionByUuid_shouldDeserializeCohortIndicatorAndDimensionDataSetDefinition(DefinitionServiceTest.java:43)
(35 more lines...)
Collapse Failed DefinitionServiceTest getDefinitionByUuid_shouldDeserializeCohortIndicatorAndDimensionDataSetDefinition History
Default Job < 1 sec
java.lang.AssertionError:  Expected: not null      but: was null
java.lang.AssertionError: 
Expected: not null
     but: was null
	at org.hamcrest.MatcherAssert.assertThat(MatcherAssert.java:20)
	at org.junit.Assert.assertThat(Assert.java:865)
	at org.junit.Assert.assertThat(Assert.java:832)
	at org.openmrs.module.reporting.definition.service.DefinitionServiceTest.getDefinitionByUuid_shouldDeserializeCohortIndicatorAndDimensionDataSetDefinition(DefinitionServiceTest.java:43)
(35 more lines...)
Collapse Failed DefinitionServiceTest getDefinitionByUuid_shouldDeserializeCohortIndicatorAndDimensionDataSetDefinition History
Test against 1.10 < 1 sec
java.lang.AssertionError:  Expected: not null      but: was null
java.lang.AssertionError: 
Expected: not null
     but: was null
	at org.hamcrest.MatcherAssert.assertThat(MatcherAssert.java:20)
	at org.junit.Assert.assertThat(Assert.java:865)
	at org.junit.Assert.assertThat(Assert.java:832)
	at org.openmrs.module.reporting.definition.service.DefinitionServiceTest.getDefinitionByUuid_shouldDeserializeCohortIndicatorAndDimensionDataSetDefinition(DefinitionServiceTest.java:43)
(35 more lines...)
Collapse Failed DefinitionServiceTest getDefinitionByUuid_shouldDeserializeCohortIndicatorAndDimensionDataSetDefinition History
Test against 2.0 < 1 sec
java.lang.AssertionError:  Expected: not null      but: was null
java.lang.AssertionError: 
Expected: not null
     but: was null
	at org.hamcrest.MatcherAssert.assertThat(MatcherAssert.java:20)
	at org.junit.Assert.assertThat(Assert.java:865)
	at org.junit.Assert.assertThat(Assert.java:832)
	at org.openmrs.module.reporting.definition.service.DefinitionServiceTest.getDefinitionByUuid_shouldDeserializeCohortIndicatorAndDimensionDataSetDefinition(DefinitionServiceTest.java:43)
(36 more lines...)
Collapse Failed DefinitionServiceTest getDefinitionByUuid_shouldDeserializeCohortIndicatorAndDimensionDataSetDefinition History
Test against 2.1 < 1 sec
java.lang.AssertionError:  Expected: not null      but: was null
java.lang.AssertionError: 
Expected: not null
     but: was null
	at org.hamcrest.MatcherAssert.assertThat(MatcherAssert.java:20)
	at org.junit.Assert.assertThat(Assert.java:865)
	at org.junit.Assert.assertThat(Assert.java:832)
	at org.openmrs.module.reporting.definition.service.DefinitionServiceTest.getDefinitionByUuid_shouldDeserializeCohortIndicatorAndDimensionDataSetDefinition(DefinitionServiceTest.java:43)
(36 more lines...)
Skipped tests 84
Status Test Failing since View job
Skipped CodedObsCohortDefinitionEvaluatorTest evaluate_shouldNotReturnVoidedPatients History
Default Job
Skipped CodedObsCohortDefinitionEvaluatorTest evaluate_shouldNotReturnVoidedPatients History
Test against 1.11
Skipped CodedObsCohortDefinitionEvaluatorTest evaluate_shouldNotReturnVoidedPatients History
Test against 2.1
Skipped CodedObsCohortDefinitionEvaluatorTest evaluate_shouldNotReturnVoidedPatients History
Test against 1.10
Skipped CodedObsCohortDefinitionEvaluatorTest evaluate_shouldNotReturnVoidedPatients History
Test against 1.12
Skipped CodedObsCohortDefinitionEvaluatorTest evaluate_shouldNotReturnVoidedPatients History
Test against 2.0
Skipped EncounterCohortDefinitionEvaluatorTest evaluate_shouldReturnCorrectPatientsWhenProviderParametersAreSet History
Test against 2.0
Skipped EncounterCohortDefinitionEvaluatorTest evaluate_shouldReturnCorrectPatientsWhenProviderParametersAreSet History
Test against 1.10
Skipped EncounterCohortDefinitionEvaluatorTest evaluate_shouldNotReturnVoidedPatients History
Test against 1.10
Skipped EncounterCohortDefinitionEvaluatorTest evaluate_shouldNotReturnVoidedPatients History
Test against 1.12
Skipped EncounterCohortDefinitionEvaluatorTest evaluate_shouldReturnCorrectPatientsWhenProviderParametersAreSet History
Test against 1.12
Skipped EncounterCohortDefinitionEvaluatorTest evaluate_shouldReturnCorrectPatientsWhenProviderParametersAreSet History
Test against 2.1
Skipped EncounterCohortDefinitionEvaluatorTest evaluate_shouldNotReturnVoidedPatients History
Test against 2.1
Skipped EncounterCohortDefinitionEvaluatorTest evaluate_shouldReturnCorrectPatientsWhenProviderParametersAreSet History
Test against 1.11
Skipped EncounterCohortDefinitionEvaluatorTest evaluate_shouldReturnCorrectPatientsWhenProviderParametersAreSet History
Default Job
Skipped EncounterCohortDefinitionEvaluatorTest evaluate_shouldNotReturnVoidedPatients History
Test against 1.11
Skipped EncounterCohortDefinitionEvaluatorTest evaluate_shouldNotReturnVoidedPatients History
Default Job
Skipped EncounterCohortDefinitionEvaluatorTest evaluate_shouldNotReturnVoidedPatients History
Test against 2.0
Skipped TestUtil org.openmrs.module.reporting.common.TestUtil History
Test against 1.11
Skipped TestUtil org.openmrs.module.reporting.common.TestUtil History
Default Job
Skipped TestUtil org.openmrs.module.reporting.common.TestUtil History
Test against 2.1
Skipped TestUtil org.openmrs.module.reporting.common.TestUtil History
Test against 1.10
Skipped TestUtil org.openmrs.module.reporting.common.TestUtil History
Test against 1.12
Skipped TestUtil org.openmrs.module.reporting.common.TestUtil History
Test against 2.0
Skipped GroupMemberObsDataEvaluatorTest testMakeSureEmptySingleEntryEvenIfNoMatchingObsInGroup History
Test against 1.11
Skipped GroupMemberObsDataEvaluatorTest testMakeSureEmptyListEntryEvenIfNoMatchingObsInGroup History
Test against 1.11
Skipped GroupMemberObsDataEvaluatorTest testMakeSureEmptySingleEntryEvenIfNoMatchingObsInGroup History
Test against 1.10
Skipped GroupMemberObsDataEvaluatorTest testMakeSureEmptyListEntryEvenIfNoMatchingObsInGroup History
Test against 2.1
Skipped GroupMemberObsDataEvaluatorTest testMakeSureEmptyListEntryEvenIfNoMatchingObsInGroup History
Test against 1.10
Skipped GroupMemberObsDataEvaluatorTest testMakeSureEmptySingleEntryEvenIfNoMatchingObsInGroup History
Test against 2.1
Skipped GroupMemberObsDataEvaluatorTest testMakeSureEmptyListEntryEvenIfNoMatchingObsInGroup History
Test against 1.12
Skipped GroupMemberObsDataEvaluatorTest testMakeSureEmptySingleEntryEvenIfNoMatchingObsInGroup History
Test against 1.12
Skipped GroupMemberObsDataEvaluatorTest testMakeSureEmptySingleEntryEvenIfNoMatchingObsInGroup History
Default Job
Skipped GroupMemberObsDataEvaluatorTest testMakeSureEmptyListEntryEvenIfNoMatchingObsInGroup History
Default Job
Skipped GroupMemberObsDataEvaluatorTest testMakeSureEmptyListEntryEvenIfNoMatchingObsInGroup History
Test against 2.0
Skipped GroupMemberObsDataEvaluatorTest testMakeSureEmptySingleEntryEvenIfNoMatchingObsInGroup History
Test against 2.0
Skipped LogicDataEvaluatorTest org.openmrs.module.reporting.data.patient.evaluator.LogicDataEvaluatorTest History
Test against 1.11
Skipped LogicDataEvaluatorTest org.openmrs.module.reporting.data.patient.evaluator.LogicDataEvaluatorTest History
Test against 2.1
Skipped LogicDataEvaluatorTest org.openmrs.module.reporting.data.patient.evaluator.LogicDataEvaluatorTest History
Test against 1.10
Skipped LogicDataEvaluatorTest org.openmrs.module.reporting.data.patient.evaluator.LogicDataEvaluatorTest History
Test against 2.0
Skipped LogicDataEvaluatorTest org.openmrs.module.reporting.data.patient.evaluator.LogicDataEvaluatorTest History
Test against 1.12
Skipped LogicDataEvaluatorTest org.openmrs.module.reporting.data.patient.evaluator.LogicDataEvaluatorTest History
Default Job
Skipped TestPatientCalculation org.openmrs.module.reporting.data.patient.evaluator.TestPatientCalculation History
Test against 2.0
Skipped TestPatientCalculation org.openmrs.module.reporting.data.patient.evaluator.TestPatientCalculation History
Test against 1.10
Skipped TestPatientCalculation org.openmrs.module.reporting.data.patient.evaluator.TestPatientCalculation History
Test against 2.1
Skipped TestPatientCalculation org.openmrs.module.reporting.data.patient.evaluator.TestPatientCalculation History
Test against 1.12
Skipped TestPatientCalculation org.openmrs.module.reporting.data.patient.evaluator.TestPatientCalculation History
Test against 1.11
Skipped TestPatientCalculation org.openmrs.module.reporting.data.patient.evaluator.TestPatientCalculation History
Default Job
Skipped DataExportDataSetPersisterTest org.openmrs.module.reporting.dataset.DataExportDataSetPersisterTest History
Test against 1.10
Skipped DataExportDataSetPersisterTest org.openmrs.module.reporting.dataset.DataExportDataSetPersisterTest History
Test against 1.11
Skipped DataExportDataSetPersisterTest org.openmrs.module.reporting.dataset.DataExportDataSetPersisterTest History
Test against 1.12
Skipped DataExportDataSetPersisterTest org.openmrs.module.reporting.dataset.DataExportDataSetPersisterTest History
Test against 2.1
Skipped DataExportDataSetPersisterTest org.openmrs.module.reporting.dataset.DataExportDataSetPersisterTest History
Default Job
Skipped DataExportDataSetPersisterTest org.openmrs.module.reporting.dataset.DataExportDataSetPersisterTest History
Test against 2.0
Skipped LogicDataSetEvaluatorTest org.openmrs.module.reporting.dataset.definition.evaluator.LogicDataSetEvaluatorTest History
Test against 1.11
Skipped LogicDataSetEvaluatorTest org.openmrs.module.reporting.dataset.definition.evaluator.LogicDataSetEvaluatorTest History
Test against 2.1
Skipped LogicDataSetEvaluatorTest org.openmrs.module.reporting.dataset.definition.evaluator.LogicDataSetEvaluatorTest History
Test against 1.10
Skipped LogicDataSetEvaluatorTest org.openmrs.module.reporting.dataset.definition.evaluator.LogicDataSetEvaluatorTest History
Test against 1.12
Skipped LogicDataSetEvaluatorTest org.openmrs.module.reporting.dataset.definition.evaluator.LogicDataSetEvaluatorTest History
Test against 2.0
Skipped LogicDataSetEvaluatorTest org.openmrs.module.reporting.dataset.definition.evaluator.LogicDataSetEvaluatorTest History
Default Job
Skipped MySqlDataSetEvaluatorTest org.openmrs.module.reporting.dataset.definition.evaluator.MySqlDataSetEvaluatorTest History
Default Job
Skipped MySqlDataSetEvaluatorTest org.openmrs.module.reporting.dataset.definition.evaluator.MySqlDataSetEvaluatorTest History
Test against 2.1
Skipped MySqlDataSetEvaluatorTest org.openmrs.module.reporting.dataset.definition.evaluator.MySqlDataSetEvaluatorTest History
Test against 1.10
Skipped MySqlDataSetEvaluatorTest org.openmrs.module.reporting.dataset.definition.evaluator.MySqlDataSetEvaluatorTest History
Test against 1.12
Skipped MySqlDataSetEvaluatorTest org.openmrs.module.reporting.dataset.definition.evaluator.MySqlDataSetEvaluatorTest History
Test against 1.11
Skipped MySqlDataSetEvaluatorTest org.openmrs.module.reporting.dataset.definition.evaluator.MySqlDataSetEvaluatorTest History
Test against 2.0
Skipped ObsQueryServiceImplTest evaluate_shouldEvaluateAnObsQuery History
Default Job
Skipped ObsQueryServiceImplTest evaluate_shouldEvaluateAnObsQuery History
Test against 1.11
Skipped ObsQueryServiceImplTest evaluate_shouldEvaluateAnObsQuery History
Test against 2.1
Skipped ObsQueryServiceImplTest evaluate_shouldEvaluateAnObsQuery History
Test against 1.10
Skipped ObsQueryServiceImplTest evaluate_shouldEvaluateAnObsQuery History
Test against 1.12
Skipped ObsQueryServiceImplTest evaluate_shouldEvaluateAnObsQuery History
Test against 2.0
Skipped MysqlReportServiceTest org.openmrs.module.reporting.report.service.MysqlReportServiceTest History
Test against 2.1
Skipped MysqlReportServiceTest org.openmrs.module.reporting.report.service.MysqlReportServiceTest History
Test against 1.11
Skipped MysqlReportServiceTest org.openmrs.module.reporting.report.service.MysqlReportServiceTest History
Default Job
Skipped MysqlReportServiceTest org.openmrs.module.reporting.report.service.MysqlReportServiceTest History
Test against 1.10
Skipped MysqlReportServiceTest org.openmrs.module.reporting.report.service.MysqlReportServiceTest History
Test against 1.12
Skipped MysqlReportServiceTest org.openmrs.module.reporting.report.service.MysqlReportServiceTest History
Test against 2.0
Skipped TestReportProcessor org.openmrs.module.reporting.report.service.TestReportProcessor History
Default Job
Skipped TestReportProcessor org.openmrs.module.reporting.report.service.TestReportProcessor History
Test against 1.11
Skipped TestReportProcessor org.openmrs.module.reporting.report.service.TestReportProcessor History
Test against 1.10
Skipped TestReportProcessor org.openmrs.module.reporting.report.service.TestReportProcessor History
Test against 2.1
Skipped TestReportProcessor org.openmrs.module.reporting.report.service.TestReportProcessor History
Test against 1.12
Skipped TestReportProcessor org.openmrs.module.reporting.report.service.TestReportProcessor History
Test against 2.0