More details of the release in https://wiki.openmrs.org/x/i4DTAw

Build: #795 was successful

Job: Default Job was successful

Build log

The build generated 1,850 lines of output.The output is too long and has been truncated to the last 1,000 lines. Download or view full build log

25-Oct-2019 22:38:25         at org.h2.command.CommandContainer.query(CommandContainer.java:91)
25-Oct-2019 22:38:25         at org.h2.command.Command.executeQuery(Command.java:195)
25-Oct-2019 22:38:25         at org.h2.jdbc.JdbcPreparedStatement.executeQuery(JdbcPreparedStatement.java:106)
25-Oct-2019 22:38:25         at com.mchange.v2.c3p0.impl.NewProxyPreparedStatement.executeQuery(NewProxyPreparedStatement.java:76)
25-Oct-2019 22:38:25         at org.openmrs.module.reporting.evaluation.querybuilder.SqlQueryBuilder$2.execute(SqlQueryBuilder.java:159)
25-Oct-2019 22:38:25         at org.hibernate.impl.SessionImpl.doWork(SessionImpl.java:1997)
25-Oct-2019 22:38:25         ... 95 more
25-Oct-2019 22:38:26 Tests run: 13, Failures: 0, Errors: 0, Skipped: 0, Time elapsed: 3.981 sec
25-Oct-2019 22:38:26 Running org.openmrs.module.reporting.evaluation.service.EvaluationServiceTest
25-Oct-2019 22:38:28 Tests run: 6, Failures: 0, Errors: 0, Skipped: 0, Time elapsed: 2.635 sec
25-Oct-2019 22:38:28 Running org.openmrs.module.reporting.data.obs.evaluator.EncounterToObsDataEvaluatorTest
25-Oct-2019 22:38:29 Tests run: 3, Failures: 0, Errors: 0, Skipped: 0, Time elapsed: 0.97 sec
25-Oct-2019 22:38:29 Running org.openmrs.module.reporting.query.encounter.evaluator.MappedParametersEncounterQueryEvaluatorTest
25-Oct-2019 22:38:30 Tests run: 1, Failures: 0, Errors: 0, Skipped: 0, Time elapsed: 0.314 sec
25-Oct-2019 22:38:30 Running org.openmrs.module.reporting.validator.InStateCohortDefinitionValidatorTest
25-Oct-2019 22:38:30 Tests run: 3, Failures: 0, Errors: 0, Skipped: 0, Time elapsed: 0.595 sec
25-Oct-2019 22:38:30 Running org.openmrs.module.reporting.common.ReflectionUtilTest
25-Oct-2019 22:38:30 Tests run: 6, Failures: 0, Errors: 0, Skipped: 0, Time elapsed: 0.004 sec
25-Oct-2019 22:38:30 Running org.openmrs.module.reporting.template.HandlebarsHelpersTest
25-Oct-2019 22:38:31 Tests run: 3, Failures: 0, Errors: 0, Skipped: 0, Time elapsed: 0.777 sec
25-Oct-2019 22:38:31 Running org.openmrs.module.reporting.data.visit.evaluator.VisitIdDataEvaluatorTest
25-Oct-2019 22:38:31 Tests run: 2, Failures: 0, Errors: 0, Skipped: 0, Time elapsed: 0.554 sec
25-Oct-2019 22:38:31 Running org.openmrs.module.reporting.cohort.definition.evaluator.ConditionalParameterCohortDefinitionEvaluatorTest
25-Oct-2019 22:38:32 Tests run: 1, Failures: 0, Errors: 0, Skipped: 0, Time elapsed: 0.271 sec
25-Oct-2019 22:38:32 Running org.openmrs.module.reporting.data.patient.evaluator.CurrentPatientStateDataEvaluatorTest
25-Oct-2019 22:38:32 Tests run: 1, Failures: 0, Errors: 0, Skipped: 0, Time elapsed: 0.286 sec
25-Oct-2019 22:38:32 Running org.openmrs.module.reporting.data.encounter.evaluator.ObsOnSameDateEncounterDataEvaluatorTest
25-Oct-2019 22:38:33 Tests run: 3, Failures: 0, Errors: 0, Skipped: 0, Time elapsed: 1.223 sec
25-Oct-2019 22:38:33 Running org.openmrs.module.reporting.cohort.query.service.CohortQueryServiceTest
25-Oct-2019 22:38:34 Tests run: 1, Failures: 0, Errors: 0, Skipped: 0, Time elapsed: 0.287 sec
25-Oct-2019 22:38:34 Running org.openmrs.module.reporting.data.person.evaluator.ObsForPersonDataEvaluatorTest
25-Oct-2019 22:38:34 Tests run: 3, Failures: 0, Errors: 0, Skipped: 0, Time elapsed: 0.966 sec
25-Oct-2019 22:38:34 Running org.openmrs.module.reporting.validator.StaticCohortDefinitionValidatorTest
25-Oct-2019 22:38:35 Tests run: 1, Failures: 0, Errors: 0, Skipped: 0, Time elapsed: 0.236 sec
25-Oct-2019 22:38:35 Running org.openmrs.module.reporting.dataset.definition.evaluator.EncounterDataSetEvaluatorTest
25-Oct-2019 22:38:35 ENCOUNTER ID        EMR ID        BIRTHDATE           ENCOUNTER DATE        Age At Start        Age At End        
25-Oct-2019 22:38:35 ------------        ------        ------------        --------------        ------------        ----------        
25-Oct-2019 22:38:35 3                   7             ~25/Aug/1976        01/Aug/2008           33                  34                
25-Oct-2019 22:38:35 4                   7             ~25/Aug/1976        15/Aug/2008           33                  34                
25-Oct-2019 22:38:35 5                   7             ~25/Aug/1976        19/Aug/2008           33                  34                
25-Oct-2019 22:38:35 6                   20            08/Feb/1925         19/Aug/2009           80                  80                
25-Oct-2019 22:38:35 7                   21            ~08/Jun/1959        19/Aug/2009           50                  51                
25-Oct-2019 22:38:35 8                   21            ~08/Jun/1959        19/Sep/2009           50                  51                
25-Oct-2019 22:38:35 9                   22            08/Jul/1997         19/Sep/2009           12                  13                
25-Oct-2019 22:38:35 10                  22            08/Jul/1997         19/Oct/2009           12                  13                
25-Oct-2019 22:38:35 11                  23            08/Nov/2000         19/Aug/2009           9                   10                
25-Oct-2019 22:38:35 12                  24            08/Dec/2006         19/Sep/2009           3                   4                 
25-Oct-2019 22:38:35 Tests run: 1, Failures: 0, Errors: 0, Skipped: 0, Time elapsed: 0.393 sec
25-Oct-2019 22:38:35 Running org.openmrs.module.reporting.data.person.evaluator.BirthdateDataEvaluatorTest
25-Oct-2019 22:38:35 Tests run: 1, Failures: 0, Errors: 0, Skipped: 0, Time elapsed: 0.279 sec
25-Oct-2019 22:38:35 Running org.openmrs.module.reporting.cohort.definition.evaluator.EncounterCohortDefinitionEvaluatorTest
25-Oct-2019 22:38:38 Tests run: 9, Failures: 0, Errors: 0, Skipped: 2, Time elapsed: 2.43 sec
25-Oct-2019 22:38:38 Running org.openmrs.module.reporting.data.person.evaluator.PreferredAddressDataEvaluatorTest
25-Oct-2019 22:38:38 Tests run: 1, Failures: 0, Errors: 0, Skipped: 0, Time elapsed: 0.305 sec
25-Oct-2019 22:38:38 Running org.openmrs.module.reporting.cohort.definition.evaluator.GenderCohortDefinitionEvaluatorTest
25-Oct-2019 22:38:40 Tests run: 5, Failures: 0, Errors: 0, Skipped: 0, Time elapsed: 1.389 sec
25-Oct-2019 22:38:40 Running org.openmrs.module.reporting.data.converter.BirthdateConverterTest
25-Oct-2019 22:38:40 Tests run: 1, Failures: 0, Errors: 0, Skipped: 0, Time elapsed: 0.184 sec
25-Oct-2019 22:38:40 Running org.openmrs.module.reporting.data.patient.evaluator.ProgramStatesForPatientDataEvaluatorTest
25-Oct-2019 22:38:43 Tests run: 9, Failures: 0, Errors: 0, Skipped: 0, Time elapsed: 2.789 sec
25-Oct-2019 22:38:43 Running org.openmrs.module.reporting.data.visit.library.BuiltInVisitDataLibraryTest
25-Oct-2019 22:38:43 Tests run: 1, Failures: 0, Errors: 0, Skipped: 0, Time elapsed: 0.239 sec
25-Oct-2019 22:38:43 Running org.openmrs.module.reporting.cohort.definition.evaluator.AgeCohortDefinitionEvaluatorTest
25-Oct-2019 22:38:44 Tests run: 5, Failures: 0, Errors: 0, Skipped: 0, Time elapsed: 1.342 sec
25-Oct-2019 22:38:44 Running org.openmrs.module.reporting.data.encounter.evaluator.EncounterLocationDataEvaluatorTest
25-Oct-2019 22:38:45 Tests run: 3, Failures: 0, Errors: 0, Skipped: 0, Time elapsed: 0.959 sec
25-Oct-2019 22:38:45 Running org.openmrs.module.reporting.data.obs.evaluator.PersonToObsEvaluatorTest
25-Oct-2019 22:38:46 Tests run: 3, Failures: 0, Errors: 0, Skipped: 0, Time elapsed: 0.846 sec
25-Oct-2019 22:38:46 Running org.openmrs.module.reporting.common.DateRangeTest
25-Oct-2019 22:38:46 Tests run: 9, Failures: 0, Errors: 0, Skipped: 0, Time elapsed: 0.012 sec
25-Oct-2019 22:38:46 Running org.openmrs.module.reporting.cohort.definition.evaluator.NumericObsCohortDefinitionEvaluatorTest
25-Oct-2019 22:38:49 Tests run: 11, Failures: 0, Errors: 0, Skipped: 0, Time elapsed: 3.464 sec
25-Oct-2019 22:38:49 Running org.openmrs.module.reporting.indicator.QueryCountIndicatorEvaluatorTest
25-Oct-2019 22:38:50 Tests run: 3, Failures: 0, Errors: 0, Skipped: 0, Time elapsed: 0.876 sec
25-Oct-2019 22:38:50 Running org.openmrs.module.reporting.data.encounter.evaluator.ObsForEncounterEvaluatorTest
25-Oct-2019 22:38:52 Tests run: 7, Failures: 0, Errors: 0, Skipped: 0, Time elapsed: 2.205 sec
25-Oct-2019 22:38:52 Running org.openmrs.module.reporting.common.DateUtilTest
25-Oct-2019 22:38:55 Tests run: 15, Failures: 0, Errors: 0, Skipped: 0, Time elapsed: 2.771 sec
25-Oct-2019 22:38:55 Running org.openmrs.module.reporting.data.patient.evaluator.DrugOrdersForPatientDataEvaluatorTest
25-Oct-2019 22:38:57 Tests run: 8, Failures: 0, Errors: 0, Skipped: 0, Time elapsed: 1.812 sec
25-Oct-2019 22:38:57 Running org.openmrs.module.reporting.query.encounter.evaluator.MappedParametersObsQueryEvaluatorTest
25-Oct-2019 22:38:57 Tests run: 1, Failures: 0, Errors: 0, Skipped: 0, Time elapsed: 0.265 sec
25-Oct-2019 22:38:57 Running org.openmrs.module.reporting.serializer.ReportingSerializerTest
25-Oct-2019 22:38:59 Tests run: 6, Failures: 0, Errors: 0, Skipped: 0, Time elapsed: 1.224 sec
25-Oct-2019 22:38:59 Running org.openmrs.module.reporting.dataset.definition.evaluator.CohortCrossTabDataSetEvaluatorTest
25-Oct-2019 22:38:59 Tests run: 1, Failures: 0, Errors: 0, Skipped: 0, Time elapsed: 0.378 sec
25-Oct-2019 22:38:59 Running org.openmrs.module.reporting.query.person.service.PersonQueryServiceImplTest
25-Oct-2019 22:39:00 Tests run: 2, Failures: 0, Errors: 0, Skipped: 0, Time elapsed: 0.705 sec
25-Oct-2019 22:39:00 Running org.openmrs.module.reporting.dataset.definition.evaluator.MySqlDataSetEvaluatorTest
25-Oct-2019 22:39:00 Tests run: 1, Failures: 0, Errors: 0, Skipped: 1, Time elapsed: 0.001 sec
25-Oct-2019 22:39:00 Running org.openmrs.module.reporting.report.renderer.TextTemplateRendererTest
25-Oct-2019 22:39:01 Tests run: 3, Failures: 0, Errors: 0, Skipped: 0, Time elapsed: 1.392 sec
25-Oct-2019 22:39:01 Running org.openmrs.module.reporting.validator.InverseCohortDefinitionValidatorTest
25-Oct-2019 22:39:01 Tests run: 2, Failures: 0, Errors: 0, Skipped: 0, Time elapsed: 0.488 sec
25-Oct-2019 22:39:01 Running org.openmrs.module.reporting.validator.PatientStateCohortDefinitionValidatorTest
25-Oct-2019 22:39:02 Tests run: 3, Failures: 0, Errors: 0, Skipped: 0, Time elapsed: 0.553 sec
25-Oct-2019 22:39:02 Running org.openmrs.module.reporting.report.service.db.PropertiesTypeTest
25-Oct-2019 22:39:02 Tests run: 1, Failures: 0, Errors: 0, Skipped: 0, Time elapsed: 0.001 sec
25-Oct-2019 22:39:02 Running org.openmrs.module.reporting.query.encounter.evaluator.ObsForEncounterQueryEvaluatorTest
25-Oct-2019 22:39:05 Tests run: 8, Failures: 0, Errors: 0, Skipped: 0, Time elapsed: 2.63 sec
25-Oct-2019 22:39:05 Running org.openmrs.module.reporting.data.encounter.service.EncounterDataServiceImplTest
25-Oct-2019 22:39:05 Tests run: 2, Failures: 0, Errors: 0, Skipped: 0, Time elapsed: 0.608 sec
25-Oct-2019 22:39:05 Running org.openmrs.module.reporting.cohort.definition.evaluator.MappedParametersCohortDefinitionEvaluatorTest
25-Oct-2019 22:39:06 Tests run: 1, Failures: 0, Errors: 0, Skipped: 0, Time elapsed: 0.357 sec
25-Oct-2019 22:39:06 Running org.openmrs.module.reporting.data.encounter.evaluator.ConvertedEncounterDataEvaluatorTest
25-Oct-2019 22:39:06 Tests run: 1, Failures: 0, Errors: 0, Skipped: 0, Time elapsed: 0.356 sec
25-Oct-2019 22:39:06 Running org.openmrs.module.reporting.data.patient.evaluator.PatientIdentifierDataEvaluatorTest
25-Oct-2019 22:39:07 Tests run: 4, Failures: 0, Errors: 0, Skipped: 0, Time elapsed: 1.288 sec
25-Oct-2019 22:39:07 Running org.openmrs.module.reporting.data.converter.ListConverterTest
25-Oct-2019 22:39:07 Tests run: 6, Failures: 0, Errors: 0, Skipped: 0, Time elapsed: 0.004 sec
25-Oct-2019 22:39:07 Running org.openmrs.module.reporting.data.converter.ObsFromObsGroupConverterTest
25-Oct-2019 22:39:08 Tests run: 2, Failures: 0, Errors: 0, Skipped: 0, Time elapsed: 0.412 sec
25-Oct-2019 22:39:08 Running org.openmrs.module.reporting.common.AgeTest
25-Oct-2019 22:39:08 Tests run: 5, Failures: 0, Errors: 0, Skipped: 0, Time elapsed: 0.005 sec
25-Oct-2019 22:39:08 Running org.openmrs.module.reporting.evaluation.CachingCohortDefinitionTest
25-Oct-2019 22:39:08 Tests run: 1, Failures: 0, Errors: 0, Skipped: 0, Time elapsed: 0.269 sec
25-Oct-2019 22:39:08 Running org.openmrs.module.reporting.common.TestUtil
25-Oct-2019 22:39:08 Tests run: 1, Failures: 0, Errors: 0, Skipped: 1, Time elapsed: 0.001 sec
25-Oct-2019 22:39:08 Running org.openmrs.module.reporting.query.encounter.evaluator.CompositionEncounterQueryEvaluatorTest
25-Oct-2019 22:39:09 Tests run: 4, Failures: 0, Errors: 0, Skipped: 0, Time elapsed: 1.19 sec
25-Oct-2019 22:39:09 Running org.openmrs.module.reporting.definition.library.implementerconfigured.ImplementerConfiguredVisitDataDefinitionLibraryTest
25-Oct-2019 22:39:10 Tests run: 2, Failures: 0, Errors: 0, Skipped: 0, Time elapsed: 0.369 sec
25-Oct-2019 22:39:10 Running org.openmrs.module.reporting.common.ObjectUtilTest
25-Oct-2019 22:39:14 Tests run: 23, Failures: 0, Errors: 0, Skipped: 0, Time elapsed: 4.738 sec
25-Oct-2019 22:39:14 Running org.openmrs.module.reporting.data.person.evaluator.AgeDataEvaluatorTest
25-Oct-2019 22:39:15 Tests run: 2, Failures: 0, Errors: 0, Skipped: 0, Time elapsed: 0.75 sec
25-Oct-2019 22:39:15 Running org.openmrs.module.reporting.evaluation.querybuilder.HqlQueryBuilderTest
25-Oct-2019 22:39:26 Tests run: 39, Failures: 0, Errors: 0, Skipped: 0, Time elapsed: 11.396 sec
25-Oct-2019 22:39:26 Running org.openmrs.module.reporting.data.visit.evaluator.ObsForVisitDataEvaluatorTest
25-Oct-2019 22:39:27 Tests run: 2, Failures: 0, Errors: 0, Skipped: 0, Time elapsed: 0.562 sec
25-Oct-2019 22:39:27 Running org.openmrs.module.reporting.query.encounter.evaluator.MostRecentEncounterForPatientQueryEvaluatorTest
25-Oct-2019 22:39:27 Tests run: 1, Failures: 0, Errors: 0, Skipped: 0, Time elapsed: 0.279 sec
25-Oct-2019 22:39:27 Running org.openmrs.module.reporting.cohort.definition.evaluator.OptionalParameterCohortDefinitionEvaluatorTest
25-Oct-2019 22:39:28 Tests run: 1, Failures: 0, Errors: 0, Skipped: 0, Time elapsed: 0.317 sec
25-Oct-2019 22:39:28 Running org.openmrs.module.reporting.report.util.SqlUtilsTest
25-Oct-2019 22:39:28 Tests run: 3, Failures: 0, Errors: 0, Skipped: 0, Time elapsed: 0.002 sec
25-Oct-2019 22:39:28 Running org.openmrs.module.reporting.validator.InProgramCohortDefinitionValidatorTest
25-Oct-2019 22:39:28 Tests run: 3, Failures: 0, Errors: 0, Skipped: 0, Time elapsed: 0.636 sec
25-Oct-2019 22:39:28 Running org.openmrs.module.reporting.data.obs.evaluator.PatientToObsDataEvaluatorTest
25-Oct-2019 22:39:29 Tests run: 3, Failures: 0, Errors: 0, Skipped: 0, Time elapsed: 0.826 sec
25-Oct-2019 22:39:29 Running org.openmrs.module.reporting.definition.library.BaseDefinitionLibraryTest
25-Oct-2019 22:39:30 Tests run: 4, Failures: 0, Errors: 0, Skipped: 0, Time elapsed: 0.792 sec
25-Oct-2019 22:39:30 Running org.openmrs.module.reporting.data.person.evaluator.PersonAttributeDataEvaluatorTest
25-Oct-2019 22:39:30 Tests run: 1, Failures: 0, Errors: 0, Skipped: 0, Time elapsed: 0.336 sec
25-Oct-2019 22:39:30 Running org.openmrs.module.reporting.data.person.evaluator.PreferredNameDataEvaluatorTest
25-Oct-2019 22:39:31 Tests run: 3, Failures: 0, Errors: 0, Skipped: 0, Time elapsed: 0.905 sec
25-Oct-2019 22:39:31 Running org.openmrs.module.reporting.definition.library.implementerconfigured.ImplementerConfiguredCohortDefinitionLibraryTest
25-Oct-2019 22:39:32 Tests run: 3, Failures: 0, Errors: 0, Skipped: 0, Time elapsed: 0.747 sec
25-Oct-2019 22:39:32 Running org.openmrs.module.reporting.evaluation.parameter.ParameterUtilTest
25-Oct-2019 22:39:32 Tests run: 2, Failures: 0, Errors: 0, Skipped: 0, Time elapsed: 0.393 sec
25-Oct-2019 22:39:32 Running org.openmrs.module.reporting.data.encounter.library.BuiltInEncounterDataLibraryTest
25-Oct-2019 22:39:34 Tests run: 6, Failures: 0, Errors: 0, Skipped: 0, Time elapsed: 1.298 sec
25-Oct-2019 22:39:34 Running org.openmrs.module.reporting.cohort.definition.evaluator.ScriptedCohortDefinitionEvaluatorTest
25-Oct-2019 22:39:34 Tests run: 1, Failures: 0, Errors: 0, Skipped: 0, Time elapsed: 0.297 sec
25-Oct-2019 22:39:34 Running org.openmrs.module.reporting.data.converter.PersonNameConverterTest
25-Oct-2019 22:39:34 Tests run: 1, Failures: 0, Errors: 0, Skipped: 0, Time elapsed: 0.198 sec
25-Oct-2019 22:39:34 Running org.openmrs.module.reporting.definition.library.AllDefinitionLibrariesComponentTest
25-Oct-2019 22:39:34 Tests run: 2, Failures: 0, Errors: 0, Skipped: 0, Time elapsed: 0.404 sec
25-Oct-2019 22:39:34 Running org.openmrs.module.reporting.data.person.evaluator.VitalStatusDataEvaluatorTest
25-Oct-2019 22:39:35 Tests run: 1, Failures: 0, Errors: 0, Skipped: 0, Time elapsed: 0.318 sec
25-Oct-2019 22:39:35 Running org.openmrs.module.reporting.dataset.definition.evaluator.PatientDataSetEvaluatorTest
25-Oct-2019 22:39:37 Tests run: 8, Failures: 0, Errors: 0, Skipped: 0, Time elapsed: 2.263 sec
25-Oct-2019 22:39:37 Running org.openmrs.module.reporting.cohort.definition.evaluator.TextObsCohortDefinitionEvaluatorTest
25-Oct-2019 22:39:38 Tests run: 2, Failures: 0, Errors: 0, Skipped: 0, Time elapsed: 0.658 sec
25-Oct-2019 22:39:38 Running org.openmrs.module.reporting.data.encounter.evaluator.AuditInfoEncounterDataEvaluatorTest
25-Oct-2019 22:39:38 Tests run: 1, Failures: 0, Errors: 0, Skipped: 0, Time elapsed: 0.224 sec
25-Oct-2019 22:39:38 Running org.openmrs.module.reporting.data.patient.evaluator.LogicDataEvaluatorTest
25-Oct-2019 22:39:38 Tests run: 1, Failures: 0, Errors: 0, Skipped: 1, Time elapsed: 0.001 sec
25-Oct-2019 22:39:38 Running org.openmrs.module.reporting.data.visit.evaluator.PersonToVisitDataEvaluatorTest
25-Oct-2019 22:39:39 Tests run: 3, Failures: 0, Errors: 0, Skipped: 0, Time elapsed: 1.041 sec
25-Oct-2019 22:39:39 Running org.openmrs.module.reporting.cohort.definition.evaluator.DateObsCohortDefinitionEvaluatorTest
25-Oct-2019 22:39:40 Tests run: 3, Failures: 0, Errors: 0, Skipped: 0, Time elapsed: 0.936 sec
25-Oct-2019 22:39:40 Running org.openmrs.module.reporting.cohort.definition.evaluator.VisitCohortDefinitionEvaluatorTest
25-Oct-2019 22:39:43 Tests run: 13, Failures: 0, Errors: 0, Skipped: 0, Time elapsed: 2.795 sec
25-Oct-2019 22:39:43 Running org.openmrs.module.reporting.data.encounter.evaluator.AgeAtEncounterDataEvaluatorTest
25-Oct-2019 22:39:43 Tests run: 1, Failures: 0, Errors: 0, Skipped: 0, Time elapsed: 0.362 sec
25-Oct-2019 22:39:43 Running org.openmrs.module.reporting.indicator.CohortIndicatorDataSetEvaluatorTest
25-Oct-2019 22:39:43 Tests run: 1, Failures: 0, Errors: 0, Skipped: 0, Time elapsed: 0.42 sec
25-Oct-2019 22:39:43 Running org.openmrs.module.reporting.data.person.evaluator.ObsActiveListPersonDataEvaluatorTest
25-Oct-2019 22:39:44 Tests run: 1, Failures: 0, Errors: 0, Skipped: 0, Time elapsed: 0.667 sec
25-Oct-2019 22:39:44 Running org.openmrs.module.reporting.common.ExcelUtilTest
25-Oct-2019 22:39:45 Tests run: 5, Failures: 0, Errors: 0, Skipped: 0, Time elapsed: 1.238 sec
25-Oct-2019 22:39:45 Running org.openmrs.module.reporting.data.obs.evaluator.GroupMemberObsDataEvaluatorTest
25-Oct-2019 22:39:46 Tests run: 5, Failures: 0, Errors: 0, Skipped: 2, Time elapsed: 1.021 sec
25-Oct-2019 22:39:46 Running org.openmrs.module.reporting.query.visit.evaluator.BasicVisitQueryEvaluatorTest
25-Oct-2019 22:39:47 Tests run: 3, Failures: 0, Errors: 0, Skipped: 0, Time elapsed: 0.999 sec
25-Oct-2019 22:39:47 Running org.openmrs.module.reporting.common.ExcelBuilderTest
25-Oct-2019 22:39:52 Tests run: 3, Failures: 0, Errors: 0, Skipped: 0, Time elapsed: 4.392 sec
25-Oct-2019 22:39:52 Running org.openmrs.module.reporting.query.obs.evaluator.AllObsQueryEvaluatorTest
25-Oct-2019 22:39:53 Tests run: 5, Failures: 0, Errors: 0, Skipped: 0, Time elapsed: 1.453 sec
25-Oct-2019 22:39:53 Running org.openmrs.module.reporting.cohort.definition.evaluator.AllPatientsCohortDefinitionEvaluatorTest
25-Oct-2019 22:39:54 Tests run: 1, Failures: 0, Errors: 0, Skipped: 0, Time elapsed: 0.306 sec
25-Oct-2019 22:39:54 Running org.openmrs.module.reporting.data.encounter.evaluator.SimultaneousEncountersDataEvaluatorTest
25-Oct-2019 22:39:54 Tests run: 2, Failures: 0, Errors: 0, Skipped: 0, Time elapsed: 0.421 sec
25-Oct-2019 22:39:54 Running org.openmrs.module.reporting.validator.ProgramEnrollmentCohortDefinitionValidatorTest
25-Oct-2019 22:39:54 Tests run: 3, Failures: 0, Errors: 0, Skipped: 0, Time elapsed: 0.521 sec
25-Oct-2019 22:39:54 Running org.openmrs.module.reporting.evaluation.EvaluationContextTest
25-Oct-2019 22:39:55 Tests run: 4, Failures: 0, Errors: 0, Skipped: 0, Time elapsed: 0.923 sec
25-Oct-2019 22:39:55 Running org.openmrs.module.reporting.data.patient.evaluator.PreferredIdentifierDataEvaluatorTest
25-Oct-2019 22:39:56 Tests run: 2, Failures: 0, Errors: 0, Skipped: 0, Time elapsed: 0.556 sec
25-Oct-2019 22:39:56 Running org.openmrs.module.reporting.data.encounter.evaluator.EncounterVisitDataEvaluatorTest
25-Oct-2019 22:39:56 Tests run: 1, Failures: 0, Errors: 0, Skipped: 0, Time elapsed: 0.299 sec
25-Oct-2019 22:39:56 Running org.openmrs.module.reporting.query.obs.service.ObsQueryServiceImplTest
25-Oct-2019 22:39:57 Tests run: 2, Failures: 0, Errors: 0, Skipped: 1, Time elapsed: 0.319 sec
25-Oct-2019 22:39:57 Running org.openmrs.module.reporting.data.patient.library.BuiltInPatientDataLibraryTest
25-Oct-2019 22:39:57 Tests run: 4, Failures: 0, Errors: 0, Skipped: 0, Time elapsed: 0.886 sec
25-Oct-2019 22:39:57 Running org.openmrs.module.reporting.indicator.util.IndicatorUtilTest
25-Oct-2019 22:39:57 Tests run: 1, Failures: 0, Errors: 0, Skipped: 0, Time elapsed: 0.002 sec
25-Oct-2019 22:39:57 Running org.openmrs.module.reporting.cohort.definition.evaluator.EvaluatableCohortDefinitionEvaluatorTest
25-Oct-2019 22:39:58 Tests run: 1, Failures: 0, Errors: 0, Skipped: 0, Time elapsed: 0.188 sec
25-Oct-2019 22:39:58 Running org.openmrs.module.reporting.data.patient.evaluator.ConvertedPatientDataEvaluatorTest
25-Oct-2019 22:39:58 Tests run: 2, Failures: 0, Errors: 0, Skipped: 0, Time elapsed: 0.596 sec
25-Oct-2019 22:39:58 Running org.openmrs.module.reporting.cohort.definition.evaluator.CompositionCohortDefinitionEvaluatorTest
25-Oct-2019 22:40:00 Tests run: 4, Failures: 0, Errors: 0, Skipped: 0, Time elapsed: 1.295 sec
25-Oct-2019 22:40:00 Running org.openmrs.module.reporting.data.converter.MapConverterTest
25-Oct-2019 22:40:00 Tests run: 5, Failures: 0, Errors: 0, Skipped: 0, Time elapsed: 0.017 sec
25-Oct-2019 22:40:00 Running org.openmrs.module.reporting.data.patient.evaluator.EncountersForPatientDataEvaluatorTest
25-Oct-2019 22:40:00 Tests run: 1, Failures: 0, Errors: 0, Skipped: 0, Time elapsed: 0.388 sec
25-Oct-2019 22:40:00 Running org.openmrs.module.reporting.indicator.SqlIndicatorTest
25-Oct-2019 22:40:01 ERROR - EvaluationProfiler.log(111) |2019-10-25 22:40:01,576| 1336        2019-10-25 22:40:01.576        >        ERROR        EVALUATING_DEFINITION                        SqlIndicator[sql=SELECT distinct(.222) as res, 33 as res2 from patient]: Failed to evaluate sql because:
25-Oct-2019 22:40:01 Unable to evaluate to a single value. Exactly one column must be defined.
25-Oct-2019 22:40:01 org.openmrs.module.reporting.evaluation.EvaluationException: Failed to evaluate sql because:
25-Oct-2019 22:40:01 Unable to evaluate to a single value. Exactly one column must be defined.
25-Oct-2019 22:40:01         at org.openmrs.module.reporting.indicator.evaluator.SqlIndicatorEvaluator.evaluateSql(SqlIndicatorEvaluator.java:57)
25-Oct-2019 22:40:01         at org.openmrs.module.reporting.indicator.evaluator.SqlIndicatorEvaluator.evaluate(SqlIndicatorEvaluator.java:41)
25-Oct-2019 22:40:01         at org.openmrs.module.reporting.indicator.evaluator.SqlIndicatorEvaluator.evaluate(SqlIndicatorEvaluator.java:28)
25-Oct-2019 22:40:01         at org.openmrs.module.reporting.definition.service.BaseDefinitionService.executeEvaluator(BaseDefinitionService.java:369)
25-Oct-2019 22:40:01         at org.openmrs.module.reporting.definition.service.BaseDefinitionService.evaluateBypassingExclusionOfTestPatients(BaseDefinitionService.java:264)
25-Oct-2019 22:40:01         at org.openmrs.module.reporting.definition.service.BaseDefinitionService.evaluate(BaseDefinitionService.java:229)
25-Oct-2019 22:40:01         at org.openmrs.module.reporting.indicator.service.IndicatorServiceImpl.evaluate(IndicatorServiceImpl.java:41)
25-Oct-2019 22:40:01         at sun.reflect.NativeMethodAccessorImpl.invoke0(Native Method)
25-Oct-2019 22:40:01         at sun.reflect.NativeMethodAccessorImpl.invoke(NativeMethodAccessorImpl.java:62)
25-Oct-2019 22:40:01         at sun.reflect.DelegatingMethodAccessorImpl.invoke(DelegatingMethodAccessorImpl.java:43)
25-Oct-2019 22:40:01         at java.lang.reflect.Method.invoke(Method.java:498)
25-Oct-2019 22:40:01         at org.springframework.aop.support.AopUtils.invokeJoinpointUsingReflection(AopUtils.java:309)
25-Oct-2019 22:40:01         at org.springframework.aop.framework.ReflectiveMethodInvocation.invokeJoinpoint(ReflectiveMethodInvocation.java:183)
25-Oct-2019 22:40:01         at org.springframework.aop.framework.ReflectiveMethodInvocation.proceed(ReflectiveMethodInvocation.java:150)
25-Oct-2019 22:40:01         at org.openmrs.aop.LoggingAdvice.invoke(LoggingAdvice.java:118)
25-Oct-2019 22:40:01         at org.springframework.aop.framework.ReflectiveMethodInvocation.proceed(ReflectiveMethodInvocation.java:172)
25-Oct-2019 22:40:01         at org.springframework.aop.framework.adapter.MethodBeforeAdviceInterceptor.invoke(MethodBeforeAdviceInterceptor.java:50)
25-Oct-2019 22:40:01         at org.springframework.aop.framework.ReflectiveMethodInvocation.proceed(ReflectiveMethodInvocation.java:172)
25-Oct-2019 22:40:01         at org.springframework.aop.framework.adapter.MethodBeforeAdviceInterceptor.invoke(MethodBeforeAdviceInterceptor.java:50)
25-Oct-2019 22:40:01         at org.springframework.aop.framework.ReflectiveMethodInvocation.proceed(ReflectiveMethodInvocation.java:172)
25-Oct-2019 22:40:01         at org.springframework.aop.framework.JdkDynamicAopProxy.invoke(JdkDynamicAopProxy.java:202)
25-Oct-2019 22:40:01         at com.sun.proxy.$Proxy38.evaluate(Unknown Source)
25-Oct-2019 22:40:01         at sun.reflect.NativeMethodAccessorImpl.invoke0(Native Method)
25-Oct-2019 22:40:01         at sun.reflect.NativeMethodAccessorImpl.invoke(NativeMethodAccessorImpl.java:62)
25-Oct-2019 22:40:01         at sun.reflect.DelegatingMethodAccessorImpl.invoke(DelegatingMethodAccessorImpl.java:43)
25-Oct-2019 22:40:01         at java.lang.reflect.Method.invoke(Method.java:498)
25-Oct-2019 22:40:01         at org.springframework.aop.support.AopUtils.invokeJoinpointUsingReflection(AopUtils.java:309)
25-Oct-2019 22:40:01         at org.springframework.aop.framework.JdkDynamicAopProxy.invoke(JdkDynamicAopProxy.java:196)
25-Oct-2019 22:40:01         at com.sun.proxy.$Proxy136.evaluate(Unknown Source)
25-Oct-2019 22:40:01         at org.openmrs.module.reporting.indicator.SqlIndicatorTest.assertIndicatorValue(SqlIndicatorTest.java:94)
25-Oct-2019 22:40:01         at org.openmrs.module.reporting.indicator.SqlIndicatorTest.assertIndicatorValue(SqlIndicatorTest.java:103)
25-Oct-2019 22:40:01         at org.openmrs.module.reporting.indicator.SqlIndicatorTest.assertIndicatorValue(SqlIndicatorTest.java:114)
25-Oct-2019 22:40:01         at org.openmrs.module.reporting.indicator.SqlIndicatorTest.assertIndicatorValue(SqlIndicatorTest.java:107)
25-Oct-2019 22:40:01         at org.openmrs.module.reporting.indicator.SqlIndicatorTest.sqlIndicator_shouldNotAllowQueriesThatReturnMoreThanOneColumn(SqlIndicatorTest.java:85)
25-Oct-2019 22:40:01         at sun.reflect.NativeMethodAccessorImpl.invoke0(Native Method)
25-Oct-2019 22:40:01         at sun.reflect.NativeMethodAccessorImpl.invoke(NativeMethodAccessorImpl.java:62)
25-Oct-2019 22:40:01         at sun.reflect.DelegatingMethodAccessorImpl.invoke(DelegatingMethodAccessorImpl.java:43)
25-Oct-2019 22:40:01         at java.lang.reflect.Method.invoke(Method.java:498)
25-Oct-2019 22:40:01         at org.junit.runners.model.FrameworkMethod$1.runReflectiveCall(FrameworkMethod.java:47)
25-Oct-2019 22:40:01         at org.junit.internal.runners.model.ReflectiveCallable.run(ReflectiveCallable.java:12)
25-Oct-2019 22:40:01         at org.junit.runners.model.FrameworkMethod.invokeExplosively(FrameworkMethod.java:44)
25-Oct-2019 22:40:01         at org.junit.internal.runners.statements.InvokeMethod.evaluate(InvokeMethod.java:17)
25-Oct-2019 22:40:01         at org.junit.internal.runners.statements.ExpectException.evaluate(ExpectException.java:19)
25-Oct-2019 22:40:01         at org.junit.internal.runners.statements.RunBefores.evaluate(RunBefores.java:26)
25-Oct-2019 22:40:01         at org.springframework.test.context.junit4.statements.RunBeforeTestMethodCallbacks.evaluate(RunBeforeTestMethodCallbacks.java:74)
25-Oct-2019 22:40:01         at org.junit.internal.runners.statements.RunAfters.evaluate(RunAfters.java:27)
25-Oct-2019 22:40:01         at org.springframework.test.context.junit4.statements.RunAfterTestMethodCallbacks.evaluate(RunAfterTestMethodCallbacks.java:82)
25-Oct-2019 22:40:01         at org.springframework.test.context.junit4.statements.SpringRepeat.evaluate(SpringRepeat.java:72)
25-Oct-2019 22:40:01         at org.springframework.test.context.junit4.SpringJUnit4ClassRunner.runChild(SpringJUnit4ClassRunner.java:240)
25-Oct-2019 22:40:01         at org.junit.runners.BlockJUnit4ClassRunner.runChild(BlockJUnit4ClassRunner.java:50)
25-Oct-2019 22:40:01         at org.junit.runners.ParentRunner$3.run(ParentRunner.java:238)
25-Oct-2019 22:40:01         at org.junit.runners.ParentRunner$1.schedule(ParentRunner.java:63)
25-Oct-2019 22:40:01         at org.junit.runners.ParentRunner.runChildren(ParentRunner.java:236)
25-Oct-2019 22:40:01         at org.junit.runners.ParentRunner.access$000(ParentRunner.java:53)
25-Oct-2019 22:40:01         at org.junit.runners.ParentRunner$2.evaluate(ParentRunner.java:229)
25-Oct-2019 22:40:01         at org.springframework.test.context.junit4.statements.RunBeforeTestClassCallbacks.evaluate(RunBeforeTestClassCallbacks.java:61)
25-Oct-2019 22:40:01         at org.junit.internal.runners.statements.RunAfters.evaluate(RunAfters.java:27)
25-Oct-2019 22:40:01         at org.springframework.test.context.junit4.statements.RunAfterTestClassCallbacks.evaluate(RunAfterTestClassCallbacks.java:70)
25-Oct-2019 22:40:01         at org.junit.runners.ParentRunner.run(ParentRunner.java:309)
25-Oct-2019 22:40:01         at org.springframework.test.context.junit4.SpringJUnit4ClassRunner.run(SpringJUnit4ClassRunner.java:180)
25-Oct-2019 22:40:01         at org.apache.maven.surefire.junit4.JUnit4TestSet.execute(JUnit4TestSet.java:59)
25-Oct-2019 22:40:01         at org.apache.maven.surefire.suite.AbstractDirectoryTestSuite.executeTestSet(AbstractDirectoryTestSuite.java:115)
25-Oct-2019 22:40:01         at org.apache.maven.surefire.suite.AbstractDirectoryTestSuite.execute(AbstractDirectoryTestSuite.java:102)
25-Oct-2019 22:40:01         at org.apache.maven.surefire.Surefire.run(Surefire.java:180)
25-Oct-2019 22:40:01         at sun.reflect.NativeMethodAccessorImpl.invoke0(Native Method)
25-Oct-2019 22:40:01         at sun.reflect.NativeMethodAccessorImpl.invoke(NativeMethodAccessorImpl.java:62)
25-Oct-2019 22:40:01         at sun.reflect.DelegatingMethodAccessorImpl.invoke(DelegatingMethodAccessorImpl.java:43)
25-Oct-2019 22:40:01         at java.lang.reflect.Method.invoke(Method.java:498)
25-Oct-2019 22:40:01         at org.apache.maven.surefire.booter.SurefireBooter.runSuitesInProcess(SurefireBooter.java:350)
25-Oct-2019 22:40:01         at org.apache.maven.surefire.booter.SurefireBooter.main(SurefireBooter.java:1021)
25-Oct-2019 22:40:01 Caused by: java.lang.IllegalArgumentException: Unable to evaluate to a single value. Exactly one column must be defined.
25-Oct-2019 22:40:01         at org.openmrs.module.reporting.evaluation.service.EvaluationServiceImpl.evaluateToObject(EvaluationServiceImpl.java:90)
25-Oct-2019 22:40:01         at sun.reflect.NativeMethodAccessorImpl.invoke0(Native Method)
25-Oct-2019 22:40:01         at sun.reflect.NativeMethodAccessorImpl.invoke(NativeMethodAccessorImpl.java:62)
25-Oct-2019 22:40:01         at sun.reflect.DelegatingMethodAccessorImpl.invoke(DelegatingMethodAccessorImpl.java:43)
25-Oct-2019 22:40:01         at java.lang.reflect.Method.invoke(Method.java:498)
25-Oct-2019 22:40:01         at org.springframework.aop.support.AopUtils.invokeJoinpointUsingReflection(AopUtils.java:309)
25-Oct-2019 22:40:01         at org.springframework.aop.framework.ReflectiveMethodInvocation.invokeJoinpoint(ReflectiveMethodInvocation.java:183)
25-Oct-2019 22:40:01         at org.springframework.aop.framework.ReflectiveMethodInvocation.proceed(ReflectiveMethodInvocation.java:150)
25-Oct-2019 22:40:01         at org.springframework.transaction.interceptor.TransactionInterceptor.invoke(TransactionInterceptor.java:110)
25-Oct-2019 22:40:01         at org.springframework.aop.framework.ReflectiveMethodInvocation.proceed(ReflectiveMethodInvocation.java:172)
25-Oct-2019 22:40:01         at org.openmrs.aop.LoggingAdvice.invoke(LoggingAdvice.java:118)
25-Oct-2019 22:40:01         at org.springframework.aop.framework.ReflectiveMethodInvocation.proceed(ReflectiveMethodInvocation.java:172)
25-Oct-2019 22:40:01         at org.springframework.aop.framework.adapter.MethodBeforeAdviceInterceptor.invoke(MethodBeforeAdviceInterceptor.java:50)
25-Oct-2019 22:40:01         at org.springframework.aop.framework.ReflectiveMethodInvocation.proceed(ReflectiveMethodInvocation.java:172)
25-Oct-2019 22:40:01         at org.springframework.aop.framework.adapter.MethodBeforeAdviceInterceptor.invoke(MethodBeforeAdviceInterceptor.java:50)
25-Oct-2019 22:40:01         at org.springframework.aop.framework.ReflectiveMethodInvocation.proceed(ReflectiveMethodInvocation.java:172)
25-Oct-2019 22:40:01         at org.springframework.aop.framework.JdkDynamicAopProxy.invoke(JdkDynamicAopProxy.java:202)
25-Oct-2019 22:40:01         at com.sun.proxy.$Proxy25.evaluateToObject(Unknown Source)
25-Oct-2019 22:40:01         at sun.reflect.NativeMethodAccessorImpl.invoke0(Native Method)
25-Oct-2019 22:40:01         at sun.reflect.NativeMethodAccessorImpl.invoke(NativeMethodAccessorImpl.java:62)
25-Oct-2019 22:40:01         at sun.reflect.DelegatingMethodAccessorImpl.invoke(DelegatingMethodAccessorImpl.java:43)
25-Oct-2019 22:40:01         at java.lang.reflect.Method.invoke(Method.java:498)
25-Oct-2019 22:40:01         at org.springframework.aop.support.AopUtils.invokeJoinpointUsingReflection(AopUtils.java:309)
25-Oct-2019 22:40:01         at org.springframework.aop.framework.ReflectiveMethodInvocation.invokeJoinpoint(ReflectiveMethodInvocation.java:183)
25-Oct-2019 22:40:01         at org.springframework.aop.framework.ReflectiveMethodInvocation.proceed(ReflectiveMethodInvocation.java:150)
25-Oct-2019 22:40:01         at org.springframework.transaction.interceptor.TransactionInterceptor.invoke(TransactionInterceptor.java:110)
25-Oct-2019 22:40:01         at org.springframework.aop.framework.ReflectiveMethodInvocation.proceed(ReflectiveMethodInvocation.java:172)
25-Oct-2019 22:40:01         at org.springframework.aop.framework.JdkDynamicAopProxy.invoke(JdkDynamicAopProxy.java:202)
25-Oct-2019 22:40:01         at com.sun.proxy.$Proxy110.evaluateToObject(Unknown Source)
25-Oct-2019 22:40:01         at org.openmrs.module.reporting.indicator.evaluator.SqlIndicatorEvaluator.evaluateSql(SqlIndicatorEvaluator.java:54)
25-Oct-2019 22:40:01         ... 69 more
25-Oct-2019 22:40:02 ERROR - EvaluationProfiler.log(111) |2019-10-25 22:40:02,439| 1344        2019-10-25 22:40:02.439        >        ERROR        EVALUATING_DEFINITION                        SqlIndicator[sql=SELECT person_id from person]: Failed to evaluate sql because:
25-Oct-2019 22:40:02 Unable to evaluate to a single value. Exactly one row must be returned by query.
25-Oct-2019 22:40:02 org.openmrs.module.reporting.evaluation.EvaluationException: Failed to evaluate sql because:
25-Oct-2019 22:40:02 Unable to evaluate to a single value. Exactly one row must be returned by query.
25-Oct-2019 22:40:02         at org.openmrs.module.reporting.indicator.evaluator.SqlIndicatorEvaluator.evaluateSql(SqlIndicatorEvaluator.java:57)
25-Oct-2019 22:40:02         at org.openmrs.module.reporting.indicator.evaluator.SqlIndicatorEvaluator.evaluate(SqlIndicatorEvaluator.java:41)
25-Oct-2019 22:40:02         at org.openmrs.module.reporting.indicator.evaluator.SqlIndicatorEvaluator.evaluate(SqlIndicatorEvaluator.java:28)
25-Oct-2019 22:40:02         at org.openmrs.module.reporting.definition.service.BaseDefinitionService.executeEvaluator(BaseDefinitionService.java:369)
25-Oct-2019 22:40:02         at org.openmrs.module.reporting.definition.service.BaseDefinitionService.evaluateBypassingExclusionOfTestPatients(BaseDefinitionService.java:264)
25-Oct-2019 22:40:02         at org.openmrs.module.reporting.definition.service.BaseDefinitionService.evaluate(BaseDefinitionService.java:229)
25-Oct-2019 22:40:02         at org.openmrs.module.reporting.indicator.service.IndicatorServiceImpl.evaluate(IndicatorServiceImpl.java:41)
25-Oct-2019 22:40:02         at sun.reflect.GeneratedMethodAccessor1038.invoke(Unknown Source)
25-Oct-2019 22:40:02         at sun.reflect.DelegatingMethodAccessorImpl.invoke(DelegatingMethodAccessorImpl.java:43)
25-Oct-2019 22:40:02         at java.lang.reflect.Method.invoke(Method.java:498)
25-Oct-2019 22:40:02         at org.springframework.aop.support.AopUtils.invokeJoinpointUsingReflection(AopUtils.java:309)
25-Oct-2019 22:40:02         at org.springframework.aop.framework.ReflectiveMethodInvocation.invokeJoinpoint(ReflectiveMethodInvocation.java:183)
25-Oct-2019 22:40:02         at org.springframework.aop.framework.ReflectiveMethodInvocation.proceed(ReflectiveMethodInvocation.java:150)
25-Oct-2019 22:40:02         at org.openmrs.aop.LoggingAdvice.invoke(LoggingAdvice.java:118)
25-Oct-2019 22:40:02         at org.springframework.aop.framework.ReflectiveMethodInvocation.proceed(ReflectiveMethodInvocation.java:172)
25-Oct-2019 22:40:02         at org.springframework.aop.framework.adapter.MethodBeforeAdviceInterceptor.invoke(MethodBeforeAdviceInterceptor.java:50)
25-Oct-2019 22:40:02         at org.springframework.aop.framework.ReflectiveMethodInvocation.proceed(ReflectiveMethodInvocation.java:172)
25-Oct-2019 22:40:02         at org.springframework.aop.framework.adapter.MethodBeforeAdviceInterceptor.invoke(MethodBeforeAdviceInterceptor.java:50)
25-Oct-2019 22:40:02         at org.springframework.aop.framework.ReflectiveMethodInvocation.proceed(ReflectiveMethodInvocation.java:172)
25-Oct-2019 22:40:02         at org.springframework.aop.framework.JdkDynamicAopProxy.invoke(JdkDynamicAopProxy.java:202)
25-Oct-2019 22:40:02         at com.sun.proxy.$Proxy38.evaluate(Unknown Source)
25-Oct-2019 22:40:02         at sun.reflect.GeneratedMethodAccessor1038.invoke(Unknown Source)
25-Oct-2019 22:40:02         at sun.reflect.DelegatingMethodAccessorImpl.invoke(DelegatingMethodAccessorImpl.java:43)
25-Oct-2019 22:40:02         at java.lang.reflect.Method.invoke(Method.java:498)
25-Oct-2019 22:40:02         at org.springframework.aop.support.AopUtils.invokeJoinpointUsingReflection(AopUtils.java:309)
25-Oct-2019 22:40:02         at org.springframework.aop.framework.JdkDynamicAopProxy.invoke(JdkDynamicAopProxy.java:196)
25-Oct-2019 22:40:02         at com.sun.proxy.$Proxy136.evaluate(Unknown Source)
25-Oct-2019 22:40:02         at org.openmrs.module.reporting.indicator.SqlIndicatorTest.assertIndicatorValue(SqlIndicatorTest.java:94)
25-Oct-2019 22:40:02         at org.openmrs.module.reporting.indicator.SqlIndicatorTest.assertIndicatorValue(SqlIndicatorTest.java:103)
25-Oct-2019 22:40:02         at org.openmrs.module.reporting.indicator.SqlIndicatorTest.assertIndicatorValue(SqlIndicatorTest.java:114)
25-Oct-2019 22:40:02         at org.openmrs.module.reporting.indicator.SqlIndicatorTest.assertIndicatorValue(SqlIndicatorTest.java:107)
25-Oct-2019 22:40:02         at org.openmrs.module.reporting.indicator.SqlIndicatorTest.sqlIndicator_shouldNotAllowQueriesThatReturnMoreThanOneRow(SqlIndicatorTest.java:90)
25-Oct-2019 22:40:02         at sun.reflect.NativeMethodAccessorImpl.invoke0(Native Method)
25-Oct-2019 22:40:02         at sun.reflect.NativeMethodAccessorImpl.invoke(NativeMethodAccessorImpl.java:62)
25-Oct-2019 22:40:02         at sun.reflect.DelegatingMethodAccessorImpl.invoke(DelegatingMethodAccessorImpl.java:43)
25-Oct-2019 22:40:02         at java.lang.reflect.Method.invoke(Method.java:498)
25-Oct-2019 22:40:02         at org.junit.runners.model.FrameworkMethod$1.runReflectiveCall(FrameworkMethod.java:47)
25-Oct-2019 22:40:02         at org.junit.internal.runners.model.ReflectiveCallable.run(ReflectiveCallable.java:12)
25-Oct-2019 22:40:02         at org.junit.runners.model.FrameworkMethod.invokeExplosively(FrameworkMethod.java:44)
25-Oct-2019 22:40:02         at org.junit.internal.runners.statements.InvokeMethod.evaluate(InvokeMethod.java:17)
25-Oct-2019 22:40:02         at org.junit.internal.runners.statements.ExpectException.evaluate(ExpectException.java:19)
25-Oct-2019 22:40:02         at org.junit.internal.runners.statements.RunBefores.evaluate(RunBefores.java:26)
25-Oct-2019 22:40:02         at org.springframework.test.context.junit4.statements.RunBeforeTestMethodCallbacks.evaluate(RunBeforeTestMethodCallbacks.java:74)
25-Oct-2019 22:40:02         at org.junit.internal.runners.statements.RunAfters.evaluate(RunAfters.java:27)
25-Oct-2019 22:40:02         at org.springframework.test.context.junit4.statements.RunAfterTestMethodCallbacks.evaluate(RunAfterTestMethodCallbacks.java:82)
25-Oct-2019 22:40:02         at org.springframework.test.context.junit4.statements.SpringRepeat.evaluate(SpringRepeat.java:72)
25-Oct-2019 22:40:02         at org.springframework.test.context.junit4.SpringJUnit4ClassRunner.runChild(SpringJUnit4ClassRunner.java:240)
25-Oct-2019 22:40:02         at org.junit.runners.BlockJUnit4ClassRunner.runChild(BlockJUnit4ClassRunner.java:50)
25-Oct-2019 22:40:02         at org.junit.runners.ParentRunner$3.run(ParentRunner.java:238)
25-Oct-2019 22:40:02         at org.junit.runners.ParentRunner$1.schedule(ParentRunner.java:63)
25-Oct-2019 22:40:02         at org.junit.runners.ParentRunner.runChildren(ParentRunner.java:236)
25-Oct-2019 22:40:02         at org.junit.runners.ParentRunner.access$000(ParentRunner.java:53)
25-Oct-2019 22:40:02         at org.junit.runners.ParentRunner$2.evaluate(ParentRunner.java:229)
25-Oct-2019 22:40:02         at org.springframework.test.context.junit4.statements.RunBeforeTestClassCallbacks.evaluate(RunBeforeTestClassCallbacks.java:61)
25-Oct-2019 22:40:02         at org.junit.internal.runners.statements.RunAfters.evaluate(RunAfters.java:27)
25-Oct-2019 22:40:02         at org.springframework.test.context.junit4.statements.RunAfterTestClassCallbacks.evaluate(RunAfterTestClassCallbacks.java:70)
25-Oct-2019 22:40:02         at org.junit.runners.ParentRunner.run(ParentRunner.java:309)
25-Oct-2019 22:40:02         at org.springframework.test.context.junit4.SpringJUnit4ClassRunner.run(SpringJUnit4ClassRunner.java:180)
25-Oct-2019 22:40:02         at org.apache.maven.surefire.junit4.JUnit4TestSet.execute(JUnit4TestSet.java:59)
25-Oct-2019 22:40:02         at org.apache.maven.surefire.suite.AbstractDirectoryTestSuite.executeTestSet(AbstractDirectoryTestSuite.java:115)
25-Oct-2019 22:40:02         at org.apache.maven.surefire.suite.AbstractDirectoryTestSuite.execute(AbstractDirectoryTestSuite.java:102)
25-Oct-2019 22:40:02         at org.apache.maven.surefire.Surefire.run(Surefire.java:180)
25-Oct-2019 22:40:02         at sun.reflect.NativeMethodAccessorImpl.invoke0(Native Method)
25-Oct-2019 22:40:02         at sun.reflect.NativeMethodAccessorImpl.invoke(NativeMethodAccessorImpl.java:62)
25-Oct-2019 22:40:02         at sun.reflect.DelegatingMethodAccessorImpl.invoke(DelegatingMethodAccessorImpl.java:43)
25-Oct-2019 22:40:02         at java.lang.reflect.Method.invoke(Method.java:498)
25-Oct-2019 22:40:02         at org.apache.maven.surefire.booter.SurefireBooter.runSuitesInProcess(SurefireBooter.java:350)
25-Oct-2019 22:40:02         at org.apache.maven.surefire.booter.SurefireBooter.main(SurefireBooter.java:1021)
25-Oct-2019 22:40:02 Caused by: java.lang.IllegalArgumentException: Unable to evaluate to a single value. Exactly one row must be returned by query.
25-Oct-2019 22:40:02         at org.openmrs.module.reporting.evaluation.service.EvaluationServiceImpl.evaluateToObject(EvaluationServiceImpl.java:86)
25-Oct-2019 22:40:02         at sun.reflect.GeneratedMethodAccessor1041.invoke(Unknown Source)
25-Oct-2019 22:40:02         at sun.reflect.DelegatingMethodAccessorImpl.invoke(DelegatingMethodAccessorImpl.java:43)
25-Oct-2019 22:40:02         at java.lang.reflect.Method.invoke(Method.java:498)
25-Oct-2019 22:40:02         at org.springframework.aop.support.AopUtils.invokeJoinpointUsingReflection(AopUtils.java:309)
25-Oct-2019 22:40:02         at org.springframework.aop.framework.ReflectiveMethodInvocation.invokeJoinpoint(ReflectiveMethodInvocation.java:183)
25-Oct-2019 22:40:02         at org.springframework.aop.framework.ReflectiveMethodInvocation.proceed(ReflectiveMethodInvocation.java:150)
25-Oct-2019 22:40:02         at org.springframework.transaction.interceptor.TransactionInterceptor.invoke(TransactionInterceptor.java:110)
25-Oct-2019 22:40:02         at org.springframework.aop.framework.ReflectiveMethodInvocation.proceed(ReflectiveMethodInvocation.java:172)
25-Oct-2019 22:40:02         at org.openmrs.aop.LoggingAdvice.invoke(LoggingAdvice.java:118)
25-Oct-2019 22:40:02         at org.springframework.aop.framework.ReflectiveMethodInvocation.proceed(ReflectiveMethodInvocation.java:172)
25-Oct-2019 22:40:02         at org.springframework.aop.framework.adapter.MethodBeforeAdviceInterceptor.invoke(MethodBeforeAdviceInterceptor.java:50)
25-Oct-2019 22:40:02         at org.springframework.aop.framework.ReflectiveMethodInvocation.proceed(ReflectiveMethodInvocation.java:172)
25-Oct-2019 22:40:02         at org.springframework.aop.framework.adapter.MethodBeforeAdviceInterceptor.invoke(MethodBeforeAdviceInterceptor.java:50)
25-Oct-2019 22:40:02         at org.springframework.aop.framework.ReflectiveMethodInvocation.proceed(ReflectiveMethodInvocation.java:172)
25-Oct-2019 22:40:02         at org.springframework.aop.framework.JdkDynamicAopProxy.invoke(JdkDynamicAopProxy.java:202)
25-Oct-2019 22:40:02         at com.sun.proxy.$Proxy25.evaluateToObject(Unknown Source)
25-Oct-2019 22:40:02         at sun.reflect.GeneratedMethodAccessor1041.invoke(Unknown Source)
25-Oct-2019 22:40:02         at sun.reflect.DelegatingMethodAccessorImpl.invoke(DelegatingMethodAccessorImpl.java:43)
25-Oct-2019 22:40:02         at java.lang.reflect.Method.invoke(Method.java:498)
25-Oct-2019 22:40:02         at org.springframework.aop.support.AopUtils.invokeJoinpointUsingReflection(AopUtils.java:309)
25-Oct-2019 22:40:02         at org.springframework.aop.framework.ReflectiveMethodInvocation.invokeJoinpoint(ReflectiveMethodInvocation.java:183)
25-Oct-2019 22:40:02         at org.springframework.aop.framework.ReflectiveMethodInvocation.proceed(ReflectiveMethodInvocation.java:150)
25-Oct-2019 22:40:02         at org.springframework.transaction.interceptor.TransactionInterceptor.invoke(TransactionInterceptor.java:110)
25-Oct-2019 22:40:02         at org.springframework.aop.framework.ReflectiveMethodInvocation.proceed(ReflectiveMethodInvocation.java:172)
25-Oct-2019 22:40:02         at org.springframework.aop.framework.JdkDynamicAopProxy.invoke(JdkDynamicAopProxy.java:202)
25-Oct-2019 22:40:02         at com.sun.proxy.$Proxy110.evaluateToObject(Unknown Source)
25-Oct-2019 22:40:02         at org.openmrs.module.reporting.indicator.evaluator.SqlIndicatorEvaluator.evaluateSql(SqlIndicatorEvaluator.java:54)
25-Oct-2019 22:40:02         ... 67 more
25-Oct-2019 22:40:02 Tests run: 8, Failures: 0, Errors: 0, Skipped: 0, Time elapsed: 2.368 sec
25-Oct-2019 22:40:02 Running org.openmrs.module.reporting.report.renderer.ExcelTemplateRendererTest
25-Oct-2019 22:40:03 Tests run: 2, Failures: 0, Errors: 0, Skipped: 0, Time elapsed: 0.539 sec
25-Oct-2019 22:40:03 Running org.openmrs.module.reporting.cohort.CohortsTest
25-Oct-2019 22:40:03 Tests run: 3, Failures: 0, Errors: 0, Skipped: 0, Time elapsed: 0.569 sec
25-Oct-2019 22:40:03 Running org.openmrs.module.reporting.data.converter.StringConverterTest
25-Oct-2019 22:40:03 Tests run: 1, Failures: 0, Errors: 0, Skipped: 0, Time elapsed: 0.002 sec
25-Oct-2019 22:40:03 Running org.openmrs.module.reporting.dataset.definition.evaluator.RepeatPerTimePeriodDataSetEvaluatorTest
25-Oct-2019 22:40:03 Tests run: 4, Failures: 0, Errors: 0, Skipped: 0, Time elapsed: 0.069 sec
25-Oct-2019 22:40:03 Running org.openmrs.module.reporting.data.JoinDataDefinitionTest
25-Oct-2019 22:40:03 Tests run: 2, Failures: 0, Errors: 0, Skipped: 0, Time elapsed: 0.001 sec
25-Oct-2019 22:40:03 Running org.openmrs.module.reporting.query.obs.evaluator.BasicObsQueryEvaluatorTest
25-Oct-2019 22:40:04 Tests run: 1, Failures: 0, Errors: 0, Skipped: 0, Time elapsed: 0.341 sec
25-Oct-2019 22:40:04 Running org.openmrs.module.reporting.query.person.evaluator.PatientPersonQueryEvaluatorTest
25-Oct-2019 22:40:04 Tests run: 1, Failures: 0, Errors: 0, Skipped: 0, Time elapsed: 0.334 sec
25-Oct-2019 22:40:04 Running org.openmrs.module.reporting.data.patient.evaluator.ScriptedCompositionPatientDataEvaluatorTest
25-Oct-2019 22:40:05 Tests run: 2, Failures: 0, Errors: 0, Skipped: 0, Time elapsed: 0.827 sec
25-Oct-2019 22:40:05 Running org.openmrs.module.reporting.definition.library.implementerconfigured.ImplementerConfiguredEncounterDataDefinitionLibraryTest
25-Oct-2019 22:40:05 Tests run: 2, Failures: 0, Errors: 0, Skipped: 0, Time elapsed: 0.355 sec
25-Oct-2019 22:40:05 Running org.openmrs.module.reporting.data.encounter.evaluator.PersonToEncounterDataEvaluatorTest
25-Oct-2019 22:40:06 Tests run: 3, Failures: 0, Errors: 0, Skipped: 0, Time elapsed: 0.855 sec
25-Oct-2019 22:40:06 Running org.openmrs.module.reporting.data.visit.evaluator.PatientToVisitDataEvaluatorTest
25-Oct-2019 22:40:07 {1=102, 4=12345K}
25-Oct-2019 22:40:07 Tests run: 3, Failures: 0, Errors: 0, Skipped: 0, Time elapsed: 1.026 sec
25-Oct-2019 22:40:07 Running org.openmrs.module.reporting.validator.CompositionCohortDefinitionValidatorTest
25-Oct-2019 22:40:08 Tests run: 5, Failures: 0, Errors: 0, Skipped: 0, Time elapsed: 1.012 sec
25-Oct-2019 22:40:08 Running org.openmrs.module.reporting.cohort.definition.evaluator.InProgramCohortDefinitionEvaluatorTest
25-Oct-2019 22:40:10 Tests run: 5, Failures: 0, Errors: 0, Skipped: 0, Time elapsed: 1.485 sec
25-Oct-2019 22:40:10 Running org.openmrs.module.reporting.calculation.PatientDataCalculationBehaviorTest
25-Oct-2019 22:40:11 Tests run: 3, Failures: 0, Errors: 0, Skipped: 0, Time elapsed: 0.921 sec
25-Oct-2019 22:40:11 Running org.openmrs.module.reporting.dataset.definition.evaluator.CohortIndicatorDataSetEvaluatorTest
25-Oct-2019 22:40:11 Tests run: 1, Failures: 0, Errors: 0, Skipped: 0, Time elapsed: 0.342 sec
25-Oct-2019 22:40:11 Running org.openmrs.module.reporting.query.encounter.evaluator.AuditEncounterQueryEvaluatorTest
25-Oct-2019 22:40:13 Tests run: 5, Failures: 0, Errors: 0, Skipped: 0, Time elapsed: 1.627 sec
25-Oct-2019 22:40:13 Running org.openmrs.module.reporting.definition.service.DefinitionServiceTest
25-Oct-2019 22:40:13 Tests run: 1, Failures: 0, Errors: 0, Skipped: 0, Time elapsed: 0.21 sec
25-Oct-2019 22:40:13 Running org.openmrs.module.reporting.indicator.aggregation.AggregationTest
25-Oct-2019 22:40:13 Tests run: 12, Failures: 0, Errors: 0, Skipped: 0, Time elapsed: 0.004 sec
25-Oct-2019 22:40:13 Running org.openmrs.module.reporting.data.person.evaluator.ConvertedPersonDataEvaluatorTest
25-Oct-2019 22:40:13 Tests run: 1, Failures: 0, Errors: 0, Skipped: 0, Time elapsed: 0.286 sec
25-Oct-2019 22:40:13 Running org.openmrs.module.reporting.query.encounter.evaluator.SqlEncounterQueryEvaluatorTest
25-Oct-2019 22:40:14 Tests run: 3, Failures: 0, Errors: 0, Skipped: 0, Time elapsed: 1.047 sec
25-Oct-2019 22:40:14 Running org.openmrs.module.reporting.report.renderer.CsvReportRendererTest
25-Oct-2019 22:40:15 Tests run: 1, Failures: 0, Errors: 0, Skipped: 0, Time elapsed: 0.383 sec
25-Oct-2019 22:40:15 Running org.openmrs.module.reporting.dataset.definition.evaluator.LogicDataSetEvaluatorTest
25-Oct-2019 22:40:15 Tests run: 1, Failures: 0, Errors: 0, Skipped: 1, Time elapsed: 0.001 sec
25-Oct-2019 22:40:15 Running org.openmrs.module.reporting.dataset.definition.evaluator.VisitDataSetEvaluatorTest
25-Oct-2019 22:40:15 VISIT ID        EMR ID        BIRTHDATE          
25-Oct-2019 22:40:15 --------        ------        -----------        
25-Oct-2019 22:40:15 1               2             08/Apr/1975        
25-Oct-2019 22:40:15 2               2             08/Apr/1975        
25-Oct-2019 22:40:15 3               2             08/Apr/1975        
25-Oct-2019 22:40:15 4               6             27/May/2007        
25-Oct-2019 22:40:15 5               6             27/May/2007        
25-Oct-2019 22:40:15 Tests run: 1, Failures: 0, Errors: 0, Skipped: 0, Time elapsed: 0.437 sec
25-Oct-2019 22:40:15 Running org.openmrs.module.reporting.data.person.evaluator.PersonIdDataEvaluatorTest
25-Oct-2019 22:40:15 Tests run: 1, Failures: 0, Errors: 0, Skipped: 0, Time elapsed: 0.271 sec
25-Oct-2019 22:40:15 Running org.openmrs.module.reporting.cohort.definition.evaluator.BirthAndDeathCohortDefinitionEvaluatorTest
25-Oct-2019 22:40:18 Tests run: 8, Failures: 0, Errors: 0, Skipped: 0, Time elapsed: 2.581 sec
25-Oct-2019 22:40:18 Running org.openmrs.module.reporting.data.encounter.evaluator.SqlEncounterDataEvaluatorTest
25-Oct-2019 22:40:18 Tests run: 1, Failures: 0, Errors: 0, Skipped: 0, Time elapsed: 0.39 sec
25-Oct-2019 22:40:18 Running org.openmrs.module.reporting.data.converter.PersonAddressConverterTest
25-Oct-2019 22:40:18 Tests run: 1, Failures: 0, Errors: 0, Skipped: 0, Time elapsed: 0.186 sec
25-Oct-2019 22:40:18 Running org.openmrs.module.reporting.data.converter.AttributeValueConverterTest
25-Oct-2019 22:40:19 Tests run: 2, Failures: 0, Errors: 0, Skipped: 0, Time elapsed: 0.578 sec
25-Oct-2019 22:40:19 Running org.openmrs.module.reporting.common.DelimitedKeyComparatorTest
25-Oct-2019 22:40:19 Tests run: 1, Failures: 0, Errors: 0, Skipped: 0, Time elapsed: 0.002 sec
25-Oct-2019 22:40:19 Running org.openmrs.module.reporting.data.obs.evaluator.ConvertedObsDataEvaluatorTest
25-Oct-2019 22:40:19 Tests run: 1, Failures: 0, Errors: 0, Skipped: 0, Time elapsed: 0.313 sec
25-Oct-2019 22:40:19 Running org.openmrs.module.reporting.query.person.evaluator.SqlPersonQueryEvaluatorTest
25-Oct-2019 22:40:20 Tests run: 2, Failures: 0, Errors: 0, Skipped: 0, Time elapsed: 0.545 sec
25-Oct-2019 22:40:20 Running org.openmrs.module.reporting.query.person.evaluator.AllPersonQueryEvaluatorTest
25-Oct-2019 22:40:21 Tests run: 6, Failures: 0, Errors: 0, Skipped: 0, Time elapsed: 1.565 sec
25-Oct-2019 22:40:21 Running org.openmrs.module.reporting.dataset.definition.evaluator.SqlFileDataSetEvaluatorTest
25-Oct-2019 22:40:22 Tests run: 2, Failures: 0, Errors: 0, Skipped: 0, Time elapsed: 0.396 sec
25-Oct-2019 22:40:22 Running org.openmrs.module.reporting.data.person.evaluator.AgeAtDateOfOtherDataEvaluatorTest
25-Oct-2019 22:40:22 Tests run: 1, Failures: 0, Errors: 0, Skipped: 0, Time elapsed: 0.315 sec
25-Oct-2019 22:40:22 Running org.openmrs.module.reporting.indicator.PeriodIndicatorReportTest
25-Oct-2019 22:40:23 Tests run: 2, Failures: 0, Errors: 0, Skipped: 0, Time elapsed: 0.557 sec
25-Oct-2019 22:40:23 Running org.openmrs.module.reporting.report.renderer.DelimitedTextReportRendererTest
25-Oct-2019 22:40:25 Tests run: 11, Failures: 0, Errors: 0, Skipped: 0, Time elapsed: 2.279 sec
25-Oct-2019 22:40:25 Running org.openmrs.module.reporting.data.patient.evaluator.PatientObjectDataEvaluatorTest
25-Oct-2019 22:40:25 Tests run: 1, Failures: 0, Errors: 0, Skipped: 0, Time elapsed: 0.283 sec
25-Oct-2019 22:40:25 Running org.openmrs.module.reporting.data.patient.evaluator.TestPatientCalculation
25-Oct-2019 22:40:25 Tests run: 1, Failures: 0, Errors: 0, Skipped: 1, Time elapsed: 0 sec
25-Oct-2019 22:40:25 Running org.openmrs.module.reporting.validator.SqlCohortDefinitionValidatorTest
25-Oct-2019 22:40:26 Tests run: 3, Failures: 0, Errors: 0, Skipped: 0, Time elapsed: 0.55 sec
25-Oct-2019 22:40:26 Running org.openmrs.module.reporting.cohort.definition.evaluator.PatientStateCohortDefinitionEvaluatorTest
25-Oct-2019 22:40:28 Tests run: 7, Failures: 0, Errors: 0, Skipped: 0, Time elapsed: 2.108 sec
25-Oct-2019 22:40:28 Running org.openmrs.module.reporting.data.converter.NullValueConverterTest
25-Oct-2019 22:40:28 Tests run: 1, Failures: 0, Errors: 0, Skipped: 0, Time elapsed: 0.002 sec
25-Oct-2019 22:40:28 Running org.openmrs.module.reporting.query.encounter.evaluator.ConditionalParameterEncounterQueryEvaluatorTest
25-Oct-2019 22:40:28 Tests run: 1, Failures: 0, Errors: 0, Skipped: 0, Time elapsed: 0.289 sec
25-Oct-2019 22:40:28 Running org.openmrs.module.reporting.report.service.TestReportProcessor
25-Oct-2019 22:40:28 Tests run: 1, Failures: 0, Errors: 0, Skipped: 1, Time elapsed: 0.001 sec
25-Oct-2019 22:40:28 Running org.openmrs.module.reporting.common.FractionTest
25-Oct-2019 22:40:28 Tests run: 7, Failures: 0, Errors: 0, Skipped: 0, Time elapsed: 0.003 sec
25-Oct-2019 22:40:28 Running org.openmrs.module.reporting.report.renderer.ReportDesignRendererTest
25-Oct-2019 22:40:29 Tests run: 2, Failures: 0, Errors: 0, Skipped: 0, Time elapsed: 0.366 sec
25-Oct-2019 22:40:29 Running org.openmrs.module.reporting.data.patient.evaluator.ProgramEnrollmentsForPatientDataEvaluatorTest
25-Oct-2019 22:40:31 Tests run: 8, Failures: 0, Errors: 0, Skipped: 0, Time elapsed: 2.57 sec
25-Oct-2019 22:40:31 Running org.openmrs.module.reporting.data.visit.evaluator.OrderForVisitDataEvaluatorTest
25-Oct-2019 22:40:32 Tests run: 2, Failures: 0, Errors: 0, Skipped: 0, Time elapsed: 0.756 sec
25-Oct-2019 22:40:32 Running org.openmrs.module.reporting.report.util.SqlScriptParserTest
25-Oct-2019 22:40:32 Tests run: 4, Failures: 0, Errors: 0, Skipped: 0, Time elapsed: 0.004 sec
25-Oct-2019 22:40:32 Running org.openmrs.module.reporting.definition.library.implementerconfigured.ImplementerConfiguredDataSetDefinitionLibraryTest
25-Oct-2019 22:40:33 Tests run: 3, Failures: 0, Errors: 0, Skipped: 0, Time elapsed: 0.943 sec
25-Oct-2019 22:40:33 Running org.openmrs.module.reporting.cohort.definition.evaluator.PresenceOrAbsenceCohortDefinitionEvaluatorTest
25-Oct-2019 22:40:34 Tests run: 3, Failures: 0, Errors: 0, Skipped: 0, Time elapsed: 0.931 sec
25-Oct-2019 22:40:34 Running org.openmrs.module.reporting.report.definition.service.ReportDefinitionServiceImplTest
25-Oct-2019 22:40:34 Tests run: 2, Failures: 0, Errors: 0, Skipped: 0, Time elapsed: 0.615 sec
25-Oct-2019 22:40:34 Running org.openmrs.module.reporting.data.converter.ObsValueTextAsCodedConverterTest
25-Oct-2019 22:40:35 Tests run: 3, Failures: 0, Errors: 0, Skipped: 0, Time elapsed: 0.588 sec
25-Oct-2019 22:40:35 Running org.openmrs.module.reporting.cohort.definition.service.BaseCohortDefinitionServiceTest
25-Oct-2019 22:40:35 Tests run: 1, Failures: 0, Errors: 0, Skipped: 0, Time elapsed: 0.267 sec
25-Oct-2019 22:40:35 Running org.openmrs.module.reporting.cohort.definition.evaluator.InStateCohortDefinitionEvaluatorTest
25-Oct-2019 22:40:36 Cohort: Cohort id=null size=2
25-Oct-2019 22:40:38 Tests run: 7, Failures: 0, Errors: 0, Skipped: 0, Time elapsed: 2.496 sec
25-Oct-2019 22:40:38 Running org.openmrs.module.reporting.data.patient.evaluator.DefinitionLibraryPatientDataEvaluatorTest
25-Oct-2019 22:40:39 Tests run: 3, Failures: 0, Errors: 0, Skipped: 0, Time elapsed: 0.834 sec
25-Oct-2019 22:40:39 Running org.openmrs.module.reporting.cohort.definition.evaluator.DefinitionLibraryCohortDefinitionEvaluatorTest
25-Oct-2019 22:40:39 Tests run: 3, Failures: 0, Errors: 0, Skipped: 0, Time elapsed: 0.852 sec
25-Oct-2019 22:40:39 Running org.openmrs.module.reporting.dataset.definition.evaluator.CohortsWithVaryingParametersDataSetEvaluatorTest
25-Oct-2019 22:40:40 Tests run: 1, Failures: 0, Errors: 0, Skipped: 0, Time elapsed: 0.311 sec
25-Oct-2019 22:40:40 Running org.openmrs.module.reporting.dataset.definition.evaluator.ObsDataSetEvaluatorTest
25-Oct-2019 22:40:40 Tests run: 1, Failures: 0, Errors: 0, Skipped: 0, Time elapsed: 0.302 sec
25-Oct-2019 22:40:40 Running org.openmrs.module.reporting.data.patient.evaluator.SqlPatientDataEvaluatorTest
25-Oct-2019 22:40:40 Tests run: 1, Failures: 0, Errors: 0, Skipped: 0, Time elapsed: 0.286 sec
25-Oct-2019 22:40:40 Running org.openmrs.module.reporting.data.converter.PrivilegedDataConverterTest
25-Oct-2019 22:40:41 SLF4J: Class path contains multiple SLF4J bindings.
25-Oct-2019 22:40:41 SLF4J: Found binding in [jar:file:/home/bamboo-agent/.m2/repository/org/slf4j/slf4j-log4j12/1.6.0/slf4j-log4j12-1.6.0.jar!/org/slf4j/impl/StaticLoggerBinder.class]
25-Oct-2019 22:40:41 SLF4J: Found binding in [jar:file:/home/bamboo-agent/.m2/repository/org/slf4j/slf4j-log4j12/1.6.0/slf4j-log4j12-1.6.0.jar!/org/slf4j/impl/StaticLoggerBinder.class]
25-Oct-2019 22:40:41 SLF4J: See http://www.slf4j.org/codes.html#multiple_bindings for an explanation.
25-Oct-2019 22:40:41 Tests run: 2, Failures: 0, Errors: 0, Skipped: 0, Time elapsed: 0.853 sec
25-Oct-2019 22:40:41 Running org.openmrs.module.reporting.data.patient.evaluator.PatientCalculationDataEvaluatorTest
25-Oct-2019 22:40:41 ERROR - EvaluationProfiler.log(111) |2019-10-25 22:40:41,936| 1768        2019-10-25 22:40:41.936        >        ERROR        EVALUATING_DEFINITION                        PatientCalculationDataDefinition[Example]: Failed to evaluate No PatientCalculation found on this PatientCalculationDataDefinition
25-Oct-2019 22:40:41 org.openmrs.module.reporting.evaluation.EvaluationException: Failed to evaluate No PatientCalculation found on this PatientCalculationDataDefinition
25-Oct-2019 22:40:41         at org.openmrs.module.reporting.data.patient.evaluator.PatientCalculationDataEvaluator.evaluate(PatientCalculationDataEvaluator.java:50)
25-Oct-2019 22:40:41         at org.openmrs.module.reporting.data.patient.evaluator.PatientCalculationDataEvaluator.evaluate(PatientCalculationDataEvaluator.java:34)
25-Oct-2019 22:40:41         at org.openmrs.module.reporting.definition.service.BaseDefinitionService.executeEvaluator(BaseDefinitionService.java:369)
25-Oct-2019 22:40:41         at org.openmrs.module.reporting.data.patient.service.PatientDataServiceImpl.executeEvaluator(PatientDataServiceImpl.java:66)
25-Oct-2019 22:40:41         at org.openmrs.module.reporting.data.patient.service.PatientDataServiceImpl.executeEvaluator(PatientDataServiceImpl.java:34)
25-Oct-2019 22:40:41         at org.openmrs.module.reporting.definition.service.BaseDefinitionService.evaluateBypassingExclusionOfTestPatients(BaseDefinitionService.java:264)
25-Oct-2019 22:40:41         at org.openmrs.module.reporting.definition.service.BaseDefinitionService.evaluate(BaseDefinitionService.java:229)
25-Oct-2019 22:40:41         at org.openmrs.module.reporting.data.patient.service.PatientDataServiceImpl.evaluate(PatientDataServiceImpl.java:48)
25-Oct-2019 22:40:41         at sun.reflect.GeneratedMethodAccessor734.invoke(Unknown Source)
25-Oct-2019 22:40:41         at sun.reflect.DelegatingMethodAccessorImpl.invoke(DelegatingMethodAccessorImpl.java:43)
25-Oct-2019 22:40:41         at java.lang.reflect.Method.invoke(Method.java:498)
25-Oct-2019 22:40:41         at org.springframework.aop.support.AopUtils.invokeJoinpointUsingReflection(AopUtils.java:309)
25-Oct-2019 22:40:41         at org.springframework.aop.framework.ReflectiveMethodInvocation.invokeJoinpoint(ReflectiveMethodInvocation.java:183)
25-Oct-2019 22:40:41         at org.springframework.aop.framework.ReflectiveMethodInvocation.proceed(ReflectiveMethodInvocation.java:150)
25-Oct-2019 22:40:41         at org.openmrs.aop.LoggingAdvice.invoke(LoggingAdvice.java:118)
25-Oct-2019 22:40:41         at org.springframework.aop.framework.ReflectiveMethodInvocation.proceed(ReflectiveMethodInvocation.java:172)
25-Oct-2019 22:40:41         at org.springframework.aop.framework.adapter.MethodBeforeAdviceInterceptor.invoke(MethodBeforeAdviceInterceptor.java:50)
25-Oct-2019 22:40:41         at org.springframework.aop.framework.ReflectiveMethodInvocation.proceed(ReflectiveMethodInvocation.java:172)
25-Oct-2019 22:40:41         at org.springframework.aop.framework.adapter.MethodBeforeAdviceInterceptor.invoke(MethodBeforeAdviceInterceptor.java:50)
25-Oct-2019 22:40:41         at org.springframework.aop.framework.ReflectiveMethodInvocation.proceed(ReflectiveMethodInvocation.java:172)
25-Oct-2019 22:40:41         at org.springframework.aop.framework.JdkDynamicAopProxy.invoke(JdkDynamicAopProxy.java:202)
25-Oct-2019 22:40:41         at com.sun.proxy.$Proxy28.evaluate(Unknown Source)
25-Oct-2019 22:40:41         at sun.reflect.GeneratedMethodAccessor734.invoke(Unknown Source)
25-Oct-2019 22:40:41         at sun.reflect.DelegatingMethodAccessorImpl.invoke(DelegatingMethodAccessorImpl.java:43)
25-Oct-2019 22:40:41         at java.lang.reflect.Method.invoke(Method.java:498)
25-Oct-2019 22:40:41         at org.springframework.aop.support.AopUtils.invokeJoinpointUsingReflection(AopUtils.java:309)
25-Oct-2019 22:40:41         at org.springframework.aop.framework.JdkDynamicAopProxy.invoke(JdkDynamicAopProxy.java:196)
25-Oct-2019 22:40:41         at com.sun.proxy.$Proxy114.evaluate(Unknown Source)
25-Oct-2019 22:40:41         at org.openmrs.module.reporting.data.patient.evaluator.PatientCalculationDataEvaluatorTest.evaluate_shouldThrowAnErrorIfNoCalculationRegistrationExistsOnTheDefinition(PatientCalculationDataEvaluatorTest.java:90)
25-Oct-2019 22:40:41         at sun.reflect.NativeMethodAccessorImpl.invoke0(Native Method)
25-Oct-2019 22:40:41         at sun.reflect.NativeMethodAccessorImpl.invoke(NativeMethodAccessorImpl.java:62)
25-Oct-2019 22:40:41         at sun.reflect.DelegatingMethodAccessorImpl.invoke(DelegatingMethodAccessorImpl.java:43)
25-Oct-2019 22:40:41         at java.lang.reflect.Method.invoke(Method.java:498)
25-Oct-2019 22:40:41         at org.junit.runners.model.FrameworkMethod$1.runReflectiveCall(FrameworkMethod.java:47)
25-Oct-2019 22:40:41         at org.junit.internal.runners.model.ReflectiveCallable.run(ReflectiveCallable.java:12)
25-Oct-2019 22:40:41         at org.junit.runners.model.FrameworkMethod.invokeExplosively(FrameworkMethod.java:44)
25-Oct-2019 22:40:41         at org.junit.internal.runners.statements.InvokeMethod.evaluate(InvokeMethod.java:17)
25-Oct-2019 22:40:41         at org.junit.internal.runners.statements.ExpectException.evaluate(ExpectException.java:19)
25-Oct-2019 22:40:41         at org.junit.internal.runners.statements.RunBefores.evaluate(RunBefores.java:26)
25-Oct-2019 22:40:41         at org.springframework.test.context.junit4.statements.RunBeforeTestMethodCallbacks.evaluate(RunBeforeTestMethodCallbacks.java:74)
25-Oct-2019 22:40:41         at org.junit.internal.runners.statements.RunAfters.evaluate(RunAfters.java:27)
25-Oct-2019 22:40:41         at org.springframework.test.context.junit4.statements.RunAfterTestMethodCallbacks.evaluate(RunAfterTestMethodCallbacks.java:82)
25-Oct-2019 22:40:41         at org.springframework.test.context.junit4.statements.SpringRepeat.evaluate(SpringRepeat.java:72)
25-Oct-2019 22:40:41         at org.springframework.test.context.junit4.SpringJUnit4ClassRunner.runChild(SpringJUnit4ClassRunner.java:240)
25-Oct-2019 22:40:41         at org.junit.runners.BlockJUnit4ClassRunner.runChild(BlockJUnit4ClassRunner.java:50)
25-Oct-2019 22:40:41         at org.junit.runners.ParentRunner$3.run(ParentRunner.java:238)
25-Oct-2019 22:40:41         at org.junit.runners.ParentRunner$1.schedule(ParentRunner.java:63)
25-Oct-2019 22:40:41         at org.junit.runners.ParentRunner.runChildren(ParentRunner.java:236)
25-Oct-2019 22:40:41         at org.junit.runners.ParentRunner.access$000(ParentRunner.java:53)
25-Oct-2019 22:40:41         at org.junit.runners.ParentRunner$2.evaluate(ParentRunner.java:229)
25-Oct-2019 22:40:41         at org.springframework.test.context.junit4.statements.RunBeforeTestClassCallbacks.evaluate(RunBeforeTestClassCallbacks.java:61)
25-Oct-2019 22:40:41         at org.junit.internal.runners.statements.RunAfters.evaluate(RunAfters.java:27)
25-Oct-2019 22:40:41         at org.springframework.test.context.junit4.statements.RunAfterTestClassCallbacks.evaluate(RunAfterTestClassCallbacks.java:70)
25-Oct-2019 22:40:41         at org.junit.runners.ParentRunner.run(ParentRunner.java:309)
25-Oct-2019 22:40:41         at org.springframework.test.context.junit4.SpringJUnit4ClassRunner.run(SpringJUnit4ClassRunner.java:180)
25-Oct-2019 22:40:41         at org.apache.maven.surefire.junit4.JUnit4TestSet.execute(JUnit4TestSet.java:59)
25-Oct-2019 22:40:41         at org.apache.maven.surefire.suite.AbstractDirectoryTestSuite.executeTestSet(AbstractDirectoryTestSuite.java:115)
25-Oct-2019 22:40:41         at org.apache.maven.surefire.suite.AbstractDirectoryTestSuite.execute(AbstractDirectoryTestSuite.java:102)
25-Oct-2019 22:40:41         at org.apache.maven.surefire.Surefire.run(Surefire.java:180)
25-Oct-2019 22:40:41         at sun.reflect.NativeMethodAccessorImpl.invoke0(Native Method)
25-Oct-2019 22:40:41         at sun.reflect.NativeMethodAccessorImpl.invoke(NativeMethodAccessorImpl.java:62)
25-Oct-2019 22:40:41         at sun.reflect.DelegatingMethodAccessorImpl.invoke(DelegatingMethodAccessorImpl.java:43)
25-Oct-2019 22:40:41         at java.lang.reflect.Method.invoke(Method.java:498)
25-Oct-2019 22:40:41         at org.apache.maven.surefire.booter.SurefireBooter.runSuitesInProcess(SurefireBooter.java:350)
25-Oct-2019 22:40:41         at org.apache.maven.surefire.booter.SurefireBooter.main(SurefireBooter.java:1021)
25-Oct-2019 22:40:42 Tests run: 2, Failures: 0, Errors: 0, Skipped: 0, Time elapsed: 0.584 sec
25-Oct-2019 22:40:42 Running org.openmrs.module.reporting.data.converter.DateConverterTest
25-Oct-2019 22:40:42 Tests run: 1, Failures: 0, Errors: 0, Skipped: 0, Time elapsed: 0.003 sec
25-Oct-2019 22:40:42 Running org.openmrs.module.reporting.dataset.definition.evaluator.EncounterAndObsDataSetEvaluatorTest
25-Oct-2019 22:40:42 Tests run: 1, Failures: 0, Errors: 0, Skipped: 0, Time elapsed: 0.337 sec
25-Oct-2019 22:40:42 Running org.openmrs.module.reporting.data.encounter.evaluator.PatientToEncounterDataEvaluatorTest
25-Oct-2019 22:40:43 Tests run: 3, Failures: 0, Errors: 0, Skipped: 0, Time elapsed: 0.783 sec
25-Oct-2019 22:40:43 Running org.openmrs.module.reporting.data.patient.evaluator.PatientIdDataEvaluatorTest
25-Oct-2019 22:40:43 Tests run: 1, Failures: 0, Errors: 0, Skipped: 0, Time elapsed: 0.332 sec
25-Oct-2019 22:40:43 Running org.openmrs.module.reporting.data.person.evaluator.RelationshipsForPersonDataEvaluatorTest
25-Oct-2019 22:40:44 Tests run: 3, Failures: 0, Errors: 0, Skipped: 0, Time elapsed: 0.86 sec
25-Oct-2019 22:40:44 Running org.openmrs.module.reporting.data.patient.evaluator.PersonToPatientDataEvaluatorTest
25-Oct-2019 22:40:44 Tests run: 1, Failures: 0, Errors: 0, Skipped: 0, Time elapsed: 0.288 sec
25-Oct-2019 22:40:44 Running org.openmrs.module.reporting.data.patient.service.PatientDataServiceImplTest
25-Oct-2019 22:40:46 Tests run: 6, Failures: 0, Errors: 0, Skipped: 0, Time elapsed: 1.98 sec
25-Oct-2019 22:40:46
25-Oct-2019 22:40:46 Results :
25-Oct-2019 22:40:46
25-Oct-2019 22:40:46 Tests run: 723, Failures: 0, Errors: 0, Skipped: 13
25-Oct-2019 22:40:46
25-Oct-2019 22:40:47 [INFO]
25-Oct-2019 22:40:47 [INFO] --- maven-jar-plugin:2.4:jar (default-jar) @ reporting-api-tests ---
25-Oct-2019 22:40:47 [WARNING] JAR will be empty - no content was marked for inclusion!
25-Oct-2019 22:40:47 [INFO] Building jar: /home/bamboo-agent/bamboo-agent/xml-data/build-dir/REP-REP-JOB1/api-tests/target/reporting-api-tests-1.19.0-SNAPSHOT.jar
25-Oct-2019 22:40:47 [INFO]
25-Oct-2019 22:40:47 [INFO] --- maven-jar-plugin:2.4:test-jar (default) @ reporting-api-tests ---
25-Oct-2019 22:40:47 [INFO] Building jar: /home/bamboo-agent/bamboo-agent/xml-data/build-dir/REP-REP-JOB1/api-tests/target/reporting-api-tests-1.19.0-SNAPSHOT-tests.jar
25-Oct-2019 22:40:47 [INFO]
25-Oct-2019 22:40:47 [INFO] --- maven-install-plugin:2.4:install (default-install) @ reporting-api-tests ---
25-Oct-2019 22:40:47 [INFO] Installing /home/bamboo-agent/bamboo-agent/xml-data/build-dir/REP-REP-JOB1/api-tests/target/reporting-api-tests-1.19.0-SNAPSHOT.jar to /home/bamboo-agent/.m2/repository/org/openmrs/module/reporting-api-tests/1.19.0-SNAPSHOT/reporting-api-tests-1.19.0-SNAPSHOT.jar
25-Oct-2019 22:40:47 [INFO] Installing /home/bamboo-agent/bamboo-agent/xml-data/build-dir/REP-REP-JOB1/api-tests/pom.xml to /home/bamboo-agent/.m2/repository/org/openmrs/module/reporting-api-tests/1.19.0-SNAPSHOT/reporting-api-tests-1.19.0-SNAPSHOT.pom
25-Oct-2019 22:40:47 [INFO] Installing /home/bamboo-agent/bamboo-agent/xml-data/build-dir/REP-REP-JOB1/api-tests/target/reporting-api-tests-1.19.0-SNAPSHOT-tests.jar to /home/bamboo-agent/.m2/repository/org/openmrs/module/reporting-api-tests/1.19.0-SNAPSHOT/reporting-api-tests-1.19.0-SNAPSHOT-tests.jar
25-Oct-2019 22:40:47 [INFO]
25-Oct-2019 22:40:47 [INFO] --- maven-deploy-plugin:2.7:deploy (default-deploy) @ reporting-api-tests ---
25-Oct-2019 22:40:47 [INFO] Downloading: http://mavenrepo.openmrs.org/nexus/content/repositories/snapshots/org/openmrs/module/reporting-api-tests/1.19.0-SNAPSHOT/maven-metadata.xml
25-Oct-2019 22:40:47 [INFO] Downloaded: http://mavenrepo.openmrs.org/nexus/content/repositories/snapshots/org/openmrs/module/reporting-api-tests/1.19.0-SNAPSHOT/maven-metadata.xml (1007 B at 1.7 KB/sec)
25-Oct-2019 22:40:47 [INFO] Uploading: http://mavenrepo.openmrs.org/nexus/content/repositories/snapshots/org/openmrs/module/reporting-api-tests/1.19.0-SNAPSHOT/reporting-api-tests-1.19.0-20191025.224047-19.jar
25-Oct-2019 22:40:48 [INFO] Uploaded: http://mavenrepo.openmrs.org/nexus/content/repositories/snapshots/org/openmrs/module/reporting-api-tests/1.19.0-SNAPSHOT/reporting-api-tests-1.19.0-20191025.224047-19.jar (2 KB at 2.6 KB/sec)
25-Oct-2019 22:40:48 [INFO] Uploading: http://mavenrepo.openmrs.org/nexus/content/repositories/snapshots/org/openmrs/module/reporting-api-tests/1.19.0-SNAPSHOT/reporting-api-tests-1.19.0-20191025.224047-19.pom
25-Oct-2019 22:40:49 [INFO] Uploaded: http://mavenrepo.openmrs.org/nexus/content/repositories/snapshots/org/openmrs/module/reporting-api-tests/1.19.0-SNAPSHOT/reporting-api-tests-1.19.0-20191025.224047-19.pom (4 KB at 4.3 KB/sec)
25-Oct-2019 22:40:49 [INFO] Downloading: http://mavenrepo.openmrs.org/nexus/content/repositories/snapshots/org/openmrs/module/reporting-api-tests/maven-metadata.xml
25-Oct-2019 22:40:49 [INFO] Downloaded: http://mavenrepo.openmrs.org/nexus/content/repositories/snapshots/org/openmrs/module/reporting-api-tests/maven-metadata.xml (762 B at 2.9 KB/sec)
25-Oct-2019 22:40:49 [INFO] Uploading: http://mavenrepo.openmrs.org/nexus/content/repositories/snapshots/org/openmrs/module/reporting-api-tests/1.19.0-SNAPSHOT/maven-metadata.xml
25-Oct-2019 22:40:50 [INFO] Uploaded: http://mavenrepo.openmrs.org/nexus/content/repositories/snapshots/org/openmrs/module/reporting-api-tests/1.19.0-SNAPSHOT/maven-metadata.xml (1007 B at 2.6 KB/sec)
25-Oct-2019 22:40:50 [INFO] Uploading: http://mavenrepo.openmrs.org/nexus/content/repositories/snapshots/org/openmrs/module/reporting-api-tests/maven-metadata.xml
25-Oct-2019 22:40:50 [INFO] Uploaded: http://mavenrepo.openmrs.org/nexus/content/repositories/snapshots/org/openmrs/module/reporting-api-tests/maven-metadata.xml (704 B at 1.3 KB/sec)
25-Oct-2019 22:40:50 [INFO] Uploading: http://mavenrepo.openmrs.org/nexus/content/repositories/snapshots/org/openmrs/module/reporting-api-tests/1.19.0-SNAPSHOT/reporting-api-tests-1.19.0-20191025.224047-19-tests.jar
25-Oct-2019 22:40:52 [INFO] Uploaded: http://mavenrepo.openmrs.org/nexus/content/repositories/snapshots/org/openmrs/module/reporting-api-tests/1.19.0-SNAPSHOT/reporting-api-tests-1.19.0-20191025.224047-19-tests.jar (943 KB at 588.4 KB/sec)
25-Oct-2019 22:40:52 [INFO] Uploading: http://mavenrepo.openmrs.org/nexus/content/repositories/snapshots/org/openmrs/module/reporting-api-tests/1.19.0-SNAPSHOT/maven-metadata.xml
25-Oct-2019 22:40:52 [INFO] Uploaded: http://mavenrepo.openmrs.org/nexus/content/repositories/snapshots/org/openmrs/module/reporting-api-tests/1.19.0-SNAPSHOT/maven-metadata.xml (1007 B at 2.5 KB/sec)
25-Oct-2019 22:40:52 [INFO]                                                                         
25-Oct-2019 22:40:52 [INFO] ------------------------------------------------------------------------
25-Oct-2019 22:40:52 [INFO] Building reporting Module api 1.10 1.19.0-SNAPSHOT
25-Oct-2019 22:40:52 [INFO] ------------------------------------------------------------------------
25-Oct-2019 22:40:52 [INFO] Downloading: http://mavenrepo.openmrs.org/nexus/content/repositories/public/org/openmrs/module/reporting-api-tests/1.19.0-SNAPSHOT/maven-metadata.xml
25-Oct-2019 22:40:53 [INFO] Downloaded: http://mavenrepo.openmrs.org/nexus/content/repositories/public/org/openmrs/module/reporting-api-tests/1.19.0-SNAPSHOT/maven-metadata.xml (1007 B at 2.5 KB/sec)
25-Oct-2019 22:40:53 [INFO]
25-Oct-2019 22:40:53 [INFO] --- maven-clean-plugin:2.5:clean (default-clean) @ reporting-api-1.10 ---
25-Oct-2019 22:40:53 [INFO]
25-Oct-2019 22:40:53 [INFO] --- maven-resources-plugin:2.6:resources (default-resources) @ reporting-api-1.10 ---
25-Oct-2019 22:40:53 [INFO] Using 'UTF-8' encoding to copy filtered resources.
25-Oct-2019 22:40:53 [INFO] skip non existing resourceDirectory /home/bamboo-agent/bamboo-agent/xml-data/build-dir/REP-REP-JOB1/api-1.10/src/main/resources
25-Oct-2019 22:40:53 [INFO]
25-Oct-2019 22:40:53 [INFO] --- maven-compiler-plugin:3.1:compile (default-compile) @ reporting-api-1.10 ---
25-Oct-2019 22:40:53 [INFO] Changes detected - recompiling the module!
25-Oct-2019 22:40:53 [INFO] Compiling 3 source files to /home/bamboo-agent/bamboo-agent/xml-data/build-dir/REP-REP-JOB1/api-1.10/target/classes
25-Oct-2019 22:40:53 [INFO]
25-Oct-2019 22:40:53 [INFO] --- build-helper-maven-plugin:1.7:parse-version (default) @ reporting-api-1.10 ---
25-Oct-2019 22:40:53 [INFO]
25-Oct-2019 22:40:53 [INFO] --- maven-resources-plugin:2.6:testResources (default-testResources) @ reporting-api-1.10 ---
25-Oct-2019 22:40:53 [INFO] Using 'UTF-8' encoding to copy filtered resources.
25-Oct-2019 22:40:53 [INFO] Copying 1 resource
25-Oct-2019 22:40:53 [INFO] Copying 0 resource
25-Oct-2019 22:40:53 [INFO]
25-Oct-2019 22:40:53 [INFO] --- maven-compiler-plugin:3.1:testCompile (default-testCompile) @ reporting-api-1.10 ---
25-Oct-2019 22:40:53 [INFO] Changes detected - recompiling the module!
25-Oct-2019 22:40:53 [INFO] Compiling 2 source files to /home/bamboo-agent/bamboo-agent/xml-data/build-dir/REP-REP-JOB1/api-1.10/target/test-classes
25-Oct-2019 22:40:53 [WARNING] /home/bamboo-agent/bamboo-agent/xml-data/build-dir/REP-REP-JOB1/api-1.10/src/test/java/org/openmrs/module/reporting/cohort/definition/evaluator/DrugOrderCohortDefinitionEvaluatorTest.java: /home/bamboo-agent/bamboo-agent/xml-data/build-dir/REP-REP-JOB1/api-1.10/src/test/java/org/openmrs/module/reporting/cohort/definition/evaluator/DrugOrderCohortDefinitionEvaluatorTest.java uses or overrides a deprecated API.
25-Oct-2019 22:40:53 [WARNING] /home/bamboo-agent/bamboo-agent/xml-data/build-dir/REP-REP-JOB1/api-1.10/src/test/java/org/openmrs/module/reporting/cohort/definition/evaluator/DrugOrderCohortDefinitionEvaluatorTest.java: Recompile with -Xlint:deprecation for details.
25-Oct-2019 22:40:53 [WARNING] /home/bamboo-agent/bamboo-agent/xml-data/build-dir/REP-REP-JOB1/api-1.10/src/test/java/org/openmrs/module/reporting/cohort/definition/evaluator/DrugOrderCohortDefinitionEvaluatorTest.java: /home/bamboo-agent/bamboo-agent/xml-data/build-dir/REP-REP-JOB1/api-1.10/src/test/java/org/openmrs/module/reporting/cohort/definition/evaluator/DrugOrderCohortDefinitionEvaluatorTest.java uses unchecked or unsafe operations.
25-Oct-2019 22:40:53 [WARNING] /home/bamboo-agent/bamboo-agent/xml-data/build-dir/REP-REP-JOB1/api-1.10/src/test/java/org/openmrs/module/reporting/cohort/definition/evaluator/DrugOrderCohortDefinitionEvaluatorTest.java: Recompile with -Xlint:unchecked for details.
25-Oct-2019 22:40:53 [INFO]
25-Oct-2019 22:40:53 [INFO] --- maven-surefire-plugin:2.5:test (default-test) @ reporting-api-1.10 ---
25-Oct-2019 22:40:53 [INFO] Surefire report directory: /home/bamboo-agent/bamboo-agent/xml-data/build-dir/REP-REP-JOB1/api-1.10/target/surefire-reports
25-Oct-2019 22:40:53 OpenJDK 64-Bit Server VM warning: ignoring option MaxPermSize=512m; support was removed in 8.0
25-Oct-2019 22:40:53
25-Oct-2019 22:40:53 -------------------------------------------------------
25-Oct-2019 22:40:53 T E S T S
25-Oct-2019 22:40:53 -------------------------------------------------------
25-Oct-2019 22:40:53 Running org.openmrs.module.reporting.cohort.definition.evaluator.DrugOrderCohortDefinitionEvaluatorTest
25-Oct-2019 22:40:54 log4j:WARN No appenders could be found for logger (org.springframework.test.context.junit4.SpringJUnit4ClassRunner).
25-Oct-2019 22:40:54 log4j:WARN Please initialize the log4j system properly.
25-Oct-2019 22:41:10 Tests run: 18, Failures: 0, Errors: 0, Skipped: 0, Time elapsed: 17.165 sec
25-Oct-2019 22:41:10 Running org.openmrs.module.reporting.cohort.definition.library.BuiltInCohortDefinitionLibrary1_10Test
25-Oct-2019 22:41:10 Tests run: 1, Failures: 0, Errors: 0, Skipped: 0, Time elapsed: 0.006 sec
25-Oct-2019 22:41:10
25-Oct-2019 22:41:10 Results :
25-Oct-2019 22:41:10
25-Oct-2019 22:41:10 Tests run: 19, Failures: 0, Errors: 0, Skipped: 0
25-Oct-2019 22:41:10
25-Oct-2019 22:41:11 [INFO]
25-Oct-2019 22:41:11 [INFO] --- maven-jar-plugin:2.4:jar (default-jar) @ reporting-api-1.10 ---
25-Oct-2019 22:41:11 [INFO] Building jar: /home/bamboo-agent/bamboo-agent/xml-data/build-dir/REP-REP-JOB1/api-1.10/target/reporting-api-1.10-1.19.0-SNAPSHOT.jar
25-Oct-2019 22:41:11 [INFO]
25-Oct-2019 22:41:11 [INFO] --- maven-jar-plugin:2.4:test-jar (default) @ reporting-api-1.10 ---
25-Oct-2019 22:41:11 [INFO] Building jar: /home/bamboo-agent/bamboo-agent/xml-data/build-dir/REP-REP-JOB1/api-1.10/target/reporting-api-1.10-1.19.0-SNAPSHOT-tests.jar
25-Oct-2019 22:41:11 [INFO]
25-Oct-2019 22:41:11 [INFO] --- maven-install-plugin:2.4:install (default-install) @ reporting-api-1.10 ---
25-Oct-2019 22:41:11 [INFO] Installing /home/bamboo-agent/bamboo-agent/xml-data/build-dir/REP-REP-JOB1/api-1.10/target/reporting-api-1.10-1.19.0-SNAPSHOT.jar to /home/bamboo-agent/.m2/repository/org/openmrs/module/reporting-api-1.10/1.19.0-SNAPSHOT/reporting-api-1.10-1.19.0-SNAPSHOT.jar
25-Oct-2019 22:41:11 [INFO] Installing /home/bamboo-agent/bamboo-agent/xml-data/build-dir/REP-REP-JOB1/api-1.10/pom.xml to /home/bamboo-agent/.m2/repository/org/openmrs/module/reporting-api-1.10/1.19.0-SNAPSHOT/reporting-api-1.10-1.19.0-SNAPSHOT.pom
25-Oct-2019 22:41:11 [INFO] Installing /home/bamboo-agent/bamboo-agent/xml-data/build-dir/REP-REP-JOB1/api-1.10/target/reporting-api-1.10-1.19.0-SNAPSHOT-tests.jar to /home/bamboo-agent/.m2/repository/org/openmrs/module/reporting-api-1.10/1.19.0-SNAPSHOT/reporting-api-1.10-1.19.0-SNAPSHOT-tests.jar
25-Oct-2019 22:41:11 [INFO]
25-Oct-2019 22:41:11 [INFO] --- maven-deploy-plugin:2.7:deploy (default-deploy) @ reporting-api-1.10 ---
25-Oct-2019 22:41:11 [INFO] Downloading: http://mavenrepo.openmrs.org/nexus/content/repositories/snapshots/org/openmrs/module/reporting-api-1.10/1.19.0-SNAPSHOT/maven-metadata.xml
25-Oct-2019 22:41:11 [INFO] Downloaded: http://mavenrepo.openmrs.org/nexus/content/repositories/snapshots/org/openmrs/module/reporting-api-1.10/1.19.0-SNAPSHOT/maven-metadata.xml (1006 B at 4.0 KB/sec)
25-Oct-2019 22:41:11 [INFO] Uploading: http://mavenrepo.openmrs.org/nexus/content/repositories/snapshots/org/openmrs/module/reporting-api-1.10/1.19.0-SNAPSHOT/reporting-api-1.10-1.19.0-20191025.224111-19.jar
25-Oct-2019 22:41:12 [INFO] Uploaded: http://mavenrepo.openmrs.org/nexus/content/repositories/snapshots/org/openmrs/module/reporting-api-1.10/1.19.0-SNAPSHOT/reporting-api-1.10-1.19.0-20191025.224111-19.jar (9 KB at 10.9 KB/sec)
25-Oct-2019 22:41:12 [INFO] Uploading: http://mavenrepo.openmrs.org/nexus/content/repositories/snapshots/org/openmrs/module/reporting-api-1.10/1.19.0-SNAPSHOT/reporting-api-1.10-1.19.0-20191025.224111-19.pom
25-Oct-2019 22:41:13 [INFO] Uploaded: http://mavenrepo.openmrs.org/nexus/content/repositories/snapshots/org/openmrs/module/reporting-api-1.10/1.19.0-SNAPSHOT/reporting-api-1.10-1.19.0-20191025.224111-19.pom (3 KB at 3.8 KB/sec)
25-Oct-2019 22:41:13 [INFO] Downloading: http://mavenrepo.openmrs.org/nexus/content/repositories/snapshots/org/openmrs/module/reporting-api-1.10/maven-metadata.xml
25-Oct-2019 22:41:13 [INFO] Downloaded: http://mavenrepo.openmrs.org/nexus/content/repositories/snapshots/org/openmrs/module/reporting-api-1.10/maven-metadata.xml (433 B at 1.6 KB/sec)
25-Oct-2019 22:41:13 [INFO] Uploading: http://mavenrepo.openmrs.org/nexus/content/repositories/snapshots/org/openmrs/module/reporting-api-1.10/1.19.0-SNAPSHOT/maven-metadata.xml
25-Oct-2019 22:41:13 [INFO] Uploaded: http://mavenrepo.openmrs.org/nexus/content/repositories/snapshots/org/openmrs/module/reporting-api-1.10/1.19.0-SNAPSHOT/maven-metadata.xml (1006 B at 2.5 KB/sec)
25-Oct-2019 22:41:13 [INFO] Uploading: http://mavenrepo.openmrs.org/nexus/content/repositories/snapshots/org/openmrs/module/reporting-api-1.10/maven-metadata.xml
25-Oct-2019 22:41:14 [INFO] Uploaded: http://mavenrepo.openmrs.org/nexus/content/repositories/snapshots/org/openmrs/module/reporting-api-1.10/maven-metadata.xml (375 B at 0.7 KB/sec)
25-Oct-2019 22:41:14 [INFO] Uploading: http://mavenrepo.openmrs.org/nexus/content/repositories/snapshots/org/openmrs/module/reporting-api-1.10/1.19.0-SNAPSHOT/reporting-api-1.10-1.19.0-20191025.224111-19-tests.jar
25-Oct-2019 22:41:15 [INFO] Uploaded: http://mavenrepo.openmrs.org/nexus/content/repositories/snapshots/org/openmrs/module/reporting-api-1.10/1.19.0-SNAPSHOT/reporting-api-1.10-1.19.0-20191025.224111-19-tests.jar (12 KB at 13.9 KB/sec)
25-Oct-2019 22:41:15 [INFO] Uploading: http://mavenrepo.openmrs.org/nexus/content/repositories/snapshots/org/openmrs/module/reporting-api-1.10/1.19.0-SNAPSHOT/maven-metadata.xml
25-Oct-2019 22:41:15 [INFO] Uploaded: http://mavenrepo.openmrs.org/nexus/content/repositories/snapshots/org/openmrs/module/reporting-api-1.10/1.19.0-SNAPSHOT/maven-metadata.xml (1006 B at 2.4 KB/sec)
25-Oct-2019 22:41:15 [INFO]                                                                         
25-Oct-2019 22:41:15 [INFO] ------------------------------------------------------------------------
25-Oct-2019 22:41:15 [INFO] Building reporting Module api 2.0 1.19.0-SNAPSHOT
25-Oct-2019 22:41:15 [INFO] ------------------------------------------------------------------------
25-Oct-2019 22:41:15 [INFO]
25-Oct-2019 22:41:15 [INFO] --- maven-clean-plugin:2.5:clean (default-clean) @ reporting-api-2.0 ---
25-Oct-2019 22:41:15 [INFO]
25-Oct-2019 22:41:15 [INFO] --- maven-resources-plugin:2.6:resources (default-resources) @ reporting-api-2.0 ---
25-Oct-2019 22:41:15 [INFO] Using 'UTF-8' encoding to copy filtered resources.
25-Oct-2019 22:41:15 [INFO] skip non existing resourceDirectory /home/bamboo-agent/bamboo-agent/xml-data/build-dir/REP-REP-JOB1/api-2.0/src/main/resources
25-Oct-2019 22:41:15 [INFO]
25-Oct-2019 22:41:15 [INFO] --- maven-compiler-plugin:3.1:compile (default-compile) @ reporting-api-2.0 ---
25-Oct-2019 22:41:15 [INFO] Changes detected - recompiling the module!
25-Oct-2019 22:41:15 [INFO] Compiling 4 source files to /home/bamboo-agent/bamboo-agent/xml-data/build-dir/REP-REP-JOB1/api-2.0/target/classes
25-Oct-2019 22:41:16 [INFO]
25-Oct-2019 22:41:16 [INFO] --- build-helper-maven-plugin:1.7:parse-version (default) @ reporting-api-2.0 ---
25-Oct-2019 22:41:16 [INFO]
25-Oct-2019 22:41:16 [INFO] --- maven-resources-plugin:2.6:testResources (default-testResources) @ reporting-api-2.0 ---
25-Oct-2019 22:41:16 [INFO] Using 'UTF-8' encoding to copy filtered resources.
25-Oct-2019 22:41:16 [INFO] skip non existing resourceDirectory /home/bamboo-agent/bamboo-agent/xml-data/build-dir/REP-REP-JOB1/api-2.0/src/test/resources
25-Oct-2019 22:41:16 [INFO] skip non existing resourceDirectory /home/bamboo-agent/bamboo-agent/xml-data/build-dir/REP-REP-JOB1/api-2.0/src/test/resources
25-Oct-2019 22:41:16 [INFO]
25-Oct-2019 22:41:16 [INFO] --- maven-compiler-plugin:3.1:testCompile (default-testCompile) @ reporting-api-2.0 ---
25-Oct-2019 22:41:16 [INFO] No sources to compile
25-Oct-2019 22:41:16 [INFO]
25-Oct-2019 22:41:16 [INFO] --- maven-surefire-plugin:2.5:test (default-test) @ reporting-api-2.0 ---
25-Oct-2019 22:41:16 [INFO] No tests to run.
25-Oct-2019 22:41:16 [INFO]
25-Oct-2019 22:41:16 [INFO] --- maven-jar-plugin:2.4:jar (default-jar) @ reporting-api-2.0 ---
25-Oct-2019 22:41:16 [INFO] Building jar: /home/bamboo-agent/bamboo-agent/xml-data/build-dir/REP-REP-JOB1/api-2.0/target/reporting-api-2.0-1.19.0-SNAPSHOT.jar
25-Oct-2019 22:41:16 [INFO]
25-Oct-2019 22:41:16 [INFO] --- maven-jar-plugin:2.4:test-jar (default) @ reporting-api-2.0 ---
25-Oct-2019 22:41:16 [WARNING] JAR will be empty - no content was marked for inclusion!
25-Oct-2019 22:41:16 [INFO] Building jar: /home/bamboo-agent/bamboo-agent/xml-data/build-dir/REP-REP-JOB1/api-2.0/target/reporting-api-2.0-1.19.0-SNAPSHOT-tests.jar
25-Oct-2019 22:41:16 [INFO]
25-Oct-2019 22:41:16 [INFO] --- maven-install-plugin:2.4:install (default-install) @ reporting-api-2.0 ---
25-Oct-2019 22:41:16 [INFO] Installing /home/bamboo-agent/bamboo-agent/xml-data/build-dir/REP-REP-JOB1/api-2.0/target/reporting-api-2.0-1.19.0-SNAPSHOT.jar to /home/bamboo-agent/.m2/repository/org/openmrs/module/reporting-api-2.0/1.19.0-SNAPSHOT/reporting-api-2.0-1.19.0-SNAPSHOT.jar
25-Oct-2019 22:41:16 [INFO] Installing /home/bamboo-agent/bamboo-agent/xml-data/build-dir/REP-REP-JOB1/api-2.0/pom.xml to /home/bamboo-agent/.m2/repository/org/openmrs/module/reporting-api-2.0/1.19.0-SNAPSHOT/reporting-api-2.0-1.19.0-SNAPSHOT.pom
25-Oct-2019 22:41:16 [INFO] Installing /home/bamboo-agent/bamboo-agent/xml-data/build-dir/REP-REP-JOB1/api-2.0/target/reporting-api-2.0-1.19.0-SNAPSHOT-tests.jar to /home/bamboo-agent/.m2/repository/org/openmrs/module/reporting-api-2.0/1.19.0-SNAPSHOT/reporting-api-2.0-1.19.0-SNAPSHOT-tests.jar
25-Oct-2019 22:41:16 [INFO]
25-Oct-2019 22:41:16 [INFO] --- maven-deploy-plugin:2.7:deploy (default-deploy) @ reporting-api-2.0 ---
25-Oct-2019 22:41:16 [INFO] Downloading: http://mavenrepo.openmrs.org/nexus/content/repositories/snapshots/org/openmrs/module/reporting-api-2.0/1.19.0-SNAPSHOT/maven-metadata.xml
25-Oct-2019 22:41:16 [INFO] Downloaded: http://mavenrepo.openmrs.org/nexus/content/repositories/snapshots/org/openmrs/module/reporting-api-2.0/1.19.0-SNAPSHOT/maven-metadata.xml (1005 B at 3.7 KB/sec)
25-Oct-2019 22:41:16 [INFO] Uploading: http://mavenrepo.openmrs.org/nexus/content/repositories/snapshots/org/openmrs/module/reporting-api-2.0/1.19.0-SNAPSHOT/reporting-api-2.0-1.19.0-20191025.224116-19.jar
25-Oct-2019 22:41:17 [INFO] Uploaded: http://mavenrepo.openmrs.org/nexus/content/repositories/snapshots/org/openmrs/module/reporting-api-2.0/1.19.0-SNAPSHOT/reporting-api-2.0-1.19.0-20191025.224116-19.jar (12 KB at 15.2 KB/sec)
25-Oct-2019 22:41:17 [INFO] Uploading: http://mavenrepo.openmrs.org/nexus/content/repositories/snapshots/org/openmrs/module/reporting-api-2.0/1.19.0-SNAPSHOT/reporting-api-2.0-1.19.0-20191025.224116-19.pom
25-Oct-2019 22:41:18 [INFO] Uploaded: http://mavenrepo.openmrs.org/nexus/content/repositories/snapshots/org/openmrs/module/reporting-api-2.0/1.19.0-SNAPSHOT/reporting-api-2.0-1.19.0-20191025.224116-19.pom (3 KB at 3.4 KB/sec)
25-Oct-2019 22:41:18 [INFO] Downloading: http://mavenrepo.openmrs.org/nexus/content/repositories/snapshots/org/openmrs/module/reporting-api-2.0/maven-metadata.xml
25-Oct-2019 22:41:18 [INFO] Downloaded: http://mavenrepo.openmrs.org/nexus/content/repositories/snapshots/org/openmrs/module/reporting-api-2.0/maven-metadata.xml (760 B at 3.1 KB/sec)
25-Oct-2019 22:41:18 [INFO] Uploading: http://mavenrepo.openmrs.org/nexus/content/repositories/snapshots/org/openmrs/module/reporting-api-2.0/1.19.0-SNAPSHOT/maven-metadata.xml
25-Oct-2019 22:41:18 [INFO] Uploaded: http://mavenrepo.openmrs.org/nexus/content/repositories/snapshots/org/openmrs/module/reporting-api-2.0/1.19.0-SNAPSHOT/maven-metadata.xml (1005 B at 2.7 KB/sec)
25-Oct-2019 22:41:18 [INFO] Uploading: http://mavenrepo.openmrs.org/nexus/content/repositories/snapshots/org/openmrs/module/reporting-api-2.0/maven-metadata.xml
25-Oct-2019 22:41:19 [INFO] Uploaded: http://mavenrepo.openmrs.org/nexus/content/repositories/snapshots/org/openmrs/module/reporting-api-2.0/maven-metadata.xml (702 B at 1.3 KB/sec)
25-Oct-2019 22:41:19 [INFO] Uploading: http://mavenrepo.openmrs.org/nexus/content/repositories/snapshots/org/openmrs/module/reporting-api-2.0/1.19.0-SNAPSHOT/reporting-api-2.0-1.19.0-20191025.224116-19-tests.jar
25-Oct-2019 22:41:20 [INFO] Uploaded: http://mavenrepo.openmrs.org/nexus/content/repositories/snapshots/org/openmrs/module/reporting-api-2.0/1.19.0-SNAPSHOT/reporting-api-2.0-1.19.0-20191025.224116-19-tests.jar (2 KB at 2.1 KB/sec)
25-Oct-2019 22:41:20 [INFO] Uploading: http://mavenrepo.openmrs.org/nexus/content/repositories/snapshots/org/openmrs/module/reporting-api-2.0/1.19.0-SNAPSHOT/maven-metadata.xml
25-Oct-2019 22:41:20 [INFO] Uploaded: http://mavenrepo.openmrs.org/nexus/content/repositories/snapshots/org/openmrs/module/reporting-api-2.0/1.19.0-SNAPSHOT/maven-metadata.xml (1005 B at 2.5 KB/sec)
25-Oct-2019 22:41:20 [INFO]                                                                         
25-Oct-2019 22:41:20 [INFO] ------------------------------------------------------------------------
25-Oct-2019 22:41:20 [INFO] Building reporting Module api 2.2 1.19.0-SNAPSHOT
25-Oct-2019 22:41:20 [INFO] ------------------------------------------------------------------------
25-Oct-2019 22:41:20 [INFO]
25-Oct-2019 22:41:20 [INFO] --- maven-clean-plugin:2.5:clean (default-clean) @ reporting-api-2.2 ---
25-Oct-2019 22:41:20 [INFO]
25-Oct-2019 22:41:20 [INFO] --- maven-resources-plugin:2.6:resources (default-resources) @ reporting-api-2.2 ---
25-Oct-2019 22:41:20 [INFO] Using 'UTF-8' encoding to copy filtered resources.
25-Oct-2019 22:41:20 [INFO] skip non existing resourceDirectory /home/bamboo-agent/bamboo-agent/xml-data/build-dir/REP-REP-JOB1/api-2.2/src/main/resources
25-Oct-2019 22:41:20 [INFO]
25-Oct-2019 22:41:20 [INFO] --- maven-compiler-plugin:3.1:compile (default-compile) @ reporting-api-2.2 ---
25-Oct-2019 22:41:20 [INFO] Changes detected - recompiling the module!
25-Oct-2019 22:41:20 [INFO] Compiling 3 source files to /home/bamboo-agent/bamboo-agent/xml-data/build-dir/REP-REP-JOB1/api-2.2/target/classes
25-Oct-2019 22:41:20 [INFO]
25-Oct-2019 22:41:20 [INFO] --- build-helper-maven-plugin:1.7:parse-version (default) @ reporting-api-2.2 ---
25-Oct-2019 22:41:20 [INFO]
25-Oct-2019 22:41:20 [INFO] --- maven-resources-plugin:2.6:testResources (default-testResources) @ reporting-api-2.2 ---
25-Oct-2019 22:41:20 [INFO] Using 'UTF-8' encoding to copy filtered resources.
25-Oct-2019 22:41:20 [INFO] Copying 1 resource
25-Oct-2019 22:41:20 [INFO] Copying 0 resource
25-Oct-2019 22:41:20 [INFO]
25-Oct-2019 22:41:20 [INFO] --- maven-compiler-plugin:3.1:testCompile (default-testCompile) @ reporting-api-2.2 ---
25-Oct-2019 22:41:20 [INFO] Changes detected - recompiling the module!
25-Oct-2019 22:41:20 [INFO] Compiling 2 source files to /home/bamboo-agent/bamboo-agent/xml-data/build-dir/REP-REP-JOB1/api-2.2/target/test-classes
25-Oct-2019 22:41:21 [INFO]
25-Oct-2019 22:41:21 [INFO] --- maven-surefire-plugin:2.5:test (default-test) @ reporting-api-2.2 ---
25-Oct-2019 22:41:21 [INFO] Surefire report directory: /home/bamboo-agent/bamboo-agent/xml-data/build-dir/REP-REP-JOB1/api-2.2/target/surefire-reports
25-Oct-2019 22:41:21 OpenJDK 64-Bit Server VM warning: ignoring option MaxPermSize=512m; support was removed in 8.0
25-Oct-2019 22:41:21
25-Oct-2019 22:41:21 -------------------------------------------------------
25-Oct-2019 22:41:21 T E S T S
25-Oct-2019 22:41:21 -------------------------------------------------------
25-Oct-2019 22:41:21 Running org.openmrs.module.reporting.cohort.definition.evaluator.ConditionCohortDefinitionEvaluatorTest
25-Oct-2019 22:41:21 log4j:WARN No appenders could be found for logger (org.springframework.test.context.junit4.SpringJUnit4ClassRunner).
25-Oct-2019 22:41:21 log4j:WARN Please initialize the log4j system properly.
25-Oct-2019 22:41:36 Tests run: 12, Failures: 0, Errors: 0, Skipped: 0, Time elapsed: 15.423 sec
25-Oct-2019 22:41:36 Running org.openmrs.module.reporting.cohort.definition.library.BuiltInCohortDefinitionLibrary2_2Test
25-Oct-2019 22:41:36 Tests run: 1, Failures: 0, Errors: 0, Skipped: 0, Time elapsed: 0.007 sec
25-Oct-2019 22:41:36
25-Oct-2019 22:41:36 Results :
25-Oct-2019 22:41:36
25-Oct-2019 22:41:36 Tests run: 13, Failures: 0, Errors: 0, Skipped: 0
25-Oct-2019 22:41:36
25-Oct-2019 22:41:36 [INFO]
25-Oct-2019 22:41:36 [INFO] --- maven-jar-plugin:2.4:jar (default-jar) @ reporting-api-2.2 ---
25-Oct-2019 22:41:36 [INFO] Building jar: /home/bamboo-agent/bamboo-agent/xml-data/build-dir/REP-REP-JOB1/api-2.2/target/reporting-api-2.2-1.19.0-SNAPSHOT.jar
25-Oct-2019 22:41:36 [INFO]
25-Oct-2019 22:41:36 [INFO] --- maven-jar-plugin:2.4:test-jar (default) @ reporting-api-2.2 ---
25-Oct-2019 22:41:36 [INFO] Building jar: /home/bamboo-agent/bamboo-agent/xml-data/build-dir/REP-REP-JOB1/api-2.2/target/reporting-api-2.2-1.19.0-SNAPSHOT-tests.jar
25-Oct-2019 22:41:36 [INFO]
25-Oct-2019 22:41:36 [INFO] --- maven-install-plugin:2.4:install (default-install) @ reporting-api-2.2 ---
25-Oct-2019 22:41:36 [INFO] Installing /home/bamboo-agent/bamboo-agent/xml-data/build-dir/REP-REP-JOB1/api-2.2/target/reporting-api-2.2-1.19.0-SNAPSHOT.jar to /home/bamboo-agent/.m2/repository/org/openmrs/module/reporting-api-2.2/1.19.0-SNAPSHOT/reporting-api-2.2-1.19.0-SNAPSHOT.jar
25-Oct-2019 22:41:36 [INFO] Installing /home/bamboo-agent/bamboo-agent/xml-data/build-dir/REP-REP-JOB1/api-2.2/pom.xml to /home/bamboo-agent/.m2/repository/org/openmrs/module/reporting-api-2.2/1.19.0-SNAPSHOT/reporting-api-2.2-1.19.0-SNAPSHOT.pom
25-Oct-2019 22:41:36 [INFO] Installing /home/bamboo-agent/bamboo-agent/xml-data/build-dir/REP-REP-JOB1/api-2.2/target/reporting-api-2.2-1.19.0-SNAPSHOT-tests.jar to /home/bamboo-agent/.m2/repository/org/openmrs/module/reporting-api-2.2/1.19.0-SNAPSHOT/reporting-api-2.2-1.19.0-SNAPSHOT-tests.jar
25-Oct-2019 22:41:36 [INFO]
25-Oct-2019 22:41:36 [INFO] --- maven-deploy-plugin:2.7:deploy (default-deploy) @ reporting-api-2.2 ---
25-Oct-2019 22:41:36 [INFO] Downloading: http://mavenrepo.openmrs.org/nexus/content/repositories/snapshots/org/openmrs/module/reporting-api-2.2/1.19.0-SNAPSHOT/maven-metadata.xml
25-Oct-2019 22:41:37 [INFO] Downloaded: http://mavenrepo.openmrs.org/nexus/content/repositories/snapshots/org/openmrs/module/reporting-api-2.2/1.19.0-SNAPSHOT/maven-metadata.xml (1005 B at 3.9 KB/sec)
25-Oct-2019 22:41:37 [INFO] Uploading: http://mavenrepo.openmrs.org/nexus/content/repositories/snapshots/org/openmrs/module/reporting-api-2.2/1.19.0-SNAPSHOT/reporting-api-2.2-1.19.0-20191025.224137-15.jar
25-Oct-2019 22:41:37 [INFO] Uploaded: http://mavenrepo.openmrs.org/nexus/content/repositories/snapshots/org/openmrs/module/reporting-api-2.2/1.19.0-SNAPSHOT/reporting-api-2.2-1.19.0-20191025.224137-15.jar (7 KB at 9.7 KB/sec)
25-Oct-2019 22:41:37 [INFO] Uploading: http://mavenrepo.openmrs.org/nexus/content/repositories/snapshots/org/openmrs/module/reporting-api-2.2/1.19.0-SNAPSHOT/reporting-api-2.2-1.19.0-20191025.224137-15.pom
25-Oct-2019 22:41:38 [INFO] Uploaded: http://mavenrepo.openmrs.org/nexus/content/repositories/snapshots/org/openmrs/module/reporting-api-2.2/1.19.0-SNAPSHOT/reporting-api-2.2-1.19.0-20191025.224137-15.pom (3 KB at 3.8 KB/sec)
25-Oct-2019 22:41:38 [INFO] Downloading: http://mavenrepo.openmrs.org/nexus/content/repositories/snapshots/org/openmrs/module/reporting-api-2.2/maven-metadata.xml
25-Oct-2019 22:41:38 [INFO] Downloaded: http://mavenrepo.openmrs.org/nexus/content/repositories/snapshots/org/openmrs/module/reporting-api-2.2/maven-metadata.xml (391 B at 1.5 KB/sec)
25-Oct-2019 22:41:38 [INFO] Uploading: http://mavenrepo.openmrs.org/nexus/content/repositories/snapshots/org/openmrs/module/reporting-api-2.2/1.19.0-SNAPSHOT/maven-metadata.xml
25-Oct-2019 22:41:39 [INFO] Uploaded: http://mavenrepo.openmrs.org/nexus/content/repositories/snapshots/org/openmrs/module/reporting-api-2.2/1.19.0-SNAPSHOT/maven-metadata.xml (1005 B at 2.5 KB/sec)
25-Oct-2019 22:41:39 [INFO] Uploading: http://mavenrepo.openmrs.org/nexus/content/repositories/snapshots/org/openmrs/module/reporting-api-2.2/maven-metadata.xml
25-Oct-2019 22:41:39 [INFO] Uploaded: http://mavenrepo.openmrs.org/nexus/content/repositories/snapshots/org/openmrs/module/reporting-api-2.2/maven-metadata.xml (333 B at 0.6 KB/sec)
25-Oct-2019 22:41:39 [INFO] Uploading: http://mavenrepo.openmrs.org/nexus/content/repositories/snapshots/org/openmrs/module/reporting-api-2.2/1.19.0-SNAPSHOT/reporting-api-2.2-1.19.0-20191025.224137-15-tests.jar
25-Oct-2019 22:41:40 [INFO] Uploaded: http://mavenrepo.openmrs.org/nexus/content/repositories/snapshots/org/openmrs/module/reporting-api-2.2/1.19.0-SNAPSHOT/reporting-api-2.2-1.19.0-20191025.224137-15-tests.jar (8 KB at 10.2 KB/sec)
25-Oct-2019 22:41:40 [INFO] Uploading: http://mavenrepo.openmrs.org/nexus/content/repositories/snapshots/org/openmrs/module/reporting-api-2.2/1.19.0-SNAPSHOT/maven-metadata.xml
25-Oct-2019 22:41:41 [INFO] Uploaded: http://mavenrepo.openmrs.org/nexus/content/repositories/snapshots/org/openmrs/module/reporting-api-2.2/1.19.0-SNAPSHOT/maven-metadata.xml (1005 B at 2.5 KB/sec)
25-Oct-2019 22:41:41 [INFO]                                                                         
25-Oct-2019 22:41:41 [INFO] ------------------------------------------------------------------------
25-Oct-2019 22:41:41 [INFO] Building Reporting OMOD 1.19.0-SNAPSHOT
25-Oct-2019 22:41:41 [INFO] ------------------------------------------------------------------------
25-Oct-2019 22:41:41 [INFO]
25-Oct-2019 22:41:41 [INFO] --- maven-clean-plugin:2.5:clean (default-clean) @ reporting-omod ---
25-Oct-2019 22:41:41 [INFO]
25-Oct-2019 22:41:41 [INFO] --- maven-openmrs-plugin:1.0.1:initialize-module (init) @ reporting-omod ---
25-Oct-2019 22:41:41 [INFO]
25-Oct-2019 22:41:41 [INFO] --- maven-dependency-plugin:2.8:unpack-dependencies (Expand resources) @ reporting-omod ---
25-Oct-2019 22:41:41 [INFO] Unpacking /home/bamboo-agent/bamboo-agent/xml-data/build-dir/REP-REP-JOB1/api/target/reporting-api-1.19.0-SNAPSHOT.jar to /home/bamboo-agent/bamboo-agent/xml-data/build-dir/REP-REP-JOB1/omod/target/classes with includes "**\/*.xml,**\/*.properties" and excludes ""
25-Oct-2019 22:41:41 [INFO]
25-Oct-2019 22:41:41 [INFO] --- maven-resources-plugin:2.6:resources (default-resources) @ reporting-omod ---
25-Oct-2019 22:41:41 [INFO] Using 'UTF-8' encoding to copy filtered resources.
25-Oct-2019 22:41:41 [INFO] Copying 0 resource
25-Oct-2019 22:41:41 [INFO] Copying 2 resources
25-Oct-2019 22:41:41 [INFO] Copying 224 resources to web/module
25-Oct-2019 22:41:41 [INFO] Copying 224 resources to web/module
25-Oct-2019 22:41:41 [INFO]
25-Oct-2019 22:41:41 [INFO] --- maven-compiler-plugin:3.1:compile (default-compile) @ reporting-omod ---
25-Oct-2019 22:41:41 [INFO] Changes detected - recompiling the module!
25-Oct-2019 22:41:41 [INFO] Compiling 113 source files to /home/bamboo-agent/bamboo-agent/xml-data/build-dir/REP-REP-JOB1/omod/target/classes
25-Oct-2019 22:41:42 [WARNING] /home/bamboo-agent/bamboo-agent/xml-data/build-dir/REP-REP-JOB1/omod/src/main/java/org/openmrs/module/reporting/web/datasets/LogicDataSetEditor.java: Some input files use or override a deprecated API.
25-Oct-2019 22:41:42 [WARNING] /home/bamboo-agent/bamboo-agent/xml-data/build-dir/REP-REP-JOB1/omod/src/main/java/org/openmrs/module/reporting/web/datasets/LogicDataSetEditor.java: Recompile with -Xlint:deprecation for details.
25-Oct-2019 22:41:42 [WARNING] /home/bamboo-agent/bamboo-agent/xml-data/build-dir/REP-REP-JOB1/omod/src/main/java/org/openmrs/module/reporting/web/datasets/PatientDataSetEditor.java: Some input files use unchecked or unsafe operations.
25-Oct-2019 22:41:42 [WARNING] /home/bamboo-agent/bamboo-agent/xml-data/build-dir/REP-REP-JOB1/omod/src/main/java/org/openmrs/module/reporting/web/datasets/PatientDataSetEditor.java: Recompile with -Xlint:unchecked for details.
25-Oct-2019 22:41:42 [INFO]
25-Oct-2019 22:41:42 [INFO] --- build-helper-maven-plugin:1.7:parse-version (default) @ reporting-omod ---
25-Oct-2019 22:41:42 [INFO]
25-Oct-2019 22:41:42 [INFO] --- maven-resources-plugin:2.6:testResources (default-testResources) @ reporting-omod ---
25-Oct-2019 22:41:42 [INFO] Using 'UTF-8' encoding to copy filtered resources.
25-Oct-2019 22:41:42 [INFO] skip non existing resourceDirectory /home/bamboo-agent/bamboo-agent/xml-data/build-dir/REP-REP-JOB1/omod/src/test/resources
25-Oct-2019 22:41:42 [INFO] skip non existing resourceDirectory /home/bamboo-agent/bamboo-agent/xml-data/build-dir/REP-REP-JOB1/omod/src/test/resources
25-Oct-2019 22:41:42 [INFO]
25-Oct-2019 22:41:42 [INFO] --- maven-compiler-plugin:3.1:testCompile (default-testCompile) @ reporting-omod ---
25-Oct-2019 22:41:42 [INFO] No sources to compile
25-Oct-2019 22:41:42 [INFO]
25-Oct-2019 22:41:42 [INFO] --- maven-surefire-plugin:2.5:test (default-test) @ reporting-omod ---
25-Oct-2019 22:41:42 [INFO] No tests to run.
25-Oct-2019 22:41:42 [INFO]
25-Oct-2019 22:41:42 [INFO] --- maven-jar-plugin:2.4:jar (default-jar) @ reporting-omod ---
25-Oct-2019 22:41:42 [INFO] Building jar: /home/bamboo-agent/bamboo-agent/xml-data/build-dir/REP-REP-JOB1/omod/target/reporting-1.19.0-SNAPSHOT.jar
25-Oct-2019 22:41:42 [INFO]
25-Oct-2019 22:41:42 [INFO] --- maven-openmrs-plugin:1.0.1:package-module (pack) @ reporting-omod ---
25-Oct-2019 22:41:42 [INFO] Packaging OpenMRS module
25-Oct-2019 22:41:43 [INFO] Building jar: /home/bamboo-agent/bamboo-agent/xml-data/build-dir/REP-REP-JOB1/omod/target/reporting-1.19.0-SNAPSHOT.omod
25-Oct-2019 22:41:43 [INFO]
25-Oct-2019 22:41:43 [INFO] --- maven-jar-plugin:2.4:test-jar (default) @ reporting-omod ---
25-Oct-2019 22:41:43 [WARNING] JAR will be empty - no content was marked for inclusion!
25-Oct-2019 22:41:43 [INFO] Building jar: /home/bamboo-agent/bamboo-agent/xml-data/build-dir/REP-REP-JOB1/omod/target/reporting-1.19.0-SNAPSHOT-tests.jar
25-Oct-2019 22:41:43 [INFO]
25-Oct-2019 22:41:43 [INFO] --- maven-install-plugin:2.4:install (default-install) @ reporting-omod ---
25-Oct-2019 22:41:43 [INFO] Installing /home/bamboo-agent/bamboo-agent/xml-data/build-dir/REP-REP-JOB1/omod/target/reporting-1.19.0-SNAPSHOT.omod to /home/bamboo-agent/.m2/repository/org/openmrs/module/reporting-omod/1.19.0-SNAPSHOT/reporting-omod-1.19.0-SNAPSHOT.jar
25-Oct-2019 22:41:43 [INFO] Installing /home/bamboo-agent/bamboo-agent/xml-data/build-dir/REP-REP-JOB1/omod/pom.xml to /home/bamboo-agent/.m2/repository/org/openmrs/module/reporting-omod/1.19.0-SNAPSHOT/reporting-omod-1.19.0-SNAPSHOT.pom
25-Oct-2019 22:41:43 [INFO] Installing /home/bamboo-agent/bamboo-agent/xml-data/build-dir/REP-REP-JOB1/omod/target/reporting-1.19.0-SNAPSHOT-tests.jar to /home/bamboo-agent/.m2/repository/org/openmrs/module/reporting-omod/1.19.0-SNAPSHOT/reporting-omod-1.19.0-SNAPSHOT-tests.jar
25-Oct-2019 22:41:43 [INFO]
25-Oct-2019 22:41:43 [INFO] --- maven-deploy-plugin:2.7:deploy (default-deploy) @ reporting-omod ---
25-Oct-2019 22:41:43 [INFO] Downloading: http://mavenrepo.openmrs.org/nexus/content/repositories/snapshots/org/openmrs/module/reporting-omod/1.19.0-SNAPSHOT/maven-metadata.xml
25-Oct-2019 22:41:44 [INFO] Downloaded: http://mavenrepo.openmrs.org/nexus/content/repositories/snapshots/org/openmrs/module/reporting-omod/1.19.0-SNAPSHOT/maven-metadata.xml (1002 B at 4.0 KB/sec)
25-Oct-2019 22:41:44 [INFO] Uploading: http://mavenrepo.openmrs.org/nexus/content/repositories/snapshots/org/openmrs/module/reporting-omod/1.19.0-SNAPSHOT/reporting-omod-1.19.0-20191025.224144-19.jar
25-Oct-2019 22:41:47 [INFO] Uploaded: http://mavenrepo.openmrs.org/nexus/content/repositories/snapshots/org/openmrs/module/reporting-omod/1.19.0-SNAPSHOT/reporting-omod-1.19.0-20191025.224144-19.jar (14264 KB at 4372.6 KB/sec)
25-Oct-2019 22:41:47 [INFO] Uploading: http://mavenrepo.openmrs.org/nexus/content/repositories/snapshots/org/openmrs/module/reporting-omod/1.19.0-SNAPSHOT/reporting-omod-1.19.0-20191025.224144-19.pom
25-Oct-2019 22:41:48 [INFO] Uploaded: http://mavenrepo.openmrs.org/nexus/content/repositories/snapshots/org/openmrs/module/reporting-omod/1.19.0-SNAPSHOT/reporting-omod-1.19.0-20191025.224144-19.pom (4 KB at 4.8 KB/sec)
25-Oct-2019 22:41:48 [INFO] Downloading: http://mavenrepo.openmrs.org/nexus/content/repositories/snapshots/org/openmrs/module/reporting-omod/maven-metadata.xml
25-Oct-2019 22:41:48 [INFO] Downloaded: http://mavenrepo.openmrs.org/nexus/content/repositories/snapshots/org/openmrs/module/reporting-omod/maven-metadata.xml (797 B at 3.1 KB/sec)
25-Oct-2019 22:41:48 [INFO] Uploading: http://mavenrepo.openmrs.org/nexus/content/repositories/snapshots/org/openmrs/module/reporting-omod/1.19.0-SNAPSHOT/maven-metadata.xml
25-Oct-2019 22:41:49 [INFO] Uploaded: http://mavenrepo.openmrs.org/nexus/content/repositories/snapshots/org/openmrs/module/reporting-omod/1.19.0-SNAPSHOT/maven-metadata.xml (1002 B at 0.6 KB/sec)
25-Oct-2019 22:41:49 [INFO] Uploading: http://mavenrepo.openmrs.org/nexus/content/repositories/snapshots/org/openmrs/module/reporting-omod/maven-metadata.xml
25-Oct-2019 22:41:50 [INFO] Uploaded: http://mavenrepo.openmrs.org/nexus/content/repositories/snapshots/org/openmrs/module/reporting-omod/maven-metadata.xml (739 B at 1.3 KB/sec)
25-Oct-2019 22:41:50 [INFO] Uploading: http://mavenrepo.openmrs.org/nexus/content/repositories/snapshots/org/openmrs/module/reporting-omod/1.19.0-SNAPSHOT/reporting-omod-1.19.0-20191025.224144-19-tests.jar
25-Oct-2019 22:41:51 [INFO] Uploaded: http://mavenrepo.openmrs.org/nexus/content/repositories/snapshots/org/openmrs/module/reporting-omod/1.19.0-SNAPSHOT/reporting-omod-1.19.0-20191025.224144-19-tests.jar (3 KB at 3.0 KB/sec)
25-Oct-2019 22:41:51 [INFO] Uploading: http://mavenrepo.openmrs.org/nexus/content/repositories/snapshots/org/openmrs/module/reporting-omod/1.19.0-SNAPSHOT/maven-metadata.xml
25-Oct-2019 22:41:51 [INFO] Uploaded: http://mavenrepo.openmrs.org/nexus/content/repositories/snapshots/org/openmrs/module/reporting-omod/1.19.0-SNAPSHOT/maven-metadata.xml (1002 B at 2.6 KB/sec)
25-Oct-2019 22:41:51 [INFO] ------------------------------------------------------------------------
25-Oct-2019 22:41:51 [INFO] Reactor Summary:
25-Oct-2019 22:41:51 [INFO]
25-Oct-2019 22:41:51 [INFO] Reporting .......................................... SUCCESS [  6.446 s]
25-Oct-2019 22:41:51 [INFO] Reporting API ...................................... SUCCESS [ 11.653 s]
25-Oct-2019 22:41:51 [INFO] reporting Module api 1.9 ........................... SUCCESS [  5.978 s]
25-Oct-2019 22:41:51 [INFO] reporting API Tests ................................ SUCCESS [03:28 min]
25-Oct-2019 22:41:51 [INFO] reporting Module api 1.10 .......................... SUCCESS [ 22.995 s]
25-Oct-2019 22:41:51 [INFO] reporting Module api 2.0 ........................... SUCCESS [  5.016 s]
25-Oct-2019 22:41:51 [INFO] reporting Module api 2.2 ........................... SUCCESS [ 20.438 s]
25-Oct-2019 22:41:51 [INFO] Reporting OMOD ..................................... SUCCESS [ 10.548 s]
25-Oct-2019 22:41:51 [INFO] ------------------------------------------------------------------------
25-Oct-2019 22:41:51 [INFO] BUILD SUCCESS
25-Oct-2019 22:41:51 [INFO] ------------------------------------------------------------------------
25-Oct-2019 22:41:51 [INFO] Total time: 04:51 min
25-Oct-2019 22:41:51 [INFO] Finished at: 2019-10-25T22:41:51+00:00
25-Oct-2019 22:41:52 [INFO] Final Memory: 61M/401M
25-Oct-2019 22:41:52 [INFO] ------------------------------------------------------------------------
25-Oct-2019 22:41:52 Parsing test results under /home/bamboo-agent/bamboo-agent/xml-data/build-dir/REP-REP-JOB1...
25-Oct-2019 22:41:52 Finished task 'Test and deploy' with result: Success
25-Oct-2019 22:41:52 Running post build plugin 'Docker Container Cleanup'
25-Oct-2019 22:41:52 Running post build plugin 'NCover Results Collector'
25-Oct-2019 22:41:52 Running post build plugin 'Clover Results Collector'
25-Oct-2019 22:41:52 Running post build plugin 'Sauce OnDemand Post Runner'
25-Oct-2019 22:41:52 Running post build plugin 'npm Cache Cleanup'
25-Oct-2019 22:41:52 Running post build plugin 'Artifact Copier'
25-Oct-2019 22:41:52 Finalising the build...
25-Oct-2019 22:41:52 Stopping timer.
25-Oct-2019 22:41:52 Build REP-REP-JOB1-795 completed.
25-Oct-2019 22:41:52 Running on server: post build plugin 'NCover Results Collector'
25-Oct-2019 22:41:52 Running on server: post build plugin 'Build Hanging Detection Configuration'
25-Oct-2019 22:41:52 Running on server: post build plugin 'Clover Delta Calculator'
25-Oct-2019 22:41:52 Running on server: post build plugin 'Maven Dependencies Postprocessor'
25-Oct-2019 22:41:52 All post build plugins have finished
25-Oct-2019 22:41:52 Generating build results summary...
25-Oct-2019 22:41:53 Saving build results to disk...
25-Oct-2019 22:41:53 Logging substituted variables...
25-Oct-2019 22:41:53 Indexing build results...
25-Oct-2019 22:41:53 Finished building REP-REP-JOB1-795.