More details of the release in https://wiki.openmrs.org/x/i4DTAw

Build: #795 was successful

Job: Test against 2.0 was successful

Build log

The build generated 1,714 lines of output.The output is too long and has been truncated to the last 1,000 lines. Download or view full build log

25-Oct-2019 22:33:29         at org.apache.maven.surefire.booter.SurefireBooter.runSuitesInProcess(SurefireBooter.java:350)
25-Oct-2019 22:33:29         at org.apache.maven.surefire.booter.SurefireBooter.main(SurefireBooter.java:1021)
25-Oct-2019 22:33:29 Caused by: org.h2.jdbc.JdbcSQLException: Method is only allowed for a query. Use execute or executeUpdate instead of executeQuery; SQL statement:
25-Oct-2019 22:33:29 update person set gender='F'  [90002-173]
25-Oct-2019 22:33:29         at org.h2.message.DbException.getJdbcSQLException(DbException.java:331)
25-Oct-2019 22:33:29         at org.h2.message.DbException.get(DbException.java:171)
25-Oct-2019 22:33:29         at org.h2.message.DbException.get(DbException.java:148)
25-Oct-2019 22:33:29         at org.h2.message.DbException.get(DbException.java:137)
25-Oct-2019 22:33:29         at org.h2.command.Prepared.query(Prepared.java:211)
25-Oct-2019 22:33:29         at org.h2.command.CommandContainer.query(CommandContainer.java:91)
25-Oct-2019 22:33:29         at org.h2.command.Command.executeQuery(Command.java:195)
25-Oct-2019 22:33:29         at org.h2.jdbc.JdbcPreparedStatement.executeQuery(JdbcPreparedStatement.java:106)
25-Oct-2019 22:33:29         at com.mchange.v2.c3p0.impl.NewProxyPreparedStatement.executeQuery(NewProxyPreparedStatement.java:116)
25-Oct-2019 22:33:29         at org.openmrs.module.reporting.evaluation.querybuilder.SqlQueryBuilder$2.execute(SqlQueryBuilder.java:159)
25-Oct-2019 22:33:29         at org.hibernate.jdbc.WorkExecutor.executeWork(WorkExecutor.java:54)
25-Oct-2019 22:33:29         at org.hibernate.internal.SessionImpl$2.accept(SessionImpl.java:2076)
25-Oct-2019 22:33:29         at org.hibernate.internal.SessionImpl$2.accept(SessionImpl.java:2073)
25-Oct-2019 22:33:29         at org.hibernate.engine.jdbc.internal.JdbcCoordinatorImpl.coordinateWork(JdbcCoordinatorImpl.java:313)
25-Oct-2019 22:33:29         ... 102 more
25-Oct-2019 22:33:29 ERROR - EvaluationProfiler.log(111) |2019-10-25 22:33:29,338| 415        2019-10-25 22:33:29.338        >        ERROR        EVALUATING_DEFINITION                        SqlCohortDefinition[query=update person set gender='F']: Unable to execute query
25-Oct-2019 22:33:29 java.lang.IllegalArgumentException: Unable to execute query
25-Oct-2019 22:33:29         at org.openmrs.module.reporting.evaluation.querybuilder.SqlQueryBuilder.evaluateToList(SqlQueryBuilder.java:184)
25-Oct-2019 22:33:29         at org.openmrs.module.reporting.evaluation.service.EvaluationServiceImpl.evaluateToList(EvaluationServiceImpl.java:45)
25-Oct-2019 22:33:29         at org.openmrs.module.reporting.evaluation.service.EvaluationServiceImpl.evaluateToList(EvaluationServiceImpl.java:55)
25-Oct-2019 22:33:29         at sun.reflect.GeneratedMethodAccessor287.invoke(Unknown Source)
25-Oct-2019 22:33:29         at sun.reflect.DelegatingMethodAccessorImpl.invoke(DelegatingMethodAccessorImpl.java:43)
25-Oct-2019 22:33:29         at java.lang.reflect.Method.invoke(Method.java:498)
25-Oct-2019 22:33:29         at org.springframework.aop.support.AopUtils.invokeJoinpointUsingReflection(AopUtils.java:317)
25-Oct-2019 22:33:29         at org.springframework.aop.framework.ReflectiveMethodInvocation.invokeJoinpoint(ReflectiveMethodInvocation.java:190)
25-Oct-2019 22:33:29         at org.springframework.aop.framework.ReflectiveMethodInvocation.proceed(ReflectiveMethodInvocation.java:157)
25-Oct-2019 22:33:29         at org.springframework.transaction.interceptor.TransactionInterceptor$1.proceedWithInvocation(TransactionInterceptor.java:99)
25-Oct-2019 22:33:29         at org.springframework.transaction.interceptor.TransactionAspectSupport.invokeWithinTransaction(TransactionAspectSupport.java:281)
25-Oct-2019 22:33:29         at org.springframework.transaction.interceptor.TransactionInterceptor.invoke(TransactionInterceptor.java:96)
25-Oct-2019 22:33:29         at org.springframework.aop.framework.ReflectiveMethodInvocation.proceed(ReflectiveMethodInvocation.java:179)
25-Oct-2019 22:33:29         at org.openmrs.aop.LoggingAdvice.invoke(LoggingAdvice.java:121)
25-Oct-2019 22:33:29         at org.springframework.aop.framework.ReflectiveMethodInvocation.proceed(ReflectiveMethodInvocation.java:179)
25-Oct-2019 22:33:29         at org.springframework.aop.framework.adapter.MethodBeforeAdviceInterceptor.invoke(MethodBeforeAdviceInterceptor.java:52)
25-Oct-2019 22:33:29         at org.springframework.aop.framework.ReflectiveMethodInvocation.proceed(ReflectiveMethodInvocation.java:179)
25-Oct-2019 22:33:29         at org.springframework.aop.framework.adapter.MethodBeforeAdviceInterceptor.invoke(MethodBeforeAdviceInterceptor.java:52)
25-Oct-2019 22:33:29         at org.springframework.aop.framework.ReflectiveMethodInvocation.proceed(ReflectiveMethodInvocation.java:179)
25-Oct-2019 22:33:29         at org.springframework.aop.framework.JdkDynamicAopProxy.invoke(JdkDynamicAopProxy.java:207)
25-Oct-2019 22:33:29         at com.sun.proxy.$Proxy28.evaluateToList(Unknown Source)
25-Oct-2019 22:33:29         at sun.reflect.GeneratedMethodAccessor287.invoke(Unknown Source)
25-Oct-2019 22:33:29         at sun.reflect.DelegatingMethodAccessorImpl.invoke(DelegatingMethodAccessorImpl.java:43)
25-Oct-2019 22:33:29         at java.lang.reflect.Method.invoke(Method.java:498)
25-Oct-2019 22:33:29         at org.springframework.aop.support.AopUtils.invokeJoinpointUsingReflection(AopUtils.java:317)
25-Oct-2019 22:33:29         at org.springframework.aop.framework.ReflectiveMethodInvocation.invokeJoinpoint(ReflectiveMethodInvocation.java:190)
25-Oct-2019 22:33:29         at org.springframework.aop.framework.ReflectiveMethodInvocation.proceed(ReflectiveMethodInvocation.java:157)
25-Oct-2019 22:33:29         at org.springframework.transaction.interceptor.TransactionInterceptor$1.proceedWithInvocation(TransactionInterceptor.java:99)
25-Oct-2019 22:33:29         at org.springframework.transaction.interceptor.TransactionAspectSupport.invokeWithinTransaction(TransactionAspectSupport.java:281)
25-Oct-2019 22:33:29         at org.springframework.transaction.interceptor.TransactionInterceptor.invoke(TransactionInterceptor.java:96)
25-Oct-2019 22:33:29         at org.springframework.aop.framework.ReflectiveMethodInvocation.proceed(ReflectiveMethodInvocation.java:179)
25-Oct-2019 22:33:29         at org.springframework.aop.framework.JdkDynamicAopProxy.invoke(JdkDynamicAopProxy.java:207)
25-Oct-2019 22:33:29         at com.sun.proxy.$Proxy132.evaluateToList(Unknown Source)
25-Oct-2019 22:33:29         at org.openmrs.module.reporting.cohort.definition.evaluator.SqlCohortDefinitionEvaluator.evaluate(SqlCohortDefinitionEvaluator.java:61)
25-Oct-2019 22:33:29         at org.openmrs.module.reporting.cohort.definition.evaluator.SqlCohortDefinitionEvaluator.evaluate(SqlCohortDefinitionEvaluator.java:28)
25-Oct-2019 22:33:29         at org.openmrs.module.reporting.definition.service.BaseDefinitionService.executeEvaluator(BaseDefinitionService.java:369)
25-Oct-2019 22:33:29         at org.openmrs.module.reporting.definition.service.BaseDefinitionService.evaluateBypassingExclusionOfTestPatients(BaseDefinitionService.java:264)
25-Oct-2019 22:33:29         at org.openmrs.module.reporting.cohort.definition.service.CohortDefinitionServiceImpl.evaluateBypassingExclusionOfTestPatients(CohortDefinitionServiceImpl.java:54)
25-Oct-2019 22:33:29         at org.openmrs.module.reporting.cohort.definition.service.CohortDefinitionServiceImpl.evaluateBypassingExclusionOfTestPatients(CohortDefinitionServiceImpl.java:24)
25-Oct-2019 22:33:29         at org.openmrs.module.reporting.definition.service.BaseDefinitionService.evaluate(BaseDefinitionService.java:229)
25-Oct-2019 22:33:29         at org.openmrs.module.reporting.cohort.definition.service.CohortDefinitionServiceImpl.evaluate(CohortDefinitionServiceImpl.java:38)
25-Oct-2019 22:33:29         at sun.reflect.GeneratedMethodAccessor286.invoke(Unknown Source)
25-Oct-2019 22:33:29         at sun.reflect.DelegatingMethodAccessorImpl.invoke(DelegatingMethodAccessorImpl.java:43)
25-Oct-2019 22:33:29         at java.lang.reflect.Method.invoke(Method.java:498)
25-Oct-2019 22:33:29         at org.springframework.aop.support.AopUtils.invokeJoinpointUsingReflection(AopUtils.java:317)
25-Oct-2019 22:33:29         at org.springframework.aop.framework.ReflectiveMethodInvocation.invokeJoinpoint(ReflectiveMethodInvocation.java:190)
25-Oct-2019 22:33:29         at org.springframework.aop.framework.ReflectiveMethodInvocation.proceed(ReflectiveMethodInvocation.java:157)
25-Oct-2019 22:33:29         at org.openmrs.aop.LoggingAdvice.invoke(LoggingAdvice.java:121)
25-Oct-2019 22:33:29         at org.springframework.aop.framework.ReflectiveMethodInvocation.proceed(ReflectiveMethodInvocation.java:179)
25-Oct-2019 22:33:29         at org.springframework.aop.framework.adapter.MethodBeforeAdviceInterceptor.invoke(MethodBeforeAdviceInterceptor.java:52)
25-Oct-2019 22:33:29         at org.springframework.aop.framework.ReflectiveMethodInvocation.proceed(ReflectiveMethodInvocation.java:179)
25-Oct-2019 22:33:29         at org.springframework.aop.framework.adapter.MethodBeforeAdviceInterceptor.invoke(MethodBeforeAdviceInterceptor.java:52)
25-Oct-2019 22:33:29         at org.springframework.aop.framework.ReflectiveMethodInvocation.proceed(ReflectiveMethodInvocation.java:179)
25-Oct-2019 22:33:29         at org.springframework.aop.framework.JdkDynamicAopProxy.invoke(JdkDynamicAopProxy.java:207)
25-Oct-2019 22:33:29         at com.sun.proxy.$Proxy39.evaluate(Unknown Source)
25-Oct-2019 22:33:29         at sun.reflect.GeneratedMethodAccessor286.invoke(Unknown Source)
25-Oct-2019 22:33:29         at sun.reflect.DelegatingMethodAccessorImpl.invoke(DelegatingMethodAccessorImpl.java:43)
25-Oct-2019 22:33:29         at java.lang.reflect.Method.invoke(Method.java:498)
25-Oct-2019 22:33:29         at org.springframework.aop.support.AopUtils.invokeJoinpointUsingReflection(AopUtils.java:317)
25-Oct-2019 22:33:29         at org.springframework.aop.framework.JdkDynamicAopProxy.invoke(JdkDynamicAopProxy.java:201)
25-Oct-2019 22:33:29         at com.sun.proxy.$Proxy134.evaluate(Unknown Source)
25-Oct-2019 22:33:29         at org.openmrs.module.reporting.cohort.definition.evaluator.SqlCohortDefinitionEvaluatorTest.shouldProtectSqlQueryAgainstDatabaseModifications(SqlCohortDefinitionEvaluatorTest.java:308)
25-Oct-2019 22:33:29         at sun.reflect.NativeMethodAccessorImpl.invoke0(Native Method)
25-Oct-2019 22:33:29         at sun.reflect.NativeMethodAccessorImpl.invoke(NativeMethodAccessorImpl.java:62)
25-Oct-2019 22:33:29         at sun.reflect.DelegatingMethodAccessorImpl.invoke(DelegatingMethodAccessorImpl.java:43)
25-Oct-2019 22:33:29         at java.lang.reflect.Method.invoke(Method.java:498)
25-Oct-2019 22:33:29         at org.junit.runners.model.FrameworkMethod$1.runReflectiveCall(FrameworkMethod.java:47)
25-Oct-2019 22:33:29         at org.junit.internal.runners.model.ReflectiveCallable.run(ReflectiveCallable.java:12)
25-Oct-2019 22:33:29         at org.junit.runners.model.FrameworkMethod.invokeExplosively(FrameworkMethod.java:44)
25-Oct-2019 22:33:29         at org.junit.internal.runners.statements.InvokeMethod.evaluate(InvokeMethod.java:17)
25-Oct-2019 22:33:29         at org.junit.internal.runners.statements.ExpectException.evaluate(ExpectException.java:19)
25-Oct-2019 22:33:29         at org.junit.internal.runners.statements.RunBefores.evaluate(RunBefores.java:26)
25-Oct-2019 22:33:29         at org.springframework.test.context.junit4.statements.RunBeforeTestMethodCallbacks.evaluate(RunBeforeTestMethodCallbacks.java:73)
25-Oct-2019 22:33:29         at org.junit.internal.runners.statements.RunAfters.evaluate(RunAfters.java:27)
25-Oct-2019 22:33:29         at org.springframework.test.context.junit4.statements.RunAfterTestMethodCallbacks.evaluate(RunAfterTestMethodCallbacks.java:82)
25-Oct-2019 22:33:29         at org.springframework.test.context.junit4.statements.SpringRepeat.evaluate(SpringRepeat.java:73)
25-Oct-2019 22:33:29         at org.junit.runners.ParentRunner.runLeaf(ParentRunner.java:271)
25-Oct-2019 22:33:29         at org.springframework.test.context.junit4.SpringJUnit4ClassRunner.runChild(SpringJUnit4ClassRunner.java:217)
25-Oct-2019 22:33:29         at org.springframework.test.context.junit4.SpringJUnit4ClassRunner.runChild(SpringJUnit4ClassRunner.java:83)
25-Oct-2019 22:33:29         at org.junit.runners.ParentRunner$3.run(ParentRunner.java:238)
25-Oct-2019 22:33:29         at org.junit.runners.ParentRunner$1.schedule(ParentRunner.java:63)
25-Oct-2019 22:33:29         at org.junit.runners.ParentRunner.runChildren(ParentRunner.java:236)
25-Oct-2019 22:33:29         at org.junit.runners.ParentRunner.access$000(ParentRunner.java:53)
25-Oct-2019 22:33:29         at org.junit.runners.ParentRunner$2.evaluate(ParentRunner.java:229)
25-Oct-2019 22:33:29         at org.springframework.test.context.junit4.statements.RunBeforeTestClassCallbacks.evaluate(RunBeforeTestClassCallbacks.java:61)
25-Oct-2019 22:33:29         at org.junit.internal.runners.statements.RunAfters.evaluate(RunAfters.java:27)
25-Oct-2019 22:33:29         at org.springframework.test.context.junit4.statements.RunAfterTestClassCallbacks.evaluate(RunAfterTestClassCallbacks.java:68)
25-Oct-2019 22:33:29         at org.junit.runners.ParentRunner.run(ParentRunner.java:309)
25-Oct-2019 22:33:29         at org.springframework.test.context.junit4.SpringJUnit4ClassRunner.run(SpringJUnit4ClassRunner.java:163)
25-Oct-2019 22:33:29         at org.apache.maven.surefire.junit4.JUnit4TestSet.execute(JUnit4TestSet.java:59)
25-Oct-2019 22:33:29         at org.apache.maven.surefire.suite.AbstractDirectoryTestSuite.executeTestSet(AbstractDirectoryTestSuite.java:115)
25-Oct-2019 22:33:29         at org.apache.maven.surefire.suite.AbstractDirectoryTestSuite.execute(AbstractDirectoryTestSuite.java:102)
25-Oct-2019 22:33:29         at org.apache.maven.surefire.Surefire.run(Surefire.java:180)
25-Oct-2019 22:33:29         at sun.reflect.NativeMethodAccessorImpl.invoke0(Native Method)
25-Oct-2019 22:33:29         at sun.reflect.NativeMethodAccessorImpl.invoke(NativeMethodAccessorImpl.java:62)
25-Oct-2019 22:33:29         at sun.reflect.DelegatingMethodAccessorImpl.invoke(DelegatingMethodAccessorImpl.java:43)
25-Oct-2019 22:33:29         at java.lang.reflect.Method.invoke(Method.java:498)
25-Oct-2019 22:33:29         at org.apache.maven.surefire.booter.SurefireBooter.runSuitesInProcess(SurefireBooter.java:350)
25-Oct-2019 22:33:29         at org.apache.maven.surefire.booter.SurefireBooter.main(SurefireBooter.java:1021)
25-Oct-2019 22:33:29 Caused by: org.hibernate.exception.GenericJDBCException: error executing work
25-Oct-2019 22:33:29         at org.hibernate.exception.internal.StandardSQLExceptionConverter.convert(StandardSQLExceptionConverter.java:54)
25-Oct-2019 22:33:29         at org.hibernate.engine.jdbc.spi.SqlExceptionHelper.convert(SqlExceptionHelper.java:126)
25-Oct-2019 22:33:29         at org.hibernate.engine.jdbc.spi.SqlExceptionHelper.convert(SqlExceptionHelper.java:112)
25-Oct-2019 22:33:29         at org.hibernate.engine.jdbc.internal.JdbcCoordinatorImpl.coordinateWork(JdbcCoordinatorImpl.java:318)
25-Oct-2019 22:33:29         at org.hibernate.internal.SessionImpl.doWork(SessionImpl.java:2095)
25-Oct-2019 22:33:29         at org.hibernate.internal.SessionImpl.doWork(SessionImpl.java:2080)
25-Oct-2019 22:33:29         at org.openmrs.api.db.hibernate.DbSession.doWork(DbSession.java:1005)
25-Oct-2019 22:33:29         at org.openmrs.module.reporting.evaluation.querybuilder.SqlQueryBuilder.evaluateToList(SqlQueryBuilder.java:152)
25-Oct-2019 22:33:29         ... 98 more
25-Oct-2019 22:33:29 Caused by: org.h2.jdbc.JdbcSQLException: Method is only allowed for a query. Use execute or executeUpdate instead of executeQuery; SQL statement:
25-Oct-2019 22:33:29 update person set gender='F'  [90002-173]
25-Oct-2019 22:33:29         at org.h2.message.DbException.getJdbcSQLException(DbException.java:331)
25-Oct-2019 22:33:29         at org.h2.message.DbException.get(DbException.java:171)
25-Oct-2019 22:33:29         at org.h2.message.DbException.get(DbException.java:148)
25-Oct-2019 22:33:29         at org.h2.message.DbException.get(DbException.java:137)
25-Oct-2019 22:33:29         at org.h2.command.Prepared.query(Prepared.java:211)
25-Oct-2019 22:33:29         at org.h2.command.CommandContainer.query(CommandContainer.java:91)
25-Oct-2019 22:33:29         at org.h2.command.Command.executeQuery(Command.java:195)
25-Oct-2019 22:33:29         at org.h2.jdbc.JdbcPreparedStatement.executeQuery(JdbcPreparedStatement.java:106)
25-Oct-2019 22:33:29         at com.mchange.v2.c3p0.impl.NewProxyPreparedStatement.executeQuery(NewProxyPreparedStatement.java:116)
25-Oct-2019 22:33:29         at org.openmrs.module.reporting.evaluation.querybuilder.SqlQueryBuilder$2.execute(SqlQueryBuilder.java:159)
25-Oct-2019 22:33:29         at org.hibernate.jdbc.WorkExecutor.executeWork(WorkExecutor.java:54)
25-Oct-2019 22:33:29         at org.hibernate.internal.SessionImpl$2.accept(SessionImpl.java:2076)
25-Oct-2019 22:33:29         at org.hibernate.internal.SessionImpl$2.accept(SessionImpl.java:2073)
25-Oct-2019 22:33:29         at org.hibernate.engine.jdbc.internal.JdbcCoordinatorImpl.coordinateWork(JdbcCoordinatorImpl.java:313)
25-Oct-2019 22:33:29         ... 102 more
25-Oct-2019 22:33:29 Tests run: 13, Failures: 0, Errors: 0, Skipped: 0, Time elapsed: 1.626 sec
25-Oct-2019 22:33:29 Running org.openmrs.module.reporting.evaluation.service.EvaluationServiceTest
25-Oct-2019 22:33:31 Tests run: 6, Failures: 0, Errors: 0, Skipped: 0, Time elapsed: 1.79 sec
25-Oct-2019 22:33:31 Running org.openmrs.module.reporting.data.obs.evaluator.EncounterToObsDataEvaluatorTest
25-Oct-2019 22:33:31 Tests run: 3, Failures: 0, Errors: 0, Skipped: 0, Time elapsed: 0.393 sec
25-Oct-2019 22:33:31 Running org.openmrs.module.reporting.query.encounter.evaluator.MappedParametersEncounterQueryEvaluatorTest
25-Oct-2019 22:33:32 Tests run: 1, Failures: 0, Errors: 0, Skipped: 0, Time elapsed: 0.134 sec
25-Oct-2019 22:33:32 Running org.openmrs.module.reporting.validator.InStateCohortDefinitionValidatorTest
25-Oct-2019 22:33:32 Tests run: 3, Failures: 0, Errors: 0, Skipped: 0, Time elapsed: 0.034 sec
25-Oct-2019 22:33:32 Running org.openmrs.module.reporting.common.ReflectionUtilTest
25-Oct-2019 22:33:32 Tests run: 6, Failures: 0, Errors: 0, Skipped: 0, Time elapsed: 0.003 sec
25-Oct-2019 22:33:32 Running org.openmrs.module.reporting.template.HandlebarsHelpersTest
25-Oct-2019 22:33:32 Tests run: 3, Failures: 0, Errors: 0, Skipped: 0, Time elapsed: 0.169 sec
25-Oct-2019 22:33:32 Running org.openmrs.module.reporting.data.visit.evaluator.VisitIdDataEvaluatorTest
25-Oct-2019 22:33:32 Tests run: 2, Failures: 0, Errors: 0, Skipped: 0, Time elapsed: 0.266 sec
25-Oct-2019 22:33:32 Running org.openmrs.module.reporting.cohort.definition.evaluator.ConditionalParameterCohortDefinitionEvaluatorTest
25-Oct-2019 22:33:32 Tests run: 1, Failures: 0, Errors: 0, Skipped: 0, Time elapsed: 0.144 sec
25-Oct-2019 22:33:32 Running org.openmrs.module.reporting.data.patient.evaluator.CurrentPatientStateDataEvaluatorTest
25-Oct-2019 22:33:32 Tests run: 1, Failures: 0, Errors: 0, Skipped: 0, Time elapsed: 0.153 sec
25-Oct-2019 22:33:32 Running org.openmrs.module.reporting.data.encounter.evaluator.ObsOnSameDateEncounterDataEvaluatorTest
25-Oct-2019 22:33:33 Tests run: 3, Failures: 0, Errors: 0, Skipped: 0, Time elapsed: 0.535 sec
25-Oct-2019 22:33:33 Running org.openmrs.module.reporting.cohort.query.service.CohortQueryServiceTest
25-Oct-2019 22:33:33 Tests run: 1, Failures: 0, Errors: 0, Skipped: 0, Time elapsed: 0.122 sec
25-Oct-2019 22:33:33 Running org.openmrs.module.reporting.data.person.evaluator.ObsForPersonDataEvaluatorTest
25-Oct-2019 22:33:33 Tests run: 3, Failures: 0, Errors: 0, Skipped: 0, Time elapsed: 0.478 sec
25-Oct-2019 22:33:33 Running org.openmrs.module.reporting.validator.StaticCohortDefinitionValidatorTest
25-Oct-2019 22:33:33 Tests run: 1, Failures: 0, Errors: 0, Skipped: 0, Time elapsed: 0.017 sec
25-Oct-2019 22:33:33 Running org.openmrs.module.reporting.dataset.definition.evaluator.EncounterDataSetEvaluatorTest
25-Oct-2019 22:33:34 ENCOUNTER ID        EMR ID        BIRTHDATE           ENCOUNTER DATE        Age At Start        Age At End        
25-Oct-2019 22:33:34 ------------        ------        ------------        --------------        ------------        ----------        
25-Oct-2019 22:33:34 3                   7             ~25/Aug/1976        01/Aug/2008           33                  34                
25-Oct-2019 22:33:34 4                   7             ~25/Aug/1976        15/Aug/2008           33                  34                
25-Oct-2019 22:33:34 5                   7             ~25/Aug/1976        19/Aug/2008           33                  34                
25-Oct-2019 22:33:34 6                   20            08/Feb/1925         19/Aug/2009           80                  80                
25-Oct-2019 22:33:34 7                   21            ~08/Jun/1959        19/Aug/2009           50                  51                
25-Oct-2019 22:33:34 8                   21            ~08/Jun/1959        19/Sep/2009           50                  51                
25-Oct-2019 22:33:34 9                   22            08/Jul/1997         19/Sep/2009           12                  13                
25-Oct-2019 22:33:34 10                  22            08/Jul/1997         19/Oct/2009           12                  13                
25-Oct-2019 22:33:34 11                  23            08/Nov/2000         19/Aug/2009           9                   10                
25-Oct-2019 22:33:34 12                  24            08/Dec/2006         19/Sep/2009           3                   4                 
25-Oct-2019 22:33:34 Tests run: 1, Failures: 0, Errors: 0, Skipped: 0, Time elapsed: 0.194 sec
25-Oct-2019 22:33:34 Running org.openmrs.module.reporting.data.person.evaluator.BirthdateDataEvaluatorTest
25-Oct-2019 22:33:34 Tests run: 1, Failures: 0, Errors: 0, Skipped: 0, Time elapsed: 0.114 sec
25-Oct-2019 22:33:34 Running org.openmrs.module.reporting.cohort.definition.evaluator.EncounterCohortDefinitionEvaluatorTest
25-Oct-2019 22:33:35 Tests run: 9, Failures: 0, Errors: 0, Skipped: 2, Time elapsed: 0.909 sec
25-Oct-2019 22:33:35 Running org.openmrs.module.reporting.data.person.evaluator.PreferredAddressDataEvaluatorTest
25-Oct-2019 22:33:35 Tests run: 1, Failures: 0, Errors: 0, Skipped: 0, Time elapsed: 0.137 sec
25-Oct-2019 22:33:35 Running org.openmrs.module.reporting.cohort.definition.evaluator.GenderCohortDefinitionEvaluatorTest
25-Oct-2019 22:33:35 Tests run: 5, Failures: 0, Errors: 0, Skipped: 0, Time elapsed: 0.68 sec
25-Oct-2019 22:33:35 Running org.openmrs.module.reporting.data.converter.BirthdateConverterTest
25-Oct-2019 22:33:36 Tests run: 1, Failures: 0, Errors: 0, Skipped: 0, Time elapsed: 0.015 sec
25-Oct-2019 22:33:36 Running org.openmrs.module.reporting.data.patient.evaluator.ProgramStatesForPatientDataEvaluatorTest
25-Oct-2019 22:33:37 Tests run: 9, Failures: 0, Errors: 0, Skipped: 0, Time elapsed: 1.268 sec
25-Oct-2019 22:33:37 Running org.openmrs.module.reporting.data.visit.library.BuiltInVisitDataLibraryTest
25-Oct-2019 22:33:37 Tests run: 1, Failures: 0, Errors: 0, Skipped: 0, Time elapsed: 0.044 sec
25-Oct-2019 22:33:37 Running org.openmrs.module.reporting.cohort.definition.evaluator.AgeCohortDefinitionEvaluatorTest
25-Oct-2019 22:33:37 Tests run: 5, Failures: 0, Errors: 0, Skipped: 0, Time elapsed: 0.259 sec
25-Oct-2019 22:33:37 Running org.openmrs.module.reporting.data.encounter.evaluator.EncounterLocationDataEvaluatorTest
25-Oct-2019 22:33:37 Tests run: 3, Failures: 0, Errors: 0, Skipped: 0, Time elapsed: 0.374 sec
25-Oct-2019 22:33:37 Running org.openmrs.module.reporting.data.obs.evaluator.PersonToObsEvaluatorTest
25-Oct-2019 22:33:38 Tests run: 3, Failures: 0, Errors: 0, Skipped: 0, Time elapsed: 0.378 sec
25-Oct-2019 22:33:38 Running org.openmrs.module.reporting.common.DateRangeTest
25-Oct-2019 22:33:38 Tests run: 9, Failures: 0, Errors: 0, Skipped: 0, Time elapsed: 0.011 sec
25-Oct-2019 22:33:38 Running org.openmrs.module.reporting.cohort.definition.evaluator.NumericObsCohortDefinitionEvaluatorTest
25-Oct-2019 22:33:39 Tests run: 11, Failures: 0, Errors: 0, Skipped: 0, Time elapsed: 1.418 sec
25-Oct-2019 22:33:39 Running org.openmrs.module.reporting.indicator.QueryCountIndicatorEvaluatorTest
25-Oct-2019 22:33:40 Tests run: 3, Failures: 0, Errors: 0, Skipped: 0, Time elapsed: 0.48 sec
25-Oct-2019 22:33:40 Running org.openmrs.module.reporting.data.encounter.evaluator.ObsForEncounterEvaluatorTest
25-Oct-2019 22:33:41 Tests run: 7, Failures: 0, Errors: 0, Skipped: 0, Time elapsed: 1.216 sec
25-Oct-2019 22:33:41 Running org.openmrs.module.reporting.common.DateUtilTest
25-Oct-2019 22:33:41 Tests run: 15, Failures: 0, Errors: 0, Skipped: 0, Time elapsed: 0.084 sec
25-Oct-2019 22:33:41 Running org.openmrs.module.reporting.data.patient.evaluator.DrugOrdersForPatientDataEvaluatorTest
25-Oct-2019 22:33:43 Tests run: 8, Failures: 0, Errors: 0, Skipped: 0, Time elapsed: 1.906 sec
25-Oct-2019 22:33:43 Running org.openmrs.module.reporting.query.encounter.evaluator.MappedParametersObsQueryEvaluatorTest
25-Oct-2019 22:33:44 Tests run: 1, Failures: 0, Errors: 0, Skipped: 0, Time elapsed: 0.577 sec
25-Oct-2019 22:33:44 Running org.openmrs.module.reporting.serializer.ReportingSerializerTest
25-Oct-2019 22:33:44 Tests run: 6, Failures: 0, Errors: 0, Skipped: 0, Time elapsed: 0.165 sec
25-Oct-2019 22:33:44 Running org.openmrs.module.reporting.dataset.definition.evaluator.CohortCrossTabDataSetEvaluatorTest
25-Oct-2019 22:33:44 Tests run: 1, Failures: 0, Errors: 0, Skipped: 0, Time elapsed: 0.148 sec
25-Oct-2019 22:33:44 Running org.openmrs.module.reporting.query.person.service.PersonQueryServiceImplTest
25-Oct-2019 22:33:44 Tests run: 2, Failures: 0, Errors: 0, Skipped: 0, Time elapsed: 0.299 sec
25-Oct-2019 22:33:44 Running org.openmrs.module.reporting.dataset.definition.evaluator.MySqlDataSetEvaluatorTest
25-Oct-2019 22:33:44 Tests run: 1, Failures: 0, Errors: 0, Skipped: 1, Time elapsed: 0.001 sec
25-Oct-2019 22:33:44 Running org.openmrs.module.reporting.report.renderer.TextTemplateRendererTest
25-Oct-2019 22:33:45 Tests run: 3, Failures: 0, Errors: 0, Skipped: 0, Time elapsed: 1.052 sec
25-Oct-2019 22:33:45 Running org.openmrs.module.reporting.validator.InverseCohortDefinitionValidatorTest
25-Oct-2019 22:33:45 Tests run: 2, Failures: 0, Errors: 0, Skipped: 0, Time elapsed: 0.023 sec
25-Oct-2019 22:33:45 Running org.openmrs.module.reporting.validator.PatientStateCohortDefinitionValidatorTest
25-Oct-2019 22:33:45 Tests run: 3, Failures: 0, Errors: 0, Skipped: 0, Time elapsed: 0.05 sec
25-Oct-2019 22:33:45 Running org.openmrs.module.reporting.report.service.db.PropertiesTypeTest
25-Oct-2019 22:33:45 Tests run: 1, Failures: 0, Errors: 0, Skipped: 0, Time elapsed: 0.002 sec
25-Oct-2019 22:33:45 Running org.openmrs.module.reporting.query.encounter.evaluator.ObsForEncounterQueryEvaluatorTest
25-Oct-2019 22:33:46 Tests run: 8, Failures: 0, Errors: 0, Skipped: 0, Time elapsed: 1.088 sec
25-Oct-2019 22:33:46 Running org.openmrs.module.reporting.data.encounter.service.EncounterDataServiceImplTest
25-Oct-2019 22:33:47 Tests run: 2, Failures: 0, Errors: 0, Skipped: 0, Time elapsed: 0.225 sec
25-Oct-2019 22:33:47 Running org.openmrs.module.reporting.cohort.definition.evaluator.MappedParametersCohortDefinitionEvaluatorTest
25-Oct-2019 22:33:47 Tests run: 1, Failures: 0, Errors: 0, Skipped: 0, Time elapsed: 0.124 sec
25-Oct-2019 22:33:47 Running org.openmrs.module.reporting.data.encounter.evaluator.ConvertedEncounterDataEvaluatorTest
25-Oct-2019 22:33:47 Tests run: 1, Failures: 0, Errors: 0, Skipped: 0, Time elapsed: 0.116 sec
25-Oct-2019 22:33:47 Running org.openmrs.module.reporting.data.patient.evaluator.PatientIdentifierDataEvaluatorTest
25-Oct-2019 22:33:47 Tests run: 4, Failures: 0, Errors: 0, Skipped: 0, Time elapsed: 0.441 sec
25-Oct-2019 22:33:47 Running org.openmrs.module.reporting.data.converter.ListConverterTest
25-Oct-2019 22:33:47 Tests run: 6, Failures: 0, Errors: 0, Skipped: 0, Time elapsed: 0.003 sec
25-Oct-2019 22:33:47 Running org.openmrs.module.reporting.data.converter.ObsFromObsGroupConverterTest
25-Oct-2019 22:33:47 Tests run: 2, Failures: 0, Errors: 0, Skipped: 0, Time elapsed: 0.043 sec
25-Oct-2019 22:33:47 Running org.openmrs.module.reporting.common.AgeTest
25-Oct-2019 22:33:47 Tests run: 5, Failures: 0, Errors: 0, Skipped: 0, Time elapsed: 0.007 sec
25-Oct-2019 22:33:47 Running org.openmrs.module.reporting.evaluation.CachingCohortDefinitionTest
25-Oct-2019 22:33:47 Tests run: 1, Failures: 0, Errors: 0, Skipped: 0, Time elapsed: 0.152 sec
25-Oct-2019 22:33:47 Running org.openmrs.module.reporting.common.TestUtil
25-Oct-2019 22:33:47 Tests run: 1, Failures: 0, Errors: 0, Skipped: 1, Time elapsed: 0.001 sec
25-Oct-2019 22:33:47 Running org.openmrs.module.reporting.query.encounter.evaluator.CompositionEncounterQueryEvaluatorTest
25-Oct-2019 22:33:48 Tests run: 4, Failures: 0, Errors: 0, Skipped: 0, Time elapsed: 0.555 sec
25-Oct-2019 22:33:48 Running org.openmrs.module.reporting.definition.library.implementerconfigured.ImplementerConfiguredVisitDataDefinitionLibraryTest
25-Oct-2019 22:33:48 Tests run: 2, Failures: 0, Errors: 0, Skipped: 0, Time elapsed: 0.046 sec
25-Oct-2019 22:33:48 Running org.openmrs.module.reporting.common.ObjectUtilTest
25-Oct-2019 22:33:49 Tests run: 23, Failures: 0, Errors: 0, Skipped: 0, Time elapsed: 0.724 sec
25-Oct-2019 22:33:49 Running org.openmrs.module.reporting.data.person.evaluator.AgeDataEvaluatorTest
25-Oct-2019 22:33:49 Tests run: 2, Failures: 0, Errors: 0, Skipped: 0, Time elapsed: 0.278 sec
25-Oct-2019 22:33:49 Running org.openmrs.module.reporting.evaluation.querybuilder.HqlQueryBuilderTest
25-Oct-2019 22:33:53 Tests run: 39, Failures: 0, Errors: 0, Skipped: 0, Time elapsed: 4.425 sec
25-Oct-2019 22:33:53 Running org.openmrs.module.reporting.data.visit.evaluator.ObsForVisitDataEvaluatorTest
25-Oct-2019 22:33:54 Tests run: 2, Failures: 0, Errors: 0, Skipped: 0, Time elapsed: 0.255 sec
25-Oct-2019 22:33:54 Running org.openmrs.module.reporting.query.encounter.evaluator.MostRecentEncounterForPatientQueryEvaluatorTest
25-Oct-2019 22:33:54 Tests run: 1, Failures: 0, Errors: 0, Skipped: 0, Time elapsed: 0.118 sec
25-Oct-2019 22:33:54 Running org.openmrs.module.reporting.cohort.definition.evaluator.OptionalParameterCohortDefinitionEvaluatorTest
25-Oct-2019 22:33:54 Tests run: 1, Failures: 0, Errors: 0, Skipped: 0, Time elapsed: 0.12 sec
25-Oct-2019 22:33:54 Running org.openmrs.module.reporting.report.util.SqlUtilsTest
25-Oct-2019 22:33:54 Tests run: 3, Failures: 0, Errors: 0, Skipped: 0, Time elapsed: 0.002 sec
25-Oct-2019 22:33:54 Running org.openmrs.module.reporting.validator.InProgramCohortDefinitionValidatorTest
25-Oct-2019 22:33:54 Tests run: 3, Failures: 0, Errors: 0, Skipped: 0, Time elapsed: 0.032 sec
25-Oct-2019 22:33:54 Running org.openmrs.module.reporting.data.obs.evaluator.PatientToObsDataEvaluatorTest
25-Oct-2019 22:33:55 Tests run: 3, Failures: 0, Errors: 0, Skipped: 0, Time elapsed: 0.594 sec
25-Oct-2019 22:33:55 Running org.openmrs.module.reporting.definition.library.BaseDefinitionLibraryTest
25-Oct-2019 22:33:55 Tests run: 4, Failures: 0, Errors: 0, Skipped: 0, Time elapsed: 0.062 sec
25-Oct-2019 22:33:55 Running org.openmrs.module.reporting.data.person.evaluator.PersonAttributeDataEvaluatorTest
25-Oct-2019 22:33:55 Tests run: 1, Failures: 0, Errors: 0, Skipped: 0, Time elapsed: 0.254 sec
25-Oct-2019 22:33:55 Running org.openmrs.module.reporting.data.person.evaluator.PreferredNameDataEvaluatorTest
25-Oct-2019 22:33:55 Tests run: 3, Failures: 0, Errors: 0, Skipped: 0, Time elapsed: 0.422 sec
25-Oct-2019 22:33:55 Running org.openmrs.module.reporting.definition.library.implementerconfigured.ImplementerConfiguredCohortDefinitionLibraryTest
25-Oct-2019 22:33:56 Tests run: 3, Failures: 0, Errors: 0, Skipped: 0, Time elapsed: 0.19 sec
25-Oct-2019 22:33:56 Running org.openmrs.module.reporting.evaluation.parameter.ParameterUtilTest
25-Oct-2019 22:33:56 Tests run: 2, Failures: 0, Errors: 0, Skipped: 0, Time elapsed: 0.022 sec
25-Oct-2019 22:33:56 Running org.openmrs.module.reporting.data.encounter.library.BuiltInEncounterDataLibraryTest
25-Oct-2019 22:33:56 Tests run: 6, Failures: 0, Errors: 0, Skipped: 0, Time elapsed: 0.138 sec
25-Oct-2019 22:33:56 Running org.openmrs.module.reporting.cohort.definition.evaluator.ScriptedCohortDefinitionEvaluatorTest
25-Oct-2019 22:33:56 Tests run: 1, Failures: 0, Errors: 0, Skipped: 0, Time elapsed: 0.268 sec
25-Oct-2019 22:33:56 Running org.openmrs.module.reporting.data.converter.PersonNameConverterTest
25-Oct-2019 22:33:56 Tests run: 1, Failures: 0, Errors: 0, Skipped: 0, Time elapsed: 0.018 sec
25-Oct-2019 22:33:56 Running org.openmrs.module.reporting.definition.library.AllDefinitionLibrariesComponentTest
25-Oct-2019 22:33:56 Tests run: 2, Failures: 0, Errors: 0, Skipped: 0, Time elapsed: 0.028 sec
25-Oct-2019 22:33:56 Running org.openmrs.module.reporting.data.person.evaluator.VitalStatusDataEvaluatorTest
25-Oct-2019 22:33:56 Tests run: 1, Failures: 0, Errors: 0, Skipped: 0, Time elapsed: 0.156 sec
25-Oct-2019 22:33:56 Running org.openmrs.module.reporting.dataset.definition.evaluator.PatientDataSetEvaluatorTest
25-Oct-2019 22:33:57 Tests run: 8, Failures: 0, Errors: 0, Skipped: 0, Time elapsed: 0.978 sec
25-Oct-2019 22:33:57 Running org.openmrs.module.reporting.cohort.definition.evaluator.TextObsCohortDefinitionEvaluatorTest
25-Oct-2019 22:33:57 Tests run: 2, Failures: 0, Errors: 0, Skipped: 0, Time elapsed: 0.239 sec
25-Oct-2019 22:33:57 Running org.openmrs.module.reporting.data.encounter.evaluator.AuditInfoEncounterDataEvaluatorTest
25-Oct-2019 22:33:57 Tests run: 1, Failures: 0, Errors: 0, Skipped: 0, Time elapsed: 0.056 sec
25-Oct-2019 22:33:57 Running org.openmrs.module.reporting.data.patient.evaluator.LogicDataEvaluatorTest
25-Oct-2019 22:33:57 Tests run: 1, Failures: 0, Errors: 0, Skipped: 1, Time elapsed: 0.002 sec
25-Oct-2019 22:33:57 Running org.openmrs.module.reporting.data.visit.evaluator.PersonToVisitDataEvaluatorTest
25-Oct-2019 22:33:58 Tests run: 3, Failures: 0, Errors: 0, Skipped: 0, Time elapsed: 0.41 sec
25-Oct-2019 22:33:58 Running org.openmrs.module.reporting.cohort.definition.evaluator.DateObsCohortDefinitionEvaluatorTest
25-Oct-2019 22:33:58 Tests run: 3, Failures: 0, Errors: 0, Skipped: 0, Time elapsed: 0.455 sec
25-Oct-2019 22:33:58 Running org.openmrs.module.reporting.cohort.definition.evaluator.VisitCohortDefinitionEvaluatorTest
25-Oct-2019 22:33:59 Tests run: 13, Failures: 0, Errors: 0, Skipped: 0, Time elapsed: 0.339 sec
25-Oct-2019 22:33:59 Running org.openmrs.module.reporting.data.encounter.evaluator.AgeAtEncounterDataEvaluatorTest
25-Oct-2019 22:33:59 Tests run: 1, Failures: 0, Errors: 0, Skipped: 0, Time elapsed: 0.163 sec
25-Oct-2019 22:33:59 Running org.openmrs.module.reporting.indicator.CohortIndicatorDataSetEvaluatorTest
25-Oct-2019 22:33:59 Tests run: 1, Failures: 0, Errors: 0, Skipped: 0, Time elapsed: 0.151 sec
25-Oct-2019 22:33:59 Running org.openmrs.module.reporting.data.person.evaluator.ObsActiveListPersonDataEvaluatorTest
25-Oct-2019 22:33:59 Tests run: 1, Failures: 0, Errors: 0, Skipped: 0, Time elapsed: 0.192 sec
25-Oct-2019 22:33:59 Running org.openmrs.module.reporting.common.ExcelUtilTest
25-Oct-2019 22:34:00 Tests run: 5, Failures: 0, Errors: 0, Skipped: 0, Time elapsed: 0.457 sec
25-Oct-2019 22:34:00 Running org.openmrs.module.reporting.data.obs.evaluator.GroupMemberObsDataEvaluatorTest
25-Oct-2019 22:34:00 Tests run: 5, Failures: 0, Errors: 0, Skipped: 2, Time elapsed: 0.47 sec
25-Oct-2019 22:34:00 Running org.openmrs.module.reporting.query.visit.evaluator.BasicVisitQueryEvaluatorTest
25-Oct-2019 22:34:01 Tests run: 3, Failures: 0, Errors: 0, Skipped: 0, Time elapsed: 0.419 sec
25-Oct-2019 22:34:01 Running org.openmrs.module.reporting.common.ExcelBuilderTest
25-Oct-2019 22:34:03 Tests run: 3, Failures: 0, Errors: 0, Skipped: 0, Time elapsed: 2.783 sec
25-Oct-2019 22:34:03 Running org.openmrs.module.reporting.query.obs.evaluator.AllObsQueryEvaluatorTest
25-Oct-2019 22:34:04 Tests run: 5, Failures: 0, Errors: 0, Skipped: 0, Time elapsed: 0.594 sec
25-Oct-2019 22:34:04 Running org.openmrs.module.reporting.cohort.definition.evaluator.AllPatientsCohortDefinitionEvaluatorTest
25-Oct-2019 22:34:04 Tests run: 1, Failures: 0, Errors: 0, Skipped: 0, Time elapsed: 0.124 sec
25-Oct-2019 22:34:04 Running org.openmrs.module.reporting.data.encounter.evaluator.SimultaneousEncountersDataEvaluatorTest
25-Oct-2019 22:34:04 Tests run: 2, Failures: 0, Errors: 0, Skipped: 0, Time elapsed: 0.102 sec
25-Oct-2019 22:34:04 Running org.openmrs.module.reporting.validator.ProgramEnrollmentCohortDefinitionValidatorTest
25-Oct-2019 22:34:04 Tests run: 3, Failures: 0, Errors: 0, Skipped: 0, Time elapsed: 0.056 sec
25-Oct-2019 22:34:04 Running org.openmrs.module.reporting.evaluation.EvaluationContextTest
25-Oct-2019 22:34:04 Tests run: 4, Failures: 0, Errors: 0, Skipped: 0, Time elapsed: 0.053 sec
25-Oct-2019 22:34:04 Running org.openmrs.module.reporting.data.patient.evaluator.PreferredIdentifierDataEvaluatorTest
25-Oct-2019 22:34:04 Tests run: 2, Failures: 0, Errors: 0, Skipped: 0, Time elapsed: 0.235 sec
25-Oct-2019 22:34:04 Running org.openmrs.module.reporting.data.encounter.evaluator.EncounterVisitDataEvaluatorTest
25-Oct-2019 22:34:05 Tests run: 1, Failures: 0, Errors: 0, Skipped: 0, Time elapsed: 0.115 sec
25-Oct-2019 22:34:05 Running org.openmrs.module.reporting.query.obs.service.ObsQueryServiceImplTest
25-Oct-2019 22:34:05 Tests run: 2, Failures: 0, Errors: 0, Skipped: 1, Time elapsed: 0.129 sec
25-Oct-2019 22:34:05 Running org.openmrs.module.reporting.data.patient.library.BuiltInPatientDataLibraryTest
25-Oct-2019 22:34:05 Tests run: 4, Failures: 0, Errors: 0, Skipped: 0, Time elapsed: 0.088 sec
25-Oct-2019 22:34:05 Running org.openmrs.module.reporting.indicator.util.IndicatorUtilTest
25-Oct-2019 22:34:05 Tests run: 1, Failures: 0, Errors: 0, Skipped: 0, Time elapsed: 0.002 sec
25-Oct-2019 22:34:05 Running org.openmrs.module.reporting.cohort.definition.evaluator.EvaluatableCohortDefinitionEvaluatorTest
25-Oct-2019 22:34:05 Tests run: 1, Failures: 0, Errors: 0, Skipped: 0, Time elapsed: 0.018 sec
25-Oct-2019 22:34:05 Running org.openmrs.module.reporting.data.patient.evaluator.ConvertedPatientDataEvaluatorTest
25-Oct-2019 22:34:05 Tests run: 2, Failures: 0, Errors: 0, Skipped: 0, Time elapsed: 0.231 sec
25-Oct-2019 22:34:05 Running org.openmrs.module.reporting.cohort.definition.evaluator.CompositionCohortDefinitionEvaluatorTest
25-Oct-2019 22:34:06 Tests run: 4, Failures: 0, Errors: 0, Skipped: 0, Time elapsed: 0.562 sec
25-Oct-2019 22:34:06 Running org.openmrs.module.reporting.data.converter.MapConverterTest
25-Oct-2019 22:34:06 Tests run: 5, Failures: 0, Errors: 0, Skipped: 0, Time elapsed: 0.011 sec
25-Oct-2019 22:34:06 Running org.openmrs.module.reporting.data.patient.evaluator.EncountersForPatientDataEvaluatorTest
25-Oct-2019 22:34:06 Tests run: 1, Failures: 0, Errors: 0, Skipped: 0, Time elapsed: 0.199 sec
25-Oct-2019 22:34:06 Running org.openmrs.module.reporting.indicator.SqlIndicatorTest
25-Oct-2019 22:34:06 ERROR - EvaluationProfiler.log(111) |2019-10-25 22:34:06,947| 1336        2019-10-25 22:34:06.947        >        ERROR        EVALUATING_DEFINITION                        SqlIndicator[sql=SELECT distinct(.222) as res, 33 as res2 from patient]: Failed to evaluate sql because:
25-Oct-2019 22:34:06 Unable to evaluate to a single value. Exactly one column must be defined.
25-Oct-2019 22:34:06 org.openmrs.module.reporting.evaluation.EvaluationException: Failed to evaluate sql because:
25-Oct-2019 22:34:06 Unable to evaluate to a single value. Exactly one column must be defined.
25-Oct-2019 22:34:06         at org.openmrs.module.reporting.indicator.evaluator.SqlIndicatorEvaluator.evaluateSql(SqlIndicatorEvaluator.java:57)
25-Oct-2019 22:34:06         at org.openmrs.module.reporting.indicator.evaluator.SqlIndicatorEvaluator.evaluate(SqlIndicatorEvaluator.java:41)
25-Oct-2019 22:34:06         at org.openmrs.module.reporting.indicator.evaluator.SqlIndicatorEvaluator.evaluate(SqlIndicatorEvaluator.java:28)
25-Oct-2019 22:34:06         at org.openmrs.module.reporting.definition.service.BaseDefinitionService.executeEvaluator(BaseDefinitionService.java:369)
25-Oct-2019 22:34:06         at org.openmrs.module.reporting.definition.service.BaseDefinitionService.evaluateBypassingExclusionOfTestPatients(BaseDefinitionService.java:264)
25-Oct-2019 22:34:06         at org.openmrs.module.reporting.definition.service.BaseDefinitionService.evaluate(BaseDefinitionService.java:229)
25-Oct-2019 22:34:06         at org.openmrs.module.reporting.indicator.service.IndicatorServiceImpl.evaluate(IndicatorServiceImpl.java:41)
25-Oct-2019 22:34:06         at sun.reflect.NativeMethodAccessorImpl.invoke0(Native Method)
25-Oct-2019 22:34:06         at sun.reflect.NativeMethodAccessorImpl.invoke(NativeMethodAccessorImpl.java:62)
25-Oct-2019 22:34:06         at sun.reflect.DelegatingMethodAccessorImpl.invoke(DelegatingMethodAccessorImpl.java:43)
25-Oct-2019 22:34:06         at java.lang.reflect.Method.invoke(Method.java:498)
25-Oct-2019 22:34:06         at org.springframework.aop.support.AopUtils.invokeJoinpointUsingReflection(AopUtils.java:317)
25-Oct-2019 22:34:06         at org.springframework.aop.framework.ReflectiveMethodInvocation.invokeJoinpoint(ReflectiveMethodInvocation.java:190)
25-Oct-2019 22:34:06         at org.springframework.aop.framework.ReflectiveMethodInvocation.proceed(ReflectiveMethodInvocation.java:157)
25-Oct-2019 22:34:06         at org.openmrs.aop.LoggingAdvice.invoke(LoggingAdvice.java:121)
25-Oct-2019 22:34:06         at org.springframework.aop.framework.ReflectiveMethodInvocation.proceed(ReflectiveMethodInvocation.java:179)
25-Oct-2019 22:34:06         at org.springframework.aop.framework.adapter.MethodBeforeAdviceInterceptor.invoke(MethodBeforeAdviceInterceptor.java:52)
25-Oct-2019 22:34:06         at org.springframework.aop.framework.ReflectiveMethodInvocation.proceed(ReflectiveMethodInvocation.java:179)
25-Oct-2019 22:34:06         at org.springframework.aop.framework.adapter.MethodBeforeAdviceInterceptor.invoke(MethodBeforeAdviceInterceptor.java:52)
25-Oct-2019 22:34:06         at org.springframework.aop.framework.ReflectiveMethodInvocation.proceed(ReflectiveMethodInvocation.java:179)
25-Oct-2019 22:34:06         at org.springframework.aop.framework.JdkDynamicAopProxy.invoke(JdkDynamicAopProxy.java:207)
25-Oct-2019 22:34:06         at com.sun.proxy.$Proxy41.evaluate(Unknown Source)
25-Oct-2019 22:34:06         at sun.reflect.NativeMethodAccessorImpl.invoke0(Native Method)
25-Oct-2019 22:34:06         at sun.reflect.NativeMethodAccessorImpl.invoke(NativeMethodAccessorImpl.java:62)
25-Oct-2019 22:34:06         at sun.reflect.DelegatingMethodAccessorImpl.invoke(DelegatingMethodAccessorImpl.java:43)
25-Oct-2019 22:34:06         at java.lang.reflect.Method.invoke(Method.java:498)
25-Oct-2019 22:34:06         at org.springframework.aop.support.AopUtils.invokeJoinpointUsingReflection(AopUtils.java:317)
25-Oct-2019 22:34:06         at org.springframework.aop.framework.JdkDynamicAopProxy.invoke(JdkDynamicAopProxy.java:201)
25-Oct-2019 22:34:06         at com.sun.proxy.$Proxy152.evaluate(Unknown Source)
25-Oct-2019 22:34:06         at org.openmrs.module.reporting.indicator.SqlIndicatorTest.assertIndicatorValue(SqlIndicatorTest.java:94)
25-Oct-2019 22:34:06         at org.openmrs.module.reporting.indicator.SqlIndicatorTest.assertIndicatorValue(SqlIndicatorTest.java:103)
25-Oct-2019 22:34:06         at org.openmrs.module.reporting.indicator.SqlIndicatorTest.assertIndicatorValue(SqlIndicatorTest.java:114)
25-Oct-2019 22:34:06         at org.openmrs.module.reporting.indicator.SqlIndicatorTest.assertIndicatorValue(SqlIndicatorTest.java:107)
25-Oct-2019 22:34:06         at org.openmrs.module.reporting.indicator.SqlIndicatorTest.sqlIndicator_shouldNotAllowQueriesThatReturnMoreThanOneColumn(SqlIndicatorTest.java:85)
25-Oct-2019 22:34:06         at sun.reflect.NativeMethodAccessorImpl.invoke0(Native Method)
25-Oct-2019 22:34:06         at sun.reflect.NativeMethodAccessorImpl.invoke(NativeMethodAccessorImpl.java:62)
25-Oct-2019 22:34:06         at sun.reflect.DelegatingMethodAccessorImpl.invoke(DelegatingMethodAccessorImpl.java:43)
25-Oct-2019 22:34:06         at java.lang.reflect.Method.invoke(Method.java:498)
25-Oct-2019 22:34:06         at org.junit.runners.model.FrameworkMethod$1.runReflectiveCall(FrameworkMethod.java:47)
25-Oct-2019 22:34:06         at org.junit.internal.runners.model.ReflectiveCallable.run(ReflectiveCallable.java:12)
25-Oct-2019 22:34:06         at org.junit.runners.model.FrameworkMethod.invokeExplosively(FrameworkMethod.java:44)
25-Oct-2019 22:34:06         at org.junit.internal.runners.statements.InvokeMethod.evaluate(InvokeMethod.java:17)
25-Oct-2019 22:34:06         at org.junit.internal.runners.statements.ExpectException.evaluate(ExpectException.java:19)
25-Oct-2019 22:34:06         at org.junit.internal.runners.statements.RunBefores.evaluate(RunBefores.java:26)
25-Oct-2019 22:34:06         at org.springframework.test.context.junit4.statements.RunBeforeTestMethodCallbacks.evaluate(RunBeforeTestMethodCallbacks.java:73)
25-Oct-2019 22:34:06         at org.junit.internal.runners.statements.RunAfters.evaluate(RunAfters.java:27)
25-Oct-2019 22:34:06         at org.springframework.test.context.junit4.statements.RunAfterTestMethodCallbacks.evaluate(RunAfterTestMethodCallbacks.java:82)
25-Oct-2019 22:34:06         at org.springframework.test.context.junit4.statements.SpringRepeat.evaluate(SpringRepeat.java:73)
25-Oct-2019 22:34:06         at org.junit.runners.ParentRunner.runLeaf(ParentRunner.java:271)
25-Oct-2019 22:34:06         at org.springframework.test.context.junit4.SpringJUnit4ClassRunner.runChild(SpringJUnit4ClassRunner.java:217)
25-Oct-2019 22:34:06         at org.springframework.test.context.junit4.SpringJUnit4ClassRunner.runChild(SpringJUnit4ClassRunner.java:83)
25-Oct-2019 22:34:06         at org.junit.runners.ParentRunner$3.run(ParentRunner.java:238)
25-Oct-2019 22:34:06         at org.junit.runners.ParentRunner$1.schedule(ParentRunner.java:63)
25-Oct-2019 22:34:06         at org.junit.runners.ParentRunner.runChildren(ParentRunner.java:236)
25-Oct-2019 22:34:06         at org.junit.runners.ParentRunner.access$000(ParentRunner.java:53)
25-Oct-2019 22:34:06         at org.junit.runners.ParentRunner$2.evaluate(ParentRunner.java:229)
25-Oct-2019 22:34:06         at org.springframework.test.context.junit4.statements.RunBeforeTestClassCallbacks.evaluate(RunBeforeTestClassCallbacks.java:61)
25-Oct-2019 22:34:06         at org.junit.internal.runners.statements.RunAfters.evaluate(RunAfters.java:27)
25-Oct-2019 22:34:06         at org.springframework.test.context.junit4.statements.RunAfterTestClassCallbacks.evaluate(RunAfterTestClassCallbacks.java:68)
25-Oct-2019 22:34:06         at org.junit.runners.ParentRunner.run(ParentRunner.java:309)
25-Oct-2019 22:34:06         at org.springframework.test.context.junit4.SpringJUnit4ClassRunner.run(SpringJUnit4ClassRunner.java:163)
25-Oct-2019 22:34:06         at org.apache.maven.surefire.junit4.JUnit4TestSet.execute(JUnit4TestSet.java:59)
25-Oct-2019 22:34:06         at org.apache.maven.surefire.suite.AbstractDirectoryTestSuite.executeTestSet(AbstractDirectoryTestSuite.java:115)
25-Oct-2019 22:34:06         at org.apache.maven.surefire.suite.AbstractDirectoryTestSuite.execute(AbstractDirectoryTestSuite.java:102)
25-Oct-2019 22:34:06         at org.apache.maven.surefire.Surefire.run(Surefire.java:180)
25-Oct-2019 22:34:06         at sun.reflect.NativeMethodAccessorImpl.invoke0(Native Method)
25-Oct-2019 22:34:06         at sun.reflect.NativeMethodAccessorImpl.invoke(NativeMethodAccessorImpl.java:62)
25-Oct-2019 22:34:06         at sun.reflect.DelegatingMethodAccessorImpl.invoke(DelegatingMethodAccessorImpl.java:43)
25-Oct-2019 22:34:06         at java.lang.reflect.Method.invoke(Method.java:498)
25-Oct-2019 22:34:06         at org.apache.maven.surefire.booter.SurefireBooter.runSuitesInProcess(SurefireBooter.java:350)
25-Oct-2019 22:34:06         at org.apache.maven.surefire.booter.SurefireBooter.main(SurefireBooter.java:1021)
25-Oct-2019 22:34:06 Caused by: java.lang.IllegalArgumentException: Unable to evaluate to a single value. Exactly one column must be defined.
25-Oct-2019 22:34:06         at org.openmrs.module.reporting.evaluation.service.EvaluationServiceImpl.evaluateToObject(EvaluationServiceImpl.java:90)
25-Oct-2019 22:34:06         at sun.reflect.NativeMethodAccessorImpl.invoke0(Native Method)
25-Oct-2019 22:34:06         at sun.reflect.NativeMethodAccessorImpl.invoke(NativeMethodAccessorImpl.java:62)
25-Oct-2019 22:34:06         at sun.reflect.DelegatingMethodAccessorImpl.invoke(DelegatingMethodAccessorImpl.java:43)
25-Oct-2019 22:34:06         at java.lang.reflect.Method.invoke(Method.java:498)
25-Oct-2019 22:34:06         at org.springframework.aop.support.AopUtils.invokeJoinpointUsingReflection(AopUtils.java:317)
25-Oct-2019 22:34:06         at org.springframework.aop.framework.ReflectiveMethodInvocation.invokeJoinpoint(ReflectiveMethodInvocation.java:190)
25-Oct-2019 22:34:06         at org.springframework.aop.framework.ReflectiveMethodInvocation.proceed(ReflectiveMethodInvocation.java:157)
25-Oct-2019 22:34:06         at org.springframework.transaction.interceptor.TransactionInterceptor$1.proceedWithInvocation(TransactionInterceptor.java:99)
25-Oct-2019 22:34:06         at org.springframework.transaction.interceptor.TransactionAspectSupport.invokeWithinTransaction(TransactionAspectSupport.java:281)
25-Oct-2019 22:34:06         at org.springframework.transaction.interceptor.TransactionInterceptor.invoke(TransactionInterceptor.java:96)
25-Oct-2019 22:34:06         at org.springframework.aop.framework.ReflectiveMethodInvocation.proceed(ReflectiveMethodInvocation.java:179)
25-Oct-2019 22:34:06         at org.openmrs.aop.LoggingAdvice.invoke(LoggingAdvice.java:121)
25-Oct-2019 22:34:06         at org.springframework.aop.framework.ReflectiveMethodInvocation.proceed(ReflectiveMethodInvocation.java:179)
25-Oct-2019 22:34:06         at org.springframework.aop.framework.adapter.MethodBeforeAdviceInterceptor.invoke(MethodBeforeAdviceInterceptor.java:52)
25-Oct-2019 22:34:06         at org.springframework.aop.framework.ReflectiveMethodInvocation.proceed(ReflectiveMethodInvocation.java:179)
25-Oct-2019 22:34:06         at org.springframework.aop.framework.adapter.MethodBeforeAdviceInterceptor.invoke(MethodBeforeAdviceInterceptor.java:52)
25-Oct-2019 22:34:06         at org.springframework.aop.framework.ReflectiveMethodInvocation.proceed(ReflectiveMethodInvocation.java:179)
25-Oct-2019 22:34:06         at org.springframework.aop.framework.JdkDynamicAopProxy.invoke(JdkDynamicAopProxy.java:207)
25-Oct-2019 22:34:06         at com.sun.proxy.$Proxy28.evaluateToObject(Unknown Source)
25-Oct-2019 22:34:06         at sun.reflect.NativeMethodAccessorImpl.invoke0(Native Method)
25-Oct-2019 22:34:06         at sun.reflect.NativeMethodAccessorImpl.invoke(NativeMethodAccessorImpl.java:62)
25-Oct-2019 22:34:06         at sun.reflect.DelegatingMethodAccessorImpl.invoke(DelegatingMethodAccessorImpl.java:43)
25-Oct-2019 22:34:06         at java.lang.reflect.Method.invoke(Method.java:498)
25-Oct-2019 22:34:06         at org.springframework.aop.support.AopUtils.invokeJoinpointUsingReflection(AopUtils.java:317)
25-Oct-2019 22:34:06         at org.springframework.aop.framework.ReflectiveMethodInvocation.invokeJoinpoint(ReflectiveMethodInvocation.java:190)
25-Oct-2019 22:34:06         at org.springframework.aop.framework.ReflectiveMethodInvocation.proceed(ReflectiveMethodInvocation.java:157)
25-Oct-2019 22:34:06         at org.springframework.transaction.interceptor.TransactionInterceptor$1.proceedWithInvocation(TransactionInterceptor.java:99)
25-Oct-2019 22:34:06         at org.springframework.transaction.interceptor.TransactionAspectSupport.invokeWithinTransaction(TransactionAspectSupport.java:281)
25-Oct-2019 22:34:06         at org.springframework.transaction.interceptor.TransactionInterceptor.invoke(TransactionInterceptor.java:96)
25-Oct-2019 22:34:06         at org.springframework.aop.framework.ReflectiveMethodInvocation.proceed(ReflectiveMethodInvocation.java:179)
25-Oct-2019 22:34:06         at org.springframework.aop.framework.JdkDynamicAopProxy.invoke(JdkDynamicAopProxy.java:207)
25-Oct-2019 22:34:06         at com.sun.proxy.$Proxy132.evaluateToObject(Unknown Source)
25-Oct-2019 22:34:06         at org.openmrs.module.reporting.indicator.evaluator.SqlIndicatorEvaluator.evaluateSql(SqlIndicatorEvaluator.java:54)
25-Oct-2019 22:34:06         ... 70 more
25-Oct-2019 22:34:07 ERROR - EvaluationProfiler.log(111) |2019-10-25 22:34:07,303| 1344        2019-10-25 22:34:07.303        >        ERROR        EVALUATING_DEFINITION                        SqlIndicator[sql=SELECT person_id from person]: Failed to evaluate sql because:
25-Oct-2019 22:34:07 Unable to evaluate to a single value. Exactly one row must be returned by query.
25-Oct-2019 22:34:07 org.openmrs.module.reporting.evaluation.EvaluationException: Failed to evaluate sql because:
25-Oct-2019 22:34:07 Unable to evaluate to a single value. Exactly one row must be returned by query.
25-Oct-2019 22:34:07         at org.openmrs.module.reporting.indicator.evaluator.SqlIndicatorEvaluator.evaluateSql(SqlIndicatorEvaluator.java:57)
25-Oct-2019 22:34:07         at org.openmrs.module.reporting.indicator.evaluator.SqlIndicatorEvaluator.evaluate(SqlIndicatorEvaluator.java:41)
25-Oct-2019 22:34:07         at org.openmrs.module.reporting.indicator.evaluator.SqlIndicatorEvaluator.evaluate(SqlIndicatorEvaluator.java:28)
25-Oct-2019 22:34:07         at org.openmrs.module.reporting.definition.service.BaseDefinitionService.executeEvaluator(BaseDefinitionService.java:369)
25-Oct-2019 22:34:07         at org.openmrs.module.reporting.definition.service.BaseDefinitionService.evaluateBypassingExclusionOfTestPatients(BaseDefinitionService.java:264)
25-Oct-2019 22:34:07         at org.openmrs.module.reporting.definition.service.BaseDefinitionService.evaluate(BaseDefinitionService.java:229)
25-Oct-2019 22:34:07         at org.openmrs.module.reporting.indicator.service.IndicatorServiceImpl.evaluate(IndicatorServiceImpl.java:41)
25-Oct-2019 22:34:07         at sun.reflect.GeneratedMethodAccessor1170.invoke(Unknown Source)
25-Oct-2019 22:34:07         at sun.reflect.DelegatingMethodAccessorImpl.invoke(DelegatingMethodAccessorImpl.java:43)
25-Oct-2019 22:34:07         at java.lang.reflect.Method.invoke(Method.java:498)
25-Oct-2019 22:34:07         at org.springframework.aop.support.AopUtils.invokeJoinpointUsingReflection(AopUtils.java:317)
25-Oct-2019 22:34:07         at org.springframework.aop.framework.ReflectiveMethodInvocation.invokeJoinpoint(ReflectiveMethodInvocation.java:190)
25-Oct-2019 22:34:07         at org.springframework.aop.framework.ReflectiveMethodInvocation.proceed(ReflectiveMethodInvocation.java:157)
25-Oct-2019 22:34:07         at org.openmrs.aop.LoggingAdvice.invoke(LoggingAdvice.java:121)
25-Oct-2019 22:34:07         at org.springframework.aop.framework.ReflectiveMethodInvocation.proceed(ReflectiveMethodInvocation.java:179)
25-Oct-2019 22:34:07         at org.springframework.aop.framework.adapter.MethodBeforeAdviceInterceptor.invoke(MethodBeforeAdviceInterceptor.java:52)
25-Oct-2019 22:34:07         at org.springframework.aop.framework.ReflectiveMethodInvocation.proceed(ReflectiveMethodInvocation.java:179)
25-Oct-2019 22:34:07         at org.springframework.aop.framework.adapter.MethodBeforeAdviceInterceptor.invoke(MethodBeforeAdviceInterceptor.java:52)
25-Oct-2019 22:34:07         at org.springframework.aop.framework.ReflectiveMethodInvocation.proceed(ReflectiveMethodInvocation.java:179)
25-Oct-2019 22:34:07         at org.springframework.aop.framework.JdkDynamicAopProxy.invoke(JdkDynamicAopProxy.java:207)
25-Oct-2019 22:34:07         at com.sun.proxy.$Proxy41.evaluate(Unknown Source)
25-Oct-2019 22:34:07         at sun.reflect.GeneratedMethodAccessor1170.invoke(Unknown Source)
25-Oct-2019 22:34:07         at sun.reflect.DelegatingMethodAccessorImpl.invoke(DelegatingMethodAccessorImpl.java:43)
25-Oct-2019 22:34:07         at java.lang.reflect.Method.invoke(Method.java:498)
25-Oct-2019 22:34:07         at org.springframework.aop.support.AopUtils.invokeJoinpointUsingReflection(AopUtils.java:317)
25-Oct-2019 22:34:07         at org.springframework.aop.framework.JdkDynamicAopProxy.invoke(JdkDynamicAopProxy.java:201)
25-Oct-2019 22:34:07         at com.sun.proxy.$Proxy152.evaluate(Unknown Source)
25-Oct-2019 22:34:07         at org.openmrs.module.reporting.indicator.SqlIndicatorTest.assertIndicatorValue(SqlIndicatorTest.java:94)
25-Oct-2019 22:34:07         at org.openmrs.module.reporting.indicator.SqlIndicatorTest.assertIndicatorValue(SqlIndicatorTest.java:103)
25-Oct-2019 22:34:07         at org.openmrs.module.reporting.indicator.SqlIndicatorTest.assertIndicatorValue(SqlIndicatorTest.java:114)
25-Oct-2019 22:34:07         at org.openmrs.module.reporting.indicator.SqlIndicatorTest.assertIndicatorValue(SqlIndicatorTest.java:107)
25-Oct-2019 22:34:07         at org.openmrs.module.reporting.indicator.SqlIndicatorTest.sqlIndicator_shouldNotAllowQueriesThatReturnMoreThanOneRow(SqlIndicatorTest.java:90)
25-Oct-2019 22:34:07         at sun.reflect.NativeMethodAccessorImpl.invoke0(Native Method)
25-Oct-2019 22:34:07         at sun.reflect.NativeMethodAccessorImpl.invoke(NativeMethodAccessorImpl.java:62)
25-Oct-2019 22:34:07         at sun.reflect.DelegatingMethodAccessorImpl.invoke(DelegatingMethodAccessorImpl.java:43)
25-Oct-2019 22:34:07         at java.lang.reflect.Method.invoke(Method.java:498)
25-Oct-2019 22:34:07         at org.junit.runners.model.FrameworkMethod$1.runReflectiveCall(FrameworkMethod.java:47)
25-Oct-2019 22:34:07         at org.junit.internal.runners.model.ReflectiveCallable.run(ReflectiveCallable.java:12)
25-Oct-2019 22:34:07         at org.junit.runners.model.FrameworkMethod.invokeExplosively(FrameworkMethod.java:44)
25-Oct-2019 22:34:07         at org.junit.internal.runners.statements.InvokeMethod.evaluate(InvokeMethod.java:17)
25-Oct-2019 22:34:07         at org.junit.internal.runners.statements.ExpectException.evaluate(ExpectException.java:19)
25-Oct-2019 22:34:07         at org.junit.internal.runners.statements.RunBefores.evaluate(RunBefores.java:26)
25-Oct-2019 22:34:07         at org.springframework.test.context.junit4.statements.RunBeforeTestMethodCallbacks.evaluate(RunBeforeTestMethodCallbacks.java:73)
25-Oct-2019 22:34:07         at org.junit.internal.runners.statements.RunAfters.evaluate(RunAfters.java:27)
25-Oct-2019 22:34:07         at org.springframework.test.context.junit4.statements.RunAfterTestMethodCallbacks.evaluate(RunAfterTestMethodCallbacks.java:82)
25-Oct-2019 22:34:07         at org.springframework.test.context.junit4.statements.SpringRepeat.evaluate(SpringRepeat.java:73)
25-Oct-2019 22:34:07         at org.junit.runners.ParentRunner.runLeaf(ParentRunner.java:271)
25-Oct-2019 22:34:07         at org.springframework.test.context.junit4.SpringJUnit4ClassRunner.runChild(SpringJUnit4ClassRunner.java:217)
25-Oct-2019 22:34:07         at org.springframework.test.context.junit4.SpringJUnit4ClassRunner.runChild(SpringJUnit4ClassRunner.java:83)
25-Oct-2019 22:34:07         at org.junit.runners.ParentRunner$3.run(ParentRunner.java:238)
25-Oct-2019 22:34:07         at org.junit.runners.ParentRunner$1.schedule(ParentRunner.java:63)
25-Oct-2019 22:34:07         at org.junit.runners.ParentRunner.runChildren(ParentRunner.java:236)
25-Oct-2019 22:34:07         at org.junit.runners.ParentRunner.access$000(ParentRunner.java:53)
25-Oct-2019 22:34:07         at org.junit.runners.ParentRunner$2.evaluate(ParentRunner.java:229)
25-Oct-2019 22:34:07         at org.springframework.test.context.junit4.statements.RunBeforeTestClassCallbacks.evaluate(RunBeforeTestClassCallbacks.java:61)
25-Oct-2019 22:34:07         at org.junit.internal.runners.statements.RunAfters.evaluate(RunAfters.java:27)
25-Oct-2019 22:34:07         at org.springframework.test.context.junit4.statements.RunAfterTestClassCallbacks.evaluate(RunAfterTestClassCallbacks.java:68)
25-Oct-2019 22:34:07         at org.junit.runners.ParentRunner.run(ParentRunner.java:309)
25-Oct-2019 22:34:07         at org.springframework.test.context.junit4.SpringJUnit4ClassRunner.run(SpringJUnit4ClassRunner.java:163)
25-Oct-2019 22:34:07         at org.apache.maven.surefire.junit4.JUnit4TestSet.execute(JUnit4TestSet.java:59)
25-Oct-2019 22:34:07         at org.apache.maven.surefire.suite.AbstractDirectoryTestSuite.executeTestSet(AbstractDirectoryTestSuite.java:115)
25-Oct-2019 22:34:07         at org.apache.maven.surefire.suite.AbstractDirectoryTestSuite.execute(AbstractDirectoryTestSuite.java:102)
25-Oct-2019 22:34:07         at org.apache.maven.surefire.Surefire.run(Surefire.java:180)
25-Oct-2019 22:34:07         at sun.reflect.NativeMethodAccessorImpl.invoke0(Native Method)
25-Oct-2019 22:34:07         at sun.reflect.NativeMethodAccessorImpl.invoke(NativeMethodAccessorImpl.java:62)
25-Oct-2019 22:34:07         at sun.reflect.DelegatingMethodAccessorImpl.invoke(DelegatingMethodAccessorImpl.java:43)
25-Oct-2019 22:34:07         at java.lang.reflect.Method.invoke(Method.java:498)
25-Oct-2019 22:34:07         at org.apache.maven.surefire.booter.SurefireBooter.runSuitesInProcess(SurefireBooter.java:350)
25-Oct-2019 22:34:07         at org.apache.maven.surefire.booter.SurefireBooter.main(SurefireBooter.java:1021)
25-Oct-2019 22:34:07 Caused by: java.lang.IllegalArgumentException: Unable to evaluate to a single value. Exactly one row must be returned by query.
25-Oct-2019 22:34:07         at org.openmrs.module.reporting.evaluation.service.EvaluationServiceImpl.evaluateToObject(EvaluationServiceImpl.java:86)
25-Oct-2019 22:34:07         at sun.reflect.GeneratedMethodAccessor1173.invoke(Unknown Source)
25-Oct-2019 22:34:07         at sun.reflect.DelegatingMethodAccessorImpl.invoke(DelegatingMethodAccessorImpl.java:43)
25-Oct-2019 22:34:07         at java.lang.reflect.Method.invoke(Method.java:498)
25-Oct-2019 22:34:07         at org.springframework.aop.support.AopUtils.invokeJoinpointUsingReflection(AopUtils.java:317)
25-Oct-2019 22:34:07         at org.springframework.aop.framework.ReflectiveMethodInvocation.invokeJoinpoint(ReflectiveMethodInvocation.java:190)
25-Oct-2019 22:34:07         at org.springframework.aop.framework.ReflectiveMethodInvocation.proceed(ReflectiveMethodInvocation.java:157)
25-Oct-2019 22:34:07         at org.springframework.transaction.interceptor.TransactionInterceptor$1.proceedWithInvocation(TransactionInterceptor.java:99)
25-Oct-2019 22:34:07         at org.springframework.transaction.interceptor.TransactionAspectSupport.invokeWithinTransaction(TransactionAspectSupport.java:281)
25-Oct-2019 22:34:07         at org.springframework.transaction.interceptor.TransactionInterceptor.invoke(TransactionInterceptor.java:96)
25-Oct-2019 22:34:07         at org.springframework.aop.framework.ReflectiveMethodInvocation.proceed(ReflectiveMethodInvocation.java:179)
25-Oct-2019 22:34:07         at org.openmrs.aop.LoggingAdvice.invoke(LoggingAdvice.java:121)
25-Oct-2019 22:34:07         at org.springframework.aop.framework.ReflectiveMethodInvocation.proceed(ReflectiveMethodInvocation.java:179)
25-Oct-2019 22:34:07         at org.springframework.aop.framework.adapter.MethodBeforeAdviceInterceptor.invoke(MethodBeforeAdviceInterceptor.java:52)
25-Oct-2019 22:34:07         at org.springframework.aop.framework.ReflectiveMethodInvocation.proceed(ReflectiveMethodInvocation.java:179)
25-Oct-2019 22:34:07         at org.springframework.aop.framework.adapter.MethodBeforeAdviceInterceptor.invoke(MethodBeforeAdviceInterceptor.java:52)
25-Oct-2019 22:34:07         at org.springframework.aop.framework.ReflectiveMethodInvocation.proceed(ReflectiveMethodInvocation.java:179)
25-Oct-2019 22:34:07         at org.springframework.aop.framework.JdkDynamicAopProxy.invoke(JdkDynamicAopProxy.java:207)
25-Oct-2019 22:34:07         at com.sun.proxy.$Proxy28.evaluateToObject(Unknown Source)
25-Oct-2019 22:34:07         at sun.reflect.GeneratedMethodAccessor1173.invoke(Unknown Source)
25-Oct-2019 22:34:07         at sun.reflect.DelegatingMethodAccessorImpl.invoke(DelegatingMethodAccessorImpl.java:43)
25-Oct-2019 22:34:07         at java.lang.reflect.Method.invoke(Method.java:498)
25-Oct-2019 22:34:07         at org.springframework.aop.support.AopUtils.invokeJoinpointUsingReflection(AopUtils.java:317)
25-Oct-2019 22:34:07         at org.springframework.aop.framework.ReflectiveMethodInvocation.invokeJoinpoint(ReflectiveMethodInvocation.java:190)
25-Oct-2019 22:34:07         at org.springframework.aop.framework.ReflectiveMethodInvocation.proceed(ReflectiveMethodInvocation.java:157)
25-Oct-2019 22:34:07         at org.springframework.transaction.interceptor.TransactionInterceptor$1.proceedWithInvocation(TransactionInterceptor.java:99)
25-Oct-2019 22:34:07         at org.springframework.transaction.interceptor.TransactionAspectSupport.invokeWithinTransaction(TransactionAspectSupport.java:281)
25-Oct-2019 22:34:07         at org.springframework.transaction.interceptor.TransactionInterceptor.invoke(TransactionInterceptor.java:96)
25-Oct-2019 22:34:07         at org.springframework.aop.framework.ReflectiveMethodInvocation.proceed(ReflectiveMethodInvocation.java:179)
25-Oct-2019 22:34:07         at org.springframework.aop.framework.JdkDynamicAopProxy.invoke(JdkDynamicAopProxy.java:207)
25-Oct-2019 22:34:07         at com.sun.proxy.$Proxy132.evaluateToObject(Unknown Source)
25-Oct-2019 22:34:07         at org.openmrs.module.reporting.indicator.evaluator.SqlIndicatorEvaluator.evaluateSql(SqlIndicatorEvaluator.java:54)
25-Oct-2019 22:34:07         ... 68 more
25-Oct-2019 22:34:07 Tests run: 8, Failures: 0, Errors: 0, Skipped: 0, Time elapsed: 1.08 sec
25-Oct-2019 22:34:07 Running org.openmrs.module.reporting.report.renderer.ExcelTemplateRendererTest
25-Oct-2019 22:34:08 Tests run: 2, Failures: 0, Errors: 0, Skipped: 0, Time elapsed: 0.692 sec
25-Oct-2019 22:34:08 Running org.openmrs.module.reporting.cohort.CohortsTest
25-Oct-2019 22:34:08 Tests run: 3, Failures: 0, Errors: 0, Skipped: 0, Time elapsed: 0.027 sec
25-Oct-2019 22:34:08 Running org.openmrs.module.reporting.data.converter.StringConverterTest
25-Oct-2019 22:34:08 Tests run: 1, Failures: 0, Errors: 0, Skipped: 0, Time elapsed: 0.001 sec
25-Oct-2019 22:34:08 Running org.openmrs.module.reporting.dataset.definition.evaluator.RepeatPerTimePeriodDataSetEvaluatorTest
25-Oct-2019 22:34:08 Tests run: 4, Failures: 0, Errors: 0, Skipped: 0, Time elapsed: 0.106 sec
25-Oct-2019 22:34:08 Running org.openmrs.module.reporting.data.JoinDataDefinitionTest
25-Oct-2019 22:34:08 Tests run: 2, Failures: 0, Errors: 0, Skipped: 0, Time elapsed: 0.003 sec
25-Oct-2019 22:34:08 Running org.openmrs.module.reporting.query.obs.evaluator.BasicObsQueryEvaluatorTest
25-Oct-2019 22:34:08 Tests run: 1, Failures: 0, Errors: 0, Skipped: 0, Time elapsed: 0.219 sec
25-Oct-2019 22:34:08 Running org.openmrs.module.reporting.query.person.evaluator.PatientPersonQueryEvaluatorTest
25-Oct-2019 22:34:08 Tests run: 1, Failures: 0, Errors: 0, Skipped: 0, Time elapsed: 0.186 sec
25-Oct-2019 22:34:08 Running org.openmrs.module.reporting.data.patient.evaluator.ScriptedCompositionPatientDataEvaluatorTest
25-Oct-2019 22:34:09 Tests run: 2, Failures: 0, Errors: 0, Skipped: 0, Time elapsed: 0.613 sec
25-Oct-2019 22:34:09 Running org.openmrs.module.reporting.definition.library.implementerconfigured.ImplementerConfiguredEncounterDataDefinitionLibraryTest
25-Oct-2019 22:34:09 Tests run: 2, Failures: 0, Errors: 0, Skipped: 0, Time elapsed: 0.026 sec
25-Oct-2019 22:34:09 Running org.openmrs.module.reporting.data.encounter.evaluator.PersonToEncounterDataEvaluatorTest
25-Oct-2019 22:34:09 Tests run: 3, Failures: 0, Errors: 0, Skipped: 0, Time elapsed: 0.33 sec
25-Oct-2019 22:34:09 Running org.openmrs.module.reporting.data.visit.evaluator.PatientToVisitDataEvaluatorTest
25-Oct-2019 22:34:09 {1=102, 4=12345K}
25-Oct-2019 22:34:10 Tests run: 3, Failures: 0, Errors: 0, Skipped: 0, Time elapsed: 0.484 sec
25-Oct-2019 22:34:10 Running org.openmrs.module.reporting.validator.CompositionCohortDefinitionValidatorTest
25-Oct-2019 22:34:10 Tests run: 5, Failures: 0, Errors: 0, Skipped: 0, Time elapsed: 0.069 sec
25-Oct-2019 22:34:10 Running org.openmrs.module.reporting.cohort.definition.evaluator.InProgramCohortDefinitionEvaluatorTest
25-Oct-2019 22:34:11 Tests run: 5, Failures: 0, Errors: 0, Skipped: 0, Time elapsed: 0.836 sec
25-Oct-2019 22:34:11 Running org.openmrs.module.reporting.calculation.PatientDataCalculationBehaviorTest
25-Oct-2019 22:34:11 Tests run: 3, Failures: 0, Errors: 0, Skipped: 0, Time elapsed: 0.447 sec
25-Oct-2019 22:34:11 Running org.openmrs.module.reporting.dataset.definition.evaluator.CohortIndicatorDataSetEvaluatorTest
25-Oct-2019 22:34:11 Tests run: 1, Failures: 0, Errors: 0, Skipped: 0, Time elapsed: 0.135 sec
25-Oct-2019 22:34:11 Running org.openmrs.module.reporting.query.encounter.evaluator.AuditEncounterQueryEvaluatorTest
25-Oct-2019 22:34:12 Tests run: 5, Failures: 0, Errors: 0, Skipped: 0, Time elapsed: 0.732 sec
25-Oct-2019 22:34:12 Running org.openmrs.module.reporting.definition.service.DefinitionServiceTest
25-Oct-2019 22:34:12 Tests run: 1, Failures: 0, Errors: 0, Skipped: 0, Time elapsed: 0.029 sec
25-Oct-2019 22:34:12 Running org.openmrs.module.reporting.indicator.aggregation.AggregationTest
25-Oct-2019 22:34:12 Tests run: 12, Failures: 0, Errors: 0, Skipped: 0, Time elapsed: 0.003 sec
25-Oct-2019 22:34:12 Running org.openmrs.module.reporting.data.person.evaluator.ConvertedPersonDataEvaluatorTest
25-Oct-2019 22:34:12 Tests run: 1, Failures: 0, Errors: 0, Skipped: 0, Time elapsed: 0.126 sec
25-Oct-2019 22:34:12 Running org.openmrs.module.reporting.query.encounter.evaluator.SqlEncounterQueryEvaluatorTest
25-Oct-2019 22:34:12 Tests run: 3, Failures: 0, Errors: 0, Skipped: 0, Time elapsed: 0.379 sec
25-Oct-2019 22:34:12 Running org.openmrs.module.reporting.report.renderer.CsvReportRendererTest
25-Oct-2019 22:34:12 Tests run: 1, Failures: 0, Errors: 0, Skipped: 0, Time elapsed: 0.014 sec
25-Oct-2019 22:34:12 Running org.openmrs.module.reporting.dataset.definition.evaluator.LogicDataSetEvaluatorTest
25-Oct-2019 22:34:12 Tests run: 1, Failures: 0, Errors: 0, Skipped: 1, Time elapsed: 0 sec
25-Oct-2019 22:34:12 Running org.openmrs.module.reporting.dataset.definition.evaluator.VisitDataSetEvaluatorTest
25-Oct-2019 22:34:13 VISIT ID        EMR ID        BIRTHDATE          
25-Oct-2019 22:34:13 --------        ------        -----------        
25-Oct-2019 22:34:13 1               2             08/Apr/1975        
25-Oct-2019 22:34:13 2               2             08/Apr/1975        
25-Oct-2019 22:34:13 3               2             08/Apr/1975        
25-Oct-2019 22:34:13 4               6             27/May/2007        
25-Oct-2019 22:34:13 5               6             27/May/2007        
25-Oct-2019 22:34:13 Tests run: 1, Failures: 0, Errors: 0, Skipped: 0, Time elapsed: 0.139 sec
25-Oct-2019 22:34:13 Running org.openmrs.module.reporting.data.person.evaluator.PersonIdDataEvaluatorTest
25-Oct-2019 22:34:13 Tests run: 1, Failures: 0, Errors: 0, Skipped: 0, Time elapsed: 0.104 sec
25-Oct-2019 22:34:13 Running org.openmrs.module.reporting.cohort.definition.evaluator.BirthAndDeathCohortDefinitionEvaluatorTest
25-Oct-2019 22:34:14 Tests run: 8, Failures: 0, Errors: 0, Skipped: 0, Time elapsed: 1 sec
25-Oct-2019 22:34:14 Running org.openmrs.module.reporting.data.encounter.evaluator.SqlEncounterDataEvaluatorTest
25-Oct-2019 22:34:14 Tests run: 1, Failures: 0, Errors: 0, Skipped: 0, Time elapsed: 0.113 sec
25-Oct-2019 22:34:14 Running org.openmrs.module.reporting.data.converter.PersonAddressConverterTest
25-Oct-2019 22:34:14 Tests run: 1, Failures: 0, Errors: 0, Skipped: 0, Time elapsed: 0.014 sec
25-Oct-2019 22:34:14 Running org.openmrs.module.reporting.data.converter.AttributeValueConverterTest
25-Oct-2019 22:34:14 Tests run: 2, Failures: 0, Errors: 0, Skipped: 0, Time elapsed: 0.208 sec
25-Oct-2019 22:34:14 Running org.openmrs.module.reporting.common.DelimitedKeyComparatorTest
25-Oct-2019 22:34:14 Tests run: 1, Failures: 0, Errors: 0, Skipped: 0, Time elapsed: 0.001 sec
25-Oct-2019 22:34:14 Running org.openmrs.module.reporting.data.obs.evaluator.ConvertedObsDataEvaluatorTest
25-Oct-2019 22:34:14 Tests run: 1, Failures: 0, Errors: 0, Skipped: 0, Time elapsed: 0.111 sec
25-Oct-2019 22:34:14 Running org.openmrs.module.reporting.query.person.evaluator.SqlPersonQueryEvaluatorTest
25-Oct-2019 22:34:14 Tests run: 2, Failures: 0, Errors: 0, Skipped: 0, Time elapsed: 0.237 sec
25-Oct-2019 22:34:14 Running org.openmrs.module.reporting.query.person.evaluator.AllPersonQueryEvaluatorTest
25-Oct-2019 22:34:15 Tests run: 6, Failures: 0, Errors: 0, Skipped: 0, Time elapsed: 0.686 sec
25-Oct-2019 22:34:15 Running org.openmrs.module.reporting.dataset.definition.evaluator.SqlFileDataSetEvaluatorTest
25-Oct-2019 22:34:15 Tests run: 2, Failures: 0, Errors: 0, Skipped: 0, Time elapsed: 0.482 sec
25-Oct-2019 22:34:15 Running org.openmrs.module.reporting.data.person.evaluator.AgeAtDateOfOtherDataEvaluatorTest
25-Oct-2019 22:34:16 Tests run: 1, Failures: 0, Errors: 0, Skipped: 0, Time elapsed: 0.47 sec
25-Oct-2019 22:34:16 Running org.openmrs.module.reporting.indicator.PeriodIndicatorReportTest
25-Oct-2019 22:34:16 Tests run: 2, Failures: 0, Errors: 0, Skipped: 0, Time elapsed: 0.228 sec
25-Oct-2019 22:34:16 Running org.openmrs.module.reporting.report.renderer.DelimitedTextReportRendererTest
25-Oct-2019 22:34:16 Tests run: 11, Failures: 0, Errors: 0, Skipped: 0, Time elapsed: 0.194 sec
25-Oct-2019 22:34:16 Running org.openmrs.module.reporting.data.patient.evaluator.PatientObjectDataEvaluatorTest
25-Oct-2019 22:34:17 Tests run: 1, Failures: 0, Errors: 0, Skipped: 0, Time elapsed: 0.149 sec
25-Oct-2019 22:34:17 Running org.openmrs.module.reporting.data.patient.evaluator.TestPatientCalculation
25-Oct-2019 22:34:17 Tests run: 1, Failures: 0, Errors: 0, Skipped: 1, Time elapsed: 0.001 sec
25-Oct-2019 22:34:17 Running org.openmrs.module.reporting.validator.SqlCohortDefinitionValidatorTest
25-Oct-2019 22:34:17 Tests run: 3, Failures: 0, Errors: 0, Skipped: 0, Time elapsed: 0.028 sec
25-Oct-2019 22:34:17 Running org.openmrs.module.reporting.cohort.definition.evaluator.PatientStateCohortDefinitionEvaluatorTest
25-Oct-2019 22:34:17 Tests run: 7, Failures: 0, Errors: 0, Skipped: 0, Time elapsed: 0.84 sec
25-Oct-2019 22:34:17 Running org.openmrs.module.reporting.data.converter.NullValueConverterTest
25-Oct-2019 22:34:17 Tests run: 1, Failures: 0, Errors: 0, Skipped: 0, Time elapsed: 0.001 sec
25-Oct-2019 22:34:17 Running org.openmrs.module.reporting.query.encounter.evaluator.ConditionalParameterEncounterQueryEvaluatorTest
25-Oct-2019 22:34:18 Tests run: 1, Failures: 0, Errors: 0, Skipped: 0, Time elapsed: 0.137 sec
25-Oct-2019 22:34:18 Running org.openmrs.module.reporting.report.service.TestReportProcessor
25-Oct-2019 22:34:18 Tests run: 1, Failures: 0, Errors: 0, Skipped: 1, Time elapsed: 0.001 sec
25-Oct-2019 22:34:18 Running org.openmrs.module.reporting.common.FractionTest
25-Oct-2019 22:34:18 Tests run: 7, Failures: 0, Errors: 0, Skipped: 0, Time elapsed: 0.002 sec
25-Oct-2019 22:34:18 Running org.openmrs.module.reporting.report.renderer.ReportDesignRendererTest
25-Oct-2019 22:34:18 Tests run: 2, Failures: 0, Errors: 0, Skipped: 0, Time elapsed: 0.029 sec
25-Oct-2019 22:34:18 Running org.openmrs.module.reporting.data.patient.evaluator.ProgramEnrollmentsForPatientDataEvaluatorTest
25-Oct-2019 22:34:18 Tests run: 8, Failures: 0, Errors: 0, Skipped: 0, Time elapsed: 0.94 sec
25-Oct-2019 22:34:18 Running org.openmrs.module.reporting.data.visit.evaluator.OrderForVisitDataEvaluatorTest
25-Oct-2019 22:34:19 Tests run: 2, Failures: 0, Errors: 0, Skipped: 0, Time elapsed: 0.042 sec
25-Oct-2019 22:34:19 Running org.openmrs.module.reporting.report.util.SqlScriptParserTest
25-Oct-2019 22:34:19 Tests run: 4, Failures: 0, Errors: 0, Skipped: 0, Time elapsed: 0.002 sec
25-Oct-2019 22:34:19 Running org.openmrs.module.reporting.definition.library.implementerconfigured.ImplementerConfiguredDataSetDefinitionLibraryTest
25-Oct-2019 22:34:19 Tests run: 3, Failures: 0, Errors: 0, Skipped: 0, Time elapsed: 0.181 sec
25-Oct-2019 22:34:19 Running org.openmrs.module.reporting.cohort.definition.evaluator.PresenceOrAbsenceCohortDefinitionEvaluatorTest
25-Oct-2019 22:34:19 Tests run: 3, Failures: 0, Errors: 0, Skipped: 0, Time elapsed: 0.332 sec
25-Oct-2019 22:34:19 Running org.openmrs.module.reporting.report.definition.service.ReportDefinitionServiceImplTest
25-Oct-2019 22:34:19 Tests run: 2, Failures: 0, Errors: 0, Skipped: 0, Time elapsed: 0.09 sec
25-Oct-2019 22:34:19 Running org.openmrs.module.reporting.data.converter.ObsValueTextAsCodedConverterTest
25-Oct-2019 22:34:19 Tests run: 3, Failures: 0, Errors: 0, Skipped: 0, Time elapsed: 0.024 sec
25-Oct-2019 22:34:19 Running org.openmrs.module.reporting.cohort.definition.service.BaseCohortDefinitionServiceTest
25-Oct-2019 22:34:19 Tests run: 1, Failures: 0, Errors: 0, Skipped: 0, Time elapsed: 0.127 sec
25-Oct-2019 22:34:19 Running org.openmrs.module.reporting.cohort.definition.evaluator.InStateCohortDefinitionEvaluatorTest
25-Oct-2019 22:34:20 Cohort: Cohort id=null size=2
25-Oct-2019 22:34:20 Tests run: 7, Failures: 0, Errors: 0, Skipped: 0, Time elapsed: 1.086 sec
25-Oct-2019 22:34:20 Running org.openmrs.module.reporting.data.patient.evaluator.DefinitionLibraryPatientDataEvaluatorTest
25-Oct-2019 22:34:21 Tests run: 3, Failures: 0, Errors: 0, Skipped: 0, Time elapsed: 0.345 sec
25-Oct-2019 22:34:21 Running org.openmrs.module.reporting.cohort.definition.evaluator.DefinitionLibraryCohortDefinitionEvaluatorTest
25-Oct-2019 22:34:21 Tests run: 3, Failures: 0, Errors: 0, Skipped: 0, Time elapsed: 0.396 sec
25-Oct-2019 22:34:21 Running org.openmrs.module.reporting.dataset.definition.evaluator.CohortsWithVaryingParametersDataSetEvaluatorTest
25-Oct-2019 22:34:21 Tests run: 1, Failures: 0, Errors: 0, Skipped: 0, Time elapsed: 0.134 sec
25-Oct-2019 22:34:21 Running org.openmrs.module.reporting.dataset.definition.evaluator.ObsDataSetEvaluatorTest
25-Oct-2019 22:34:21 Tests run: 1, Failures: 0, Errors: 0, Skipped: 0, Time elapsed: 0.131 sec
25-Oct-2019 22:34:21 Running org.openmrs.module.reporting.data.patient.evaluator.SqlPatientDataEvaluatorTest
25-Oct-2019 22:34:21 Tests run: 1, Failures: 0, Errors: 0, Skipped: 0, Time elapsed: 0.108 sec
25-Oct-2019 22:34:21 Running org.openmrs.module.reporting.data.converter.PrivilegedDataConverterTest
25-Oct-2019 22:34:22 SLF4J: Class path contains multiple SLF4J bindings.
25-Oct-2019 22:34:22 SLF4J: Found binding in [jar:file:/home/bamboo-agent/.m2/repository/org/slf4j/slf4j-log4j12/1.6.0/slf4j-log4j12-1.6.0.jar!/org/slf4j/impl/StaticLoggerBinder.class]
25-Oct-2019 22:34:22 SLF4J: Found binding in [jar:file:/home/bamboo-agent/.m2/repository/org/slf4j/slf4j-log4j12/1.6.0/slf4j-log4j12-1.6.0.jar!/org/slf4j/impl/StaticLoggerBinder.class]
25-Oct-2019 22:34:22 SLF4J: See http://www.slf4j.org/codes.html#multiple_bindings for an explanation.
25-Oct-2019 22:34:23 Tests run: 2, Failures: 0, Errors: 0, Skipped: 0, Time elapsed: 1.056 sec
25-Oct-2019 22:34:23 Running org.openmrs.module.reporting.data.patient.evaluator.PatientCalculationDataEvaluatorTest
25-Oct-2019 22:34:23 ERROR - EvaluationProfiler.log(111) |2019-10-25 22:34:23,164| 1768        2019-10-25 22:34:23.164        >        ERROR        EVALUATING_DEFINITION                        PatientCalculationDataDefinition[Example]: Failed to evaluate No PatientCalculation found on this PatientCalculationDataDefinition
25-Oct-2019 22:34:23 org.openmrs.module.reporting.evaluation.EvaluationException: Failed to evaluate No PatientCalculation found on this PatientCalculationDataDefinition
25-Oct-2019 22:34:23         at org.openmrs.module.reporting.data.patient.evaluator.PatientCalculationDataEvaluator.evaluate(PatientCalculationDataEvaluator.java:50)
25-Oct-2019 22:34:23         at org.openmrs.module.reporting.data.patient.evaluator.PatientCalculationDataEvaluator.evaluate(PatientCalculationDataEvaluator.java:34)
25-Oct-2019 22:34:23         at org.openmrs.module.reporting.definition.service.BaseDefinitionService.executeEvaluator(BaseDefinitionService.java:369)
25-Oct-2019 22:34:23         at org.openmrs.module.reporting.data.patient.service.PatientDataServiceImpl.executeEvaluator(PatientDataServiceImpl.java:66)
25-Oct-2019 22:34:23         at org.openmrs.module.reporting.data.patient.service.PatientDataServiceImpl.executeEvaluator(PatientDataServiceImpl.java:34)
25-Oct-2019 22:34:23         at org.openmrs.module.reporting.definition.service.BaseDefinitionService.evaluateBypassingExclusionOfTestPatients(BaseDefinitionService.java:264)
25-Oct-2019 22:34:23         at org.openmrs.module.reporting.definition.service.BaseDefinitionService.evaluate(BaseDefinitionService.java:229)
25-Oct-2019 22:34:23         at org.openmrs.module.reporting.data.patient.service.PatientDataServiceImpl.evaluate(PatientDataServiceImpl.java:48)
25-Oct-2019 22:34:23         at sun.reflect.GeneratedMethodAccessor830.invoke(Unknown Source)
25-Oct-2019 22:34:23         at sun.reflect.DelegatingMethodAccessorImpl.invoke(DelegatingMethodAccessorImpl.java:43)
25-Oct-2019 22:34:23         at java.lang.reflect.Method.invoke(Method.java:498)
25-Oct-2019 22:34:23         at org.springframework.aop.support.AopUtils.invokeJoinpointUsingReflection(AopUtils.java:317)
25-Oct-2019 22:34:23         at org.springframework.aop.framework.ReflectiveMethodInvocation.invokeJoinpoint(ReflectiveMethodInvocation.java:190)
25-Oct-2019 22:34:23         at org.springframework.aop.framework.ReflectiveMethodInvocation.proceed(ReflectiveMethodInvocation.java:157)
25-Oct-2019 22:34:23         at org.openmrs.aop.LoggingAdvice.invoke(LoggingAdvice.java:121)
25-Oct-2019 22:34:23         at org.springframework.aop.framework.ReflectiveMethodInvocation.proceed(ReflectiveMethodInvocation.java:179)
25-Oct-2019 22:34:23         at org.springframework.aop.framework.adapter.MethodBeforeAdviceInterceptor.invoke(MethodBeforeAdviceInterceptor.java:52)
25-Oct-2019 22:34:23         at org.springframework.aop.framework.ReflectiveMethodInvocation.proceed(ReflectiveMethodInvocation.java:179)
25-Oct-2019 22:34:23         at org.springframework.aop.framework.adapter.MethodBeforeAdviceInterceptor.invoke(MethodBeforeAdviceInterceptor.java:52)
25-Oct-2019 22:34:23         at org.springframework.aop.framework.ReflectiveMethodInvocation.proceed(ReflectiveMethodInvocation.java:179)
25-Oct-2019 22:34:23         at org.springframework.aop.framework.JdkDynamicAopProxy.invoke(JdkDynamicAopProxy.java:207)
25-Oct-2019 22:34:23         at com.sun.proxy.$Proxy31.evaluate(Unknown Source)
25-Oct-2019 22:34:23         at sun.reflect.GeneratedMethodAccessor830.invoke(Unknown Source)
25-Oct-2019 22:34:23         at sun.reflect.DelegatingMethodAccessorImpl.invoke(DelegatingMethodAccessorImpl.java:43)
25-Oct-2019 22:34:23         at java.lang.reflect.Method.invoke(Method.java:498)
25-Oct-2019 22:34:23         at org.springframework.aop.support.AopUtils.invokeJoinpointUsingReflection(AopUtils.java:317)
25-Oct-2019 22:34:23         at org.springframework.aop.framework.JdkDynamicAopProxy.invoke(JdkDynamicAopProxy.java:201)
25-Oct-2019 22:34:23         at com.sun.proxy.$Proxy138.evaluate(Unknown Source)
25-Oct-2019 22:34:23         at org.openmrs.module.reporting.data.patient.evaluator.PatientCalculationDataEvaluatorTest.evaluate_shouldThrowAnErrorIfNoCalculationRegistrationExistsOnTheDefinition(PatientCalculationDataEvaluatorTest.java:90)
25-Oct-2019 22:34:23         at sun.reflect.NativeMethodAccessorImpl.invoke0(Native Method)
25-Oct-2019 22:34:23         at sun.reflect.NativeMethodAccessorImpl.invoke(NativeMethodAccessorImpl.java:62)
25-Oct-2019 22:34:23         at sun.reflect.DelegatingMethodAccessorImpl.invoke(DelegatingMethodAccessorImpl.java:43)
25-Oct-2019 22:34:23         at java.lang.reflect.Method.invoke(Method.java:498)
25-Oct-2019 22:34:23         at org.junit.runners.model.FrameworkMethod$1.runReflectiveCall(FrameworkMethod.java:47)
25-Oct-2019 22:34:23         at org.junit.internal.runners.model.ReflectiveCallable.run(ReflectiveCallable.java:12)
25-Oct-2019 22:34:23         at org.junit.runners.model.FrameworkMethod.invokeExplosively(FrameworkMethod.java:44)
25-Oct-2019 22:34:23         at org.junit.internal.runners.statements.InvokeMethod.evaluate(InvokeMethod.java:17)
25-Oct-2019 22:34:23         at org.junit.internal.runners.statements.ExpectException.evaluate(ExpectException.java:19)
25-Oct-2019 22:34:23         at org.junit.internal.runners.statements.RunBefores.evaluate(RunBefores.java:26)
25-Oct-2019 22:34:23         at org.springframework.test.context.junit4.statements.RunBeforeTestMethodCallbacks.evaluate(RunBeforeTestMethodCallbacks.java:73)
25-Oct-2019 22:34:23         at org.junit.internal.runners.statements.RunAfters.evaluate(RunAfters.java:27)
25-Oct-2019 22:34:23         at org.springframework.test.context.junit4.statements.RunAfterTestMethodCallbacks.evaluate(RunAfterTestMethodCallbacks.java:82)
25-Oct-2019 22:34:23         at org.springframework.test.context.junit4.statements.SpringRepeat.evaluate(SpringRepeat.java:73)
25-Oct-2019 22:34:23         at org.junit.runners.ParentRunner.runLeaf(ParentRunner.java:271)
25-Oct-2019 22:34:23         at org.springframework.test.context.junit4.SpringJUnit4ClassRunner.runChild(SpringJUnit4ClassRunner.java:217)
25-Oct-2019 22:34:23         at org.springframework.test.context.junit4.SpringJUnit4ClassRunner.runChild(SpringJUnit4ClassRunner.java:83)
25-Oct-2019 22:34:23         at org.junit.runners.ParentRunner$3.run(ParentRunner.java:238)
25-Oct-2019 22:34:23         at org.junit.runners.ParentRunner$1.schedule(ParentRunner.java:63)
25-Oct-2019 22:34:23         at org.junit.runners.ParentRunner.runChildren(ParentRunner.java:236)
25-Oct-2019 22:34:23         at org.junit.runners.ParentRunner.access$000(ParentRunner.java:53)
25-Oct-2019 22:34:23         at org.junit.runners.ParentRunner$2.evaluate(ParentRunner.java:229)
25-Oct-2019 22:34:23         at org.springframework.test.context.junit4.statements.RunBeforeTestClassCallbacks.evaluate(RunBeforeTestClassCallbacks.java:61)
25-Oct-2019 22:34:23         at org.junit.internal.runners.statements.RunAfters.evaluate(RunAfters.java:27)
25-Oct-2019 22:34:23         at org.springframework.test.context.junit4.statements.RunAfterTestClassCallbacks.evaluate(RunAfterTestClassCallbacks.java:68)
25-Oct-2019 22:34:23         at org.junit.runners.ParentRunner.run(ParentRunner.java:309)
25-Oct-2019 22:34:23         at org.springframework.test.context.junit4.SpringJUnit4ClassRunner.run(SpringJUnit4ClassRunner.java:163)
25-Oct-2019 22:34:23         at org.apache.maven.surefire.junit4.JUnit4TestSet.execute(JUnit4TestSet.java:59)
25-Oct-2019 22:34:23         at org.apache.maven.surefire.suite.AbstractDirectoryTestSuite.executeTestSet(AbstractDirectoryTestSuite.java:115)
25-Oct-2019 22:34:23         at org.apache.maven.surefire.suite.AbstractDirectoryTestSuite.execute(AbstractDirectoryTestSuite.java:102)
25-Oct-2019 22:34:23         at org.apache.maven.surefire.Surefire.run(Surefire.java:180)
25-Oct-2019 22:34:23         at sun.reflect.NativeMethodAccessorImpl.invoke0(Native Method)
25-Oct-2019 22:34:23         at sun.reflect.NativeMethodAccessorImpl.invoke(NativeMethodAccessorImpl.java:62)
25-Oct-2019 22:34:23         at sun.reflect.DelegatingMethodAccessorImpl.invoke(DelegatingMethodAccessorImpl.java:43)
25-Oct-2019 22:34:23         at java.lang.reflect.Method.invoke(Method.java:498)
25-Oct-2019 22:34:23         at org.apache.maven.surefire.booter.SurefireBooter.runSuitesInProcess(SurefireBooter.java:350)
25-Oct-2019 22:34:23         at org.apache.maven.surefire.booter.SurefireBooter.main(SurefireBooter.java:1021)
25-Oct-2019 22:34:23 Tests run: 2, Failures: 0, Errors: 0, Skipped: 0, Time elapsed: 0.218 sec
25-Oct-2019 22:34:23 Running org.openmrs.module.reporting.data.converter.DateConverterTest
25-Oct-2019 22:34:23 Tests run: 1, Failures: 0, Errors: 0, Skipped: 0, Time elapsed: 0.024 sec
25-Oct-2019 22:34:23 Running org.openmrs.module.reporting.dataset.definition.evaluator.EncounterAndObsDataSetEvaluatorTest
25-Oct-2019 22:34:23 Tests run: 1, Failures: 0, Errors: 0, Skipped: 0, Time elapsed: 0.238 sec
25-Oct-2019 22:34:23 Running org.openmrs.module.reporting.data.encounter.evaluator.PatientToEncounterDataEvaluatorTest
25-Oct-2019 22:34:23 Tests run: 3, Failures: 0, Errors: 0, Skipped: 0, Time elapsed: 0.39 sec
25-Oct-2019 22:34:23 Running org.openmrs.module.reporting.data.patient.evaluator.PatientIdDataEvaluatorTest
25-Oct-2019 22:34:24 Tests run: 1, Failures: 0, Errors: 0, Skipped: 0, Time elapsed: 0.113 sec
25-Oct-2019 22:34:24 Running org.openmrs.module.reporting.data.person.evaluator.RelationshipsForPersonDataEvaluatorTest
25-Oct-2019 22:34:24 Tests run: 3, Failures: 0, Errors: 0, Skipped: 0, Time elapsed: 0.374 sec
25-Oct-2019 22:34:24 Running org.openmrs.module.reporting.data.patient.evaluator.PersonToPatientDataEvaluatorTest
25-Oct-2019 22:34:24 Tests run: 1, Failures: 0, Errors: 0, Skipped: 0, Time elapsed: 0.112 sec
25-Oct-2019 22:34:24 Running org.openmrs.module.reporting.data.patient.service.PatientDataServiceImplTest
25-Oct-2019 22:34:25 Tests run: 6, Failures: 0, Errors: 0, Skipped: 0, Time elapsed: 1.156 sec
25-Oct-2019 22:34:25
25-Oct-2019 22:34:25 Results :
25-Oct-2019 22:34:25
25-Oct-2019 22:34:25 Tests run: 723, Failures: 0, Errors: 0, Skipped: 13
25-Oct-2019 22:34:25
25-Oct-2019 22:34:25 [INFO]
25-Oct-2019 22:34:25 [INFO] --- maven-jar-plugin:2.4:jar (default-jar) @ reporting-api-tests ---
25-Oct-2019 22:34:25 [WARNING] JAR will be empty - no content was marked for inclusion!
25-Oct-2019 22:34:25 [INFO] Building jar: /home/bamboo-agent/bamboo-agent/xml-data/build-dir/REP-REP-T2DOT0/api-tests/target/reporting-api-tests-1.19.0-SNAPSHOT.jar
25-Oct-2019 22:34:25 [INFO]
25-Oct-2019 22:34:25 [INFO] --- maven-jar-plugin:2.4:test-jar (default) @ reporting-api-tests ---
25-Oct-2019 22:34:26 [INFO] Building jar: /home/bamboo-agent/bamboo-agent/xml-data/build-dir/REP-REP-T2DOT0/api-tests/target/reporting-api-tests-1.19.0-SNAPSHOT-tests.jar
25-Oct-2019 22:34:26 [INFO]                                                                         
25-Oct-2019 22:34:26 [INFO] ------------------------------------------------------------------------
25-Oct-2019 22:34:26 [INFO] Building reporting Module api 1.10 1.19.0-SNAPSHOT
25-Oct-2019 22:34:26 [INFO] ------------------------------------------------------------------------
25-Oct-2019 22:34:26 [INFO]
25-Oct-2019 22:34:26 [INFO] --- maven-clean-plugin:2.5:clean (default-clean) @ reporting-api-1.10 ---
25-Oct-2019 22:34:26 [INFO]
25-Oct-2019 22:34:26 [INFO] --- maven-resources-plugin:2.6:resources (default-resources) @ reporting-api-1.10 ---
25-Oct-2019 22:34:26 [INFO] Using 'UTF-8' encoding to copy filtered resources.
25-Oct-2019 22:34:26 [INFO] skip non existing resourceDirectory /home/bamboo-agent/bamboo-agent/xml-data/build-dir/REP-REP-T2DOT0/api-1.10/src/main/resources
25-Oct-2019 22:34:26 [INFO]
25-Oct-2019 22:34:26 [INFO] --- maven-compiler-plugin:3.1:compile (default-compile) @ reporting-api-1.10 ---
25-Oct-2019 22:34:26 [INFO] Changes detected - recompiling the module!
25-Oct-2019 22:34:26 [INFO] Compiling 3 source files to /home/bamboo-agent/bamboo-agent/xml-data/build-dir/REP-REP-T2DOT0/api-1.10/target/classes
25-Oct-2019 22:34:26 [INFO]
25-Oct-2019 22:34:26 [INFO] --- build-helper-maven-plugin:1.7:parse-version (default) @ reporting-api-1.10 ---
25-Oct-2019 22:34:26 [INFO]
25-Oct-2019 22:34:26 [INFO] --- maven-resources-plugin:2.6:testResources (default-testResources) @ reporting-api-1.10 ---
25-Oct-2019 22:34:26 [INFO] Using 'UTF-8' encoding to copy filtered resources.
25-Oct-2019 22:34:26 [INFO] Copying 1 resource
25-Oct-2019 22:34:26 [INFO] Copying 0 resource
25-Oct-2019 22:34:26 [INFO]
25-Oct-2019 22:34:26 [INFO] --- maven-compiler-plugin:3.1:testCompile (default-testCompile) @ reporting-api-1.10 ---
25-Oct-2019 22:34:26 [INFO] Changes detected - recompiling the module!
25-Oct-2019 22:34:26 [INFO] Compiling 2 source files to /home/bamboo-agent/bamboo-agent/xml-data/build-dir/REP-REP-T2DOT0/api-1.10/target/test-classes
25-Oct-2019 22:34:26 [WARNING] /home/bamboo-agent/bamboo-agent/xml-data/build-dir/REP-REP-T2DOT0/api-1.10/src/test/java/org/openmrs/module/reporting/cohort/definition/evaluator/DrugOrderCohortDefinitionEvaluatorTest.java: /home/bamboo-agent/bamboo-agent/xml-data/build-dir/REP-REP-T2DOT0/api-1.10/src/test/java/org/openmrs/module/reporting/cohort/definition/evaluator/DrugOrderCohortDefinitionEvaluatorTest.java uses or overrides a deprecated API.
25-Oct-2019 22:34:26 [WARNING] /home/bamboo-agent/bamboo-agent/xml-data/build-dir/REP-REP-T2DOT0/api-1.10/src/test/java/org/openmrs/module/reporting/cohort/definition/evaluator/DrugOrderCohortDefinitionEvaluatorTest.java: Recompile with -Xlint:deprecation for details.
25-Oct-2019 22:34:26 [WARNING] /home/bamboo-agent/bamboo-agent/xml-data/build-dir/REP-REP-T2DOT0/api-1.10/src/test/java/org/openmrs/module/reporting/cohort/definition/evaluator/DrugOrderCohortDefinitionEvaluatorTest.java: /home/bamboo-agent/bamboo-agent/xml-data/build-dir/REP-REP-T2DOT0/api-1.10/src/test/java/org/openmrs/module/reporting/cohort/definition/evaluator/DrugOrderCohortDefinitionEvaluatorTest.java uses unchecked or unsafe operations.
25-Oct-2019 22:34:26 [WARNING] /home/bamboo-agent/bamboo-agent/xml-data/build-dir/REP-REP-T2DOT0/api-1.10/src/test/java/org/openmrs/module/reporting/cohort/definition/evaluator/DrugOrderCohortDefinitionEvaluatorTest.java: Recompile with -Xlint:unchecked for details.
25-Oct-2019 22:34:26 [INFO]
25-Oct-2019 22:34:26 [INFO] --- maven-surefire-plugin:2.5:test (default-test) @ reporting-api-1.10 ---
25-Oct-2019 22:34:26 [INFO] Surefire report directory: /home/bamboo-agent/bamboo-agent/xml-data/build-dir/REP-REP-T2DOT0/api-1.10/target/surefire-reports
25-Oct-2019 22:34:26 OpenJDK 64-Bit Server VM warning: ignoring option MaxPermSize=512m; support was removed in 8.0
25-Oct-2019 22:34:27
25-Oct-2019 22:34:27 -------------------------------------------------------
25-Oct-2019 22:34:27 T E S T S
25-Oct-2019 22:34:27 -------------------------------------------------------
25-Oct-2019 22:34:27 Running org.openmrs.module.reporting.cohort.definition.evaluator.DrugOrderCohortDefinitionEvaluatorTest
25-Oct-2019 22:34:27 log4j:WARN No appenders could be found for logger (org.springframework.test.context.junit4.SpringJUnit4ClassRunner).
25-Oct-2019 22:34:27 log4j:WARN Please initialize the log4j system properly.
25-Oct-2019 22:34:46 Tests run: 18, Failures: 0, Errors: 0, Skipped: 0, Time elapsed: 19.755 sec
25-Oct-2019 22:34:46 Running org.openmrs.module.reporting.cohort.definition.library.BuiltInCohortDefinitionLibrary1_10Test
25-Oct-2019 22:34:46 Tests run: 1, Failures: 0, Errors: 0, Skipped: 0, Time elapsed: 0.006 sec
25-Oct-2019 22:34:46
25-Oct-2019 22:34:46 Results :
25-Oct-2019 22:34:46
25-Oct-2019 22:34:46 Tests run: 19, Failures: 0, Errors: 0, Skipped: 0
25-Oct-2019 22:34:46
25-Oct-2019 22:34:47 [INFO]
25-Oct-2019 22:34:47 [INFO] --- maven-jar-plugin:2.4:jar (default-jar) @ reporting-api-1.10 ---
25-Oct-2019 22:34:47 [INFO] Building jar: /home/bamboo-agent/bamboo-agent/xml-data/build-dir/REP-REP-T2DOT0/api-1.10/target/reporting-api-1.10-1.19.0-SNAPSHOT.jar
25-Oct-2019 22:34:47 [INFO]
25-Oct-2019 22:34:47 [INFO] --- maven-jar-plugin:2.4:test-jar (default) @ reporting-api-1.10 ---
25-Oct-2019 22:34:47 [INFO] Building jar: /home/bamboo-agent/bamboo-agent/xml-data/build-dir/REP-REP-T2DOT0/api-1.10/target/reporting-api-1.10-1.19.0-SNAPSHOT-tests.jar
25-Oct-2019 22:34:47 [INFO]                                                                         
25-Oct-2019 22:34:47 [INFO] ------------------------------------------------------------------------
25-Oct-2019 22:34:47 [INFO] Building reporting Module api 2.2 1.19.0-SNAPSHOT
25-Oct-2019 22:34:47 [INFO] ------------------------------------------------------------------------
25-Oct-2019 22:34:48 [INFO]
25-Oct-2019 22:34:48 [INFO] --- maven-clean-plugin:2.5:clean (default-clean) @ reporting-api-2.2 ---
25-Oct-2019 22:34:48 [INFO]
25-Oct-2019 22:34:48 [INFO] --- maven-resources-plugin:2.6:resources (default-resources) @ reporting-api-2.2 ---
25-Oct-2019 22:34:48 [INFO] Using 'UTF-8' encoding to copy filtered resources.
25-Oct-2019 22:34:48 [INFO] skip non existing resourceDirectory /home/bamboo-agent/bamboo-agent/xml-data/build-dir/REP-REP-T2DOT0/api-2.2/src/main/resources
25-Oct-2019 22:34:48 [INFO]
25-Oct-2019 22:34:48 [INFO] --- maven-compiler-plugin:3.1:compile (default-compile) @ reporting-api-2.2 ---
25-Oct-2019 22:34:48 [INFO] Changes detected - recompiling the module!
25-Oct-2019 22:34:48 [INFO] Compiling 3 source files to /home/bamboo-agent/bamboo-agent/xml-data/build-dir/REP-REP-T2DOT0/api-2.2/target/classes
25-Oct-2019 22:34:49 [INFO]
25-Oct-2019 22:34:49 [INFO] --- build-helper-maven-plugin:1.7:parse-version (default) @ reporting-api-2.2 ---
25-Oct-2019 22:34:49 [INFO]
25-Oct-2019 22:34:49 [INFO] --- maven-resources-plugin:2.6:testResources (default-testResources) @ reporting-api-2.2 ---
25-Oct-2019 22:34:49 [INFO] Using 'UTF-8' encoding to copy filtered resources.
25-Oct-2019 22:34:49 [INFO] Copying 1 resource
25-Oct-2019 22:34:49 [INFO] Copying 0 resource
25-Oct-2019 22:34:49 [INFO]
25-Oct-2019 22:34:49 [INFO] --- maven-compiler-plugin:3.1:testCompile (default-testCompile) @ reporting-api-2.2 ---
25-Oct-2019 22:34:49 [INFO] Changes detected - recompiling the module!
25-Oct-2019 22:34:49 [INFO] Compiling 2 source files to /home/bamboo-agent/bamboo-agent/xml-data/build-dir/REP-REP-T2DOT0/api-2.2/target/test-classes
25-Oct-2019 22:34:49 [INFO]
25-Oct-2019 22:34:49 [INFO] --- maven-surefire-plugin:2.5:test (default-test) @ reporting-api-2.2 ---
25-Oct-2019 22:34:49 [INFO] Surefire report directory: /home/bamboo-agent/bamboo-agent/xml-data/build-dir/REP-REP-T2DOT0/api-2.2/target/surefire-reports
25-Oct-2019 22:34:49 OpenJDK 64-Bit Server VM warning: ignoring option MaxPermSize=512m; support was removed in 8.0
25-Oct-2019 22:34:50
25-Oct-2019 22:34:50 -------------------------------------------------------
25-Oct-2019 22:34:50 T E S T S
25-Oct-2019 22:34:50 -------------------------------------------------------
25-Oct-2019 22:34:50 Running org.openmrs.module.reporting.cohort.definition.evaluator.ConditionCohortDefinitionEvaluatorTest
25-Oct-2019 22:34:50 log4j:WARN No appenders could be found for logger (org.springframework.test.context.junit4.SpringJUnit4ClassRunner).
25-Oct-2019 22:34:50 log4j:WARN Please initialize the log4j system properly.
25-Oct-2019 22:35:07 Tests run: 12, Failures: 0, Errors: 0, Skipped: 0, Time elapsed: 17.436 sec
25-Oct-2019 22:35:07 Running org.openmrs.module.reporting.cohort.definition.library.BuiltInCohortDefinitionLibrary2_2Test
25-Oct-2019 22:35:07 Tests run: 1, Failures: 0, Errors: 0, Skipped: 0, Time elapsed: 0.008 sec
25-Oct-2019 22:35:07
25-Oct-2019 22:35:07 Results :
25-Oct-2019 22:35:07
25-Oct-2019 22:35:07 Tests run: 13, Failures: 0, Errors: 0, Skipped: 0
25-Oct-2019 22:35:07
25-Oct-2019 22:35:07 [INFO]
25-Oct-2019 22:35:07 [INFO] --- maven-jar-plugin:2.4:jar (default-jar) @ reporting-api-2.2 ---
25-Oct-2019 22:35:07 [INFO] Building jar: /home/bamboo-agent/bamboo-agent/xml-data/build-dir/REP-REP-T2DOT0/api-2.2/target/reporting-api-2.2-1.19.0-SNAPSHOT.jar
25-Oct-2019 22:35:07 [INFO]
25-Oct-2019 22:35:07 [INFO] --- maven-jar-plugin:2.4:test-jar (default) @ reporting-api-2.2 ---
25-Oct-2019 22:35:07 [INFO] Building jar: /home/bamboo-agent/bamboo-agent/xml-data/build-dir/REP-REP-T2DOT0/api-2.2/target/reporting-api-2.2-1.19.0-SNAPSHOT-tests.jar
25-Oct-2019 22:35:07 [INFO]                                                                         
25-Oct-2019 22:35:07 [INFO] ------------------------------------------------------------------------
25-Oct-2019 22:35:07 [INFO] Building Reporting OMOD 1.19.0-SNAPSHOT
25-Oct-2019 22:35:07 [INFO] ------------------------------------------------------------------------
25-Oct-2019 22:35:07 [INFO]
25-Oct-2019 22:35:07 [INFO] --- maven-clean-plugin:2.5:clean (default-clean) @ reporting-omod ---
25-Oct-2019 22:35:08 [INFO]
25-Oct-2019 22:35:08 [INFO] --- maven-openmrs-plugin:1.0.1:initialize-module (init) @ reporting-omod ---
25-Oct-2019 22:35:08 [INFO]
25-Oct-2019 22:35:08 [INFO] --- maven-dependency-plugin:2.8:unpack-dependencies (Expand resources) @ reporting-omod ---
25-Oct-2019 22:35:08 [INFO] Unpacking /home/bamboo-agent/bamboo-agent/xml-data/build-dir/REP-REP-T2DOT0/api/target/reporting-api-1.19.0-SNAPSHOT.jar to /home/bamboo-agent/bamboo-agent/xml-data/build-dir/REP-REP-T2DOT0/omod/target/classes with includes "**\/*.xml,**\/*.properties" and excludes ""
25-Oct-2019 22:35:08 [INFO]
25-Oct-2019 22:35:08 [INFO] --- maven-resources-plugin:2.6:resources (default-resources) @ reporting-omod ---
25-Oct-2019 22:35:08 [INFO] Using 'UTF-8' encoding to copy filtered resources.
25-Oct-2019 22:35:08 [INFO] Copying 0 resource
25-Oct-2019 22:35:08 [INFO] Copying 2 resources
25-Oct-2019 22:35:08 [INFO] Copying 224 resources to web/module
25-Oct-2019 22:35:08 [INFO] Copying 224 resources to web/module
25-Oct-2019 22:35:08 [INFO]
25-Oct-2019 22:35:08 [INFO] --- maven-compiler-plugin:3.1:compile (default-compile) @ reporting-omod ---
25-Oct-2019 22:35:08 [INFO] Changes detected - recompiling the module!
25-Oct-2019 22:35:08 [INFO] Compiling 113 source files to /home/bamboo-agent/bamboo-agent/xml-data/build-dir/REP-REP-T2DOT0/omod/target/classes
25-Oct-2019 22:35:10 [WARNING] /home/bamboo-agent/bamboo-agent/xml-data/build-dir/REP-REP-T2DOT0/omod/src/main/java/org/openmrs/module/reporting/web/reports/RunReportListController.java: Some input files use or override a deprecated API.
25-Oct-2019 22:35:10 [WARNING] /home/bamboo-agent/bamboo-agent/xml-data/build-dir/REP-REP-T2DOT0/omod/src/main/java/org/openmrs/module/reporting/web/reports/RunReportListController.java: Recompile with -Xlint:deprecation for details.
25-Oct-2019 22:35:10 [WARNING] /home/bamboo-agent/bamboo-agent/xml-data/build-dir/REP-REP-T2DOT0/omod/src/main/java/org/openmrs/module/reporting/web/controller/SqlDefinitionController.java: Some input files use unchecked or unsafe operations.
25-Oct-2019 22:35:10 [WARNING] /home/bamboo-agent/bamboo-agent/xml-data/build-dir/REP-REP-T2DOT0/omod/src/main/java/org/openmrs/module/reporting/web/controller/SqlDefinitionController.java: Recompile with -Xlint:unchecked for details.
25-Oct-2019 22:35:10 [INFO]
25-Oct-2019 22:35:10 [INFO] --- build-helper-maven-plugin:1.7:parse-version (default) @ reporting-omod ---
25-Oct-2019 22:35:10 [INFO]
25-Oct-2019 22:35:10 [INFO] --- maven-resources-plugin:2.6:testResources (default-testResources) @ reporting-omod ---
25-Oct-2019 22:35:10 [INFO] Using 'UTF-8' encoding to copy filtered resources.
25-Oct-2019 22:35:10 [INFO] skip non existing resourceDirectory /home/bamboo-agent/bamboo-agent/xml-data/build-dir/REP-REP-T2DOT0/omod/src/test/resources
25-Oct-2019 22:35:10 [INFO] skip non existing resourceDirectory /home/bamboo-agent/bamboo-agent/xml-data/build-dir/REP-REP-T2DOT0/omod/src/test/resources
25-Oct-2019 22:35:10 [INFO]
25-Oct-2019 22:35:10 [INFO] --- maven-compiler-plugin:3.1:testCompile (default-testCompile) @ reporting-omod ---
25-Oct-2019 22:35:10 [INFO] No sources to compile
25-Oct-2019 22:35:10 [INFO]
25-Oct-2019 22:35:10 [INFO] --- maven-surefire-plugin:2.5:test (default-test) @ reporting-omod ---
25-Oct-2019 22:35:10 [INFO] No tests to run.
25-Oct-2019 22:35:10 [INFO]
25-Oct-2019 22:35:10 [INFO] --- maven-jar-plugin:2.4:jar (default-jar) @ reporting-omod ---
25-Oct-2019 22:35:10 [INFO] Building jar: /home/bamboo-agent/bamboo-agent/xml-data/build-dir/REP-REP-T2DOT0/omod/target/reporting-1.19.0-SNAPSHOT.jar
25-Oct-2019 22:35:10 [INFO]
25-Oct-2019 22:35:10 [INFO] --- maven-openmrs-plugin:1.0.1:package-module (pack) @ reporting-omod ---
25-Oct-2019 22:35:10 [INFO] Packaging OpenMRS module
25-Oct-2019 22:35:11 [INFO] Building jar: /home/bamboo-agent/bamboo-agent/xml-data/build-dir/REP-REP-T2DOT0/omod/target/reporting-1.19.0-SNAPSHOT.omod
25-Oct-2019 22:35:12 [INFO]
25-Oct-2019 22:35:12 [INFO] --- maven-jar-plugin:2.4:test-jar (default) @ reporting-omod ---
25-Oct-2019 22:35:12 [WARNING] JAR will be empty - no content was marked for inclusion!
25-Oct-2019 22:35:12 [INFO] Building jar: /home/bamboo-agent/bamboo-agent/xml-data/build-dir/REP-REP-T2DOT0/omod/target/reporting-1.19.0-SNAPSHOT-tests.jar
25-Oct-2019 22:35:12 [INFO] ------------------------------------------------------------------------
25-Oct-2019 22:35:12 [INFO] Reactor Summary:
25-Oct-2019 22:35:12 [INFO]
25-Oct-2019 22:35:12 [INFO] Reporting .......................................... SUCCESS [  2.808 s]
25-Oct-2019 22:35:12 [INFO] Reporting API ...................................... SUCCESS [ 13.754 s]
25-Oct-2019 22:35:12 [INFO] reporting Module api 1.9 ........................... SUCCESS [  2.026 s]
25-Oct-2019 22:35:12 [INFO] reporting Module api 2.0 ........................... SUCCESS [  0.643 s]
25-Oct-2019 22:35:12 [INFO] reporting API Tests ................................ SUCCESS [01:46 min]
25-Oct-2019 22:35:12 [INFO] reporting Module api 1.10 .......................... SUCCESS [ 20.991 s]
25-Oct-2019 22:35:12 [INFO] reporting Module api 2.2 ........................... SUCCESS [ 20.525 s]
25-Oct-2019 22:35:12 [INFO] Reporting OMOD ..................................... SUCCESS [  5.057 s]
25-Oct-2019 22:35:12 [INFO] ------------------------------------------------------------------------
25-Oct-2019 22:35:12 [INFO] BUILD SUCCESS
25-Oct-2019 22:35:12 [INFO] ------------------------------------------------------------------------
25-Oct-2019 22:35:12 [INFO] Total time: 02:52 min
25-Oct-2019 22:35:12 [INFO] Finished at: 2019-10-25T22:35:12+00:00
25-Oct-2019 22:35:13 [INFO] Final Memory: 63M/409M
25-Oct-2019 22:35:13 [INFO] ------------------------------------------------------------------------
25-Oct-2019 22:35:13 Parsing test results under /home/bamboo-agent/bamboo-agent/xml-data/build-dir/REP-REP-T2DOT0...
25-Oct-2019 22:35:13 Finished task 'Maven 3.x' with result: Success
25-Oct-2019 22:35:13 Running post build plugin 'Docker Container Cleanup'
25-Oct-2019 22:35:13 Running post build plugin 'NCover Results Collector'
25-Oct-2019 22:35:13 Running post build plugin 'Clover Results Collector'
25-Oct-2019 22:35:13 Running post build plugin 'Sauce OnDemand Post Runner'
25-Oct-2019 22:35:13 Running post build plugin 'npm Cache Cleanup'
25-Oct-2019 22:35:13 Running post build plugin 'Artifact Copier'
25-Oct-2019 22:35:13 Finalising the build...
25-Oct-2019 22:35:13 Stopping timer.
25-Oct-2019 22:35:13 Build REP-REP-T2DOT0-795 completed.
25-Oct-2019 22:35:13 Running on server: post build plugin 'NCover Results Collector'
25-Oct-2019 22:35:13 Running on server: post build plugin 'Build Hanging Detection Configuration'
25-Oct-2019 22:35:13 Running on server: post build plugin 'Clover Delta Calculator'
25-Oct-2019 22:35:13 Running on server: post build plugin 'Maven Dependencies Postprocessor'
25-Oct-2019 22:35:13 All post build plugins have finished
25-Oct-2019 22:35:13 Generating build results summary...
25-Oct-2019 22:35:14 Saving build results to disk...
25-Oct-2019 22:35:14 Logging substituted variables...
25-Oct-2019 22:35:14 Indexing build results...
25-Oct-2019 22:35:14 Finished building REP-REP-T2DOT0-795.