More details of the release in https://wiki.openmrs.org/x/i4DTAw

Build: #795 was successful

Job: Test against 2.1 was successful

Build log

The build generated 1,774 lines of output.The output is too long and has been truncated to the last 1,000 lines. Download or view full build log

25-Oct-2019 22:32:41         at org.springframework.transaction.interceptor.TransactionInterceptor$1.proceedWithInvocation(TransactionInterceptor.java:99)
25-Oct-2019 22:32:41         at org.springframework.transaction.interceptor.TransactionAspectSupport.invokeWithinTransaction(TransactionAspectSupport.java:281)
25-Oct-2019 22:32:41         at org.springframework.transaction.interceptor.TransactionInterceptor.invoke(TransactionInterceptor.java:96)
25-Oct-2019 22:32:41         at org.springframework.aop.framework.ReflectiveMethodInvocation.proceed(ReflectiveMethodInvocation.java:179)
25-Oct-2019 22:32:41         at org.springframework.cache.interceptor.CacheInterceptor$1.invoke(CacheInterceptor.java:52)
25-Oct-2019 22:32:41         at org.springframework.cache.interceptor.CacheAspectSupport.execute(CacheAspectSupport.java:303)
25-Oct-2019 22:32:41         at org.springframework.cache.interceptor.CacheInterceptor.invoke(CacheInterceptor.java:61)
25-Oct-2019 22:32:41         at org.springframework.aop.framework.ReflectiveMethodInvocation.proceed(ReflectiveMethodInvocation.java:179)
25-Oct-2019 22:32:41         at org.openmrs.aop.LoggingAdvice.invoke(LoggingAdvice.java:121)
25-Oct-2019 22:32:41         at org.springframework.aop.framework.ReflectiveMethodInvocation.proceed(ReflectiveMethodInvocation.java:179)
25-Oct-2019 22:32:41         at org.springframework.aop.framework.adapter.MethodBeforeAdviceInterceptor.invoke(MethodBeforeAdviceInterceptor.java:52)
25-Oct-2019 22:32:41         at org.springframework.aop.framework.ReflectiveMethodInvocation.proceed(ReflectiveMethodInvocation.java:179)
25-Oct-2019 22:32:41         at org.springframework.aop.framework.adapter.MethodBeforeAdviceInterceptor.invoke(MethodBeforeAdviceInterceptor.java:52)
25-Oct-2019 22:32:41         at org.springframework.aop.framework.ReflectiveMethodInvocation.proceed(ReflectiveMethodInvocation.java:179)
25-Oct-2019 22:32:41         at org.springframework.aop.framework.JdkDynamicAopProxy.invoke(JdkDynamicAopProxy.java:207)
25-Oct-2019 22:32:41         at com.sun.proxy.$Proxy34.evaluateToList(Unknown Source)
25-Oct-2019 22:32:41         at sun.reflect.GeneratedMethodAccessor363.invoke(Unknown Source)
25-Oct-2019 22:32:41         at sun.reflect.DelegatingMethodAccessorImpl.invoke(DelegatingMethodAccessorImpl.java:43)
25-Oct-2019 22:32:41         at java.lang.reflect.Method.invoke(Method.java:498)
25-Oct-2019 22:32:41         at org.springframework.aop.support.AopUtils.invokeJoinpointUsingReflection(AopUtils.java:317)
25-Oct-2019 22:32:41         at org.springframework.aop.framework.ReflectiveMethodInvocation.invokeJoinpoint(ReflectiveMethodInvocation.java:190)
25-Oct-2019 22:32:41         at org.springframework.aop.framework.ReflectiveMethodInvocation.proceed(ReflectiveMethodInvocation.java:157)
25-Oct-2019 22:32:41         at org.springframework.transaction.interceptor.TransactionInterceptor$1.proceedWithInvocation(TransactionInterceptor.java:99)
25-Oct-2019 22:32:41         at org.springframework.transaction.interceptor.TransactionAspectSupport.invokeWithinTransaction(TransactionAspectSupport.java:281)
25-Oct-2019 22:32:41         at org.springframework.transaction.interceptor.TransactionInterceptor.invoke(TransactionInterceptor.java:96)
25-Oct-2019 22:32:41         at org.springframework.aop.framework.ReflectiveMethodInvocation.proceed(ReflectiveMethodInvocation.java:179)
25-Oct-2019 22:32:41         at org.springframework.aop.framework.JdkDynamicAopProxy.invoke(JdkDynamicAopProxy.java:207)
25-Oct-2019 22:32:41         at com.sun.proxy.$Proxy137.evaluateToList(Unknown Source)
25-Oct-2019 22:32:41         at org.openmrs.module.reporting.cohort.definition.evaluator.SqlCohortDefinitionEvaluator.evaluate(SqlCohortDefinitionEvaluator.java:61)
25-Oct-2019 22:32:41         at org.openmrs.module.reporting.cohort.definition.evaluator.SqlCohortDefinitionEvaluator.evaluate(SqlCohortDefinitionEvaluator.java:28)
25-Oct-2019 22:32:41         at org.openmrs.module.reporting.definition.service.BaseDefinitionService.executeEvaluator(BaseDefinitionService.java:369)
25-Oct-2019 22:32:41         at org.openmrs.module.reporting.definition.service.BaseDefinitionService.evaluateBypassingExclusionOfTestPatients(BaseDefinitionService.java:264)
25-Oct-2019 22:32:41         at org.openmrs.module.reporting.cohort.definition.service.CohortDefinitionServiceImpl.evaluateBypassingExclusionOfTestPatients(CohortDefinitionServiceImpl.java:54)
25-Oct-2019 22:32:41         at org.openmrs.module.reporting.cohort.definition.service.CohortDefinitionServiceImpl.evaluateBypassingExclusionOfTestPatients(CohortDefinitionServiceImpl.java:24)
25-Oct-2019 22:32:41         at org.openmrs.module.reporting.definition.service.BaseDefinitionService.evaluate(BaseDefinitionService.java:229)
25-Oct-2019 22:32:41         at org.openmrs.module.reporting.cohort.definition.service.CohortDefinitionServiceImpl.evaluate(CohortDefinitionServiceImpl.java:38)
25-Oct-2019 22:32:41         at sun.reflect.GeneratedMethodAccessor362.invoke(Unknown Source)
25-Oct-2019 22:32:41         at sun.reflect.DelegatingMethodAccessorImpl.invoke(DelegatingMethodAccessorImpl.java:43)
25-Oct-2019 22:32:41         at java.lang.reflect.Method.invoke(Method.java:498)
25-Oct-2019 22:32:41         at org.springframework.aop.support.AopUtils.invokeJoinpointUsingReflection(AopUtils.java:317)
25-Oct-2019 22:32:41         at org.springframework.aop.framework.ReflectiveMethodInvocation.invokeJoinpoint(ReflectiveMethodInvocation.java:190)
25-Oct-2019 22:32:41         at org.springframework.aop.framework.ReflectiveMethodInvocation.proceed(ReflectiveMethodInvocation.java:157)
25-Oct-2019 22:32:41         at org.springframework.cache.interceptor.CacheInterceptor$1.invoke(CacheInterceptor.java:52)
25-Oct-2019 22:32:41         at org.springframework.cache.interceptor.CacheAspectSupport.execute(CacheAspectSupport.java:303)
25-Oct-2019 22:32:41         at org.springframework.cache.interceptor.CacheInterceptor.invoke(CacheInterceptor.java:61)
25-Oct-2019 22:32:41         at org.springframework.aop.framework.ReflectiveMethodInvocation.proceed(ReflectiveMethodInvocation.java:179)
25-Oct-2019 22:32:41         at org.openmrs.aop.LoggingAdvice.invoke(LoggingAdvice.java:121)
25-Oct-2019 22:32:41         at org.springframework.aop.framework.ReflectiveMethodInvocation.proceed(ReflectiveMethodInvocation.java:179)
25-Oct-2019 22:32:41         at org.springframework.aop.framework.adapter.MethodBeforeAdviceInterceptor.invoke(MethodBeforeAdviceInterceptor.java:52)
25-Oct-2019 22:32:41         at org.springframework.aop.framework.ReflectiveMethodInvocation.proceed(ReflectiveMethodInvocation.java:179)
25-Oct-2019 22:32:41         at org.springframework.aop.framework.adapter.MethodBeforeAdviceInterceptor.invoke(MethodBeforeAdviceInterceptor.java:52)
25-Oct-2019 22:32:41         at org.springframework.aop.framework.ReflectiveMethodInvocation.proceed(ReflectiveMethodInvocation.java:179)
25-Oct-2019 22:32:41         at org.springframework.aop.framework.JdkDynamicAopProxy.invoke(JdkDynamicAopProxy.java:207)
25-Oct-2019 22:32:41         at com.sun.proxy.$Proxy45.evaluate(Unknown Source)
25-Oct-2019 22:32:41         at sun.reflect.GeneratedMethodAccessor362.invoke(Unknown Source)
25-Oct-2019 22:32:41         at sun.reflect.DelegatingMethodAccessorImpl.invoke(DelegatingMethodAccessorImpl.java:43)
25-Oct-2019 22:32:41         at java.lang.reflect.Method.invoke(Method.java:498)
25-Oct-2019 22:32:41         at org.springframework.aop.support.AopUtils.invokeJoinpointUsingReflection(AopUtils.java:317)
25-Oct-2019 22:32:41         at org.springframework.aop.framework.JdkDynamicAopProxy.invoke(JdkDynamicAopProxy.java:201)
25-Oct-2019 22:32:41         at com.sun.proxy.$Proxy139.evaluate(Unknown Source)
25-Oct-2019 22:32:41         at org.openmrs.module.reporting.cohort.definition.evaluator.SqlCohortDefinitionEvaluatorTest.shouldProtectSqlQueryAgainstDatabaseModifications(SqlCohortDefinitionEvaluatorTest.java:308)
25-Oct-2019 22:32:41         at sun.reflect.NativeMethodAccessorImpl.invoke0(Native Method)
25-Oct-2019 22:32:41         at sun.reflect.NativeMethodAccessorImpl.invoke(NativeMethodAccessorImpl.java:62)
25-Oct-2019 22:32:41         at sun.reflect.DelegatingMethodAccessorImpl.invoke(DelegatingMethodAccessorImpl.java:43)
25-Oct-2019 22:32:41         at java.lang.reflect.Method.invoke(Method.java:498)
25-Oct-2019 22:32:41         at org.junit.runners.model.FrameworkMethod$1.runReflectiveCall(FrameworkMethod.java:47)
25-Oct-2019 22:32:41         at org.junit.internal.runners.model.ReflectiveCallable.run(ReflectiveCallable.java:12)
25-Oct-2019 22:32:41         at org.junit.runners.model.FrameworkMethod.invokeExplosively(FrameworkMethod.java:44)
25-Oct-2019 22:32:41         at org.junit.internal.runners.statements.InvokeMethod.evaluate(InvokeMethod.java:17)
25-Oct-2019 22:32:41         at org.junit.internal.runners.statements.ExpectException.evaluate(ExpectException.java:19)
25-Oct-2019 22:32:41         at org.junit.internal.runners.statements.RunBefores.evaluate(RunBefores.java:26)
25-Oct-2019 22:32:41         at org.springframework.test.context.junit4.statements.RunBeforeTestMethodCallbacks.evaluate(RunBeforeTestMethodCallbacks.java:73)
25-Oct-2019 22:32:41         at org.junit.internal.runners.statements.RunAfters.evaluate(RunAfters.java:27)
25-Oct-2019 22:32:41         at org.springframework.test.context.junit4.statements.RunAfterTestMethodCallbacks.evaluate(RunAfterTestMethodCallbacks.java:82)
25-Oct-2019 22:32:41         at org.springframework.test.context.junit4.statements.SpringRepeat.evaluate(SpringRepeat.java:73)
25-Oct-2019 22:32:41         at org.junit.runners.ParentRunner.runLeaf(ParentRunner.java:271)
25-Oct-2019 22:32:41         at org.springframework.test.context.junit4.SpringJUnit4ClassRunner.runChild(SpringJUnit4ClassRunner.java:217)
25-Oct-2019 22:32:41         at org.springframework.test.context.junit4.SpringJUnit4ClassRunner.runChild(SpringJUnit4ClassRunner.java:83)
25-Oct-2019 22:32:41         at org.junit.runners.ParentRunner$3.run(ParentRunner.java:238)
25-Oct-2019 22:32:41         at org.junit.runners.ParentRunner$1.schedule(ParentRunner.java:63)
25-Oct-2019 22:32:41         at org.junit.runners.ParentRunner.runChildren(ParentRunner.java:236)
25-Oct-2019 22:32:41         at org.junit.runners.ParentRunner.access$000(ParentRunner.java:53)
25-Oct-2019 22:32:41         at org.junit.runners.ParentRunner$2.evaluate(ParentRunner.java:229)
25-Oct-2019 22:32:41         at org.springframework.test.context.junit4.statements.RunBeforeTestClassCallbacks.evaluate(RunBeforeTestClassCallbacks.java:61)
25-Oct-2019 22:32:41         at org.junit.internal.runners.statements.RunAfters.evaluate(RunAfters.java:27)
25-Oct-2019 22:32:41         at org.springframework.test.context.junit4.statements.RunAfterTestClassCallbacks.evaluate(RunAfterTestClassCallbacks.java:68)
25-Oct-2019 22:32:41         at org.junit.runners.ParentRunner.run(ParentRunner.java:309)
25-Oct-2019 22:32:41         at org.springframework.test.context.junit4.SpringJUnit4ClassRunner.run(SpringJUnit4ClassRunner.java:163)
25-Oct-2019 22:32:41         at org.apache.maven.surefire.junit4.JUnit4TestSet.execute(JUnit4TestSet.java:59)
25-Oct-2019 22:32:41         at org.apache.maven.surefire.suite.AbstractDirectoryTestSuite.executeTestSet(AbstractDirectoryTestSuite.java:115)
25-Oct-2019 22:32:41         at org.apache.maven.surefire.suite.AbstractDirectoryTestSuite.execute(AbstractDirectoryTestSuite.java:102)
25-Oct-2019 22:32:41         at org.apache.maven.surefire.Surefire.run(Surefire.java:180)
25-Oct-2019 22:32:41         at sun.reflect.NativeMethodAccessorImpl.invoke0(Native Method)
25-Oct-2019 22:32:41         at sun.reflect.NativeMethodAccessorImpl.invoke(NativeMethodAccessorImpl.java:62)
25-Oct-2019 22:32:41         at sun.reflect.DelegatingMethodAccessorImpl.invoke(DelegatingMethodAccessorImpl.java:43)
25-Oct-2019 22:32:41         at java.lang.reflect.Method.invoke(Method.java:498)
25-Oct-2019 22:32:41         at org.apache.maven.surefire.booter.SurefireBooter.runSuitesInProcess(SurefireBooter.java:350)
25-Oct-2019 22:32:41         at org.apache.maven.surefire.booter.SurefireBooter.main(SurefireBooter.java:1021)
25-Oct-2019 22:32:41 Caused by: org.hibernate.exception.GenericJDBCException: error executing work
25-Oct-2019 22:32:41         at org.hibernate.exception.internal.StandardSQLExceptionConverter.convert(StandardSQLExceptionConverter.java:54)
25-Oct-2019 22:32:41         at org.hibernate.engine.jdbc.spi.SqlExceptionHelper.convert(SqlExceptionHelper.java:126)
25-Oct-2019 22:32:41         at org.hibernate.engine.jdbc.spi.SqlExceptionHelper.convert(SqlExceptionHelper.java:112)
25-Oct-2019 22:32:41         at org.hibernate.engine.jdbc.internal.JdbcCoordinatorImpl.coordinateWork(JdbcCoordinatorImpl.java:318)
25-Oct-2019 22:32:41         at org.hibernate.internal.SessionImpl.doWork(SessionImpl.java:2095)
25-Oct-2019 22:32:41         at org.hibernate.internal.SessionImpl.doWork(SessionImpl.java:2080)
25-Oct-2019 22:32:41         at org.openmrs.api.db.hibernate.DbSession.doWork(DbSession.java:1005)
25-Oct-2019 22:32:41         at org.openmrs.module.reporting.evaluation.querybuilder.SqlQueryBuilder.evaluateToList(SqlQueryBuilder.java:152)
25-Oct-2019 22:32:41         ... 106 more
25-Oct-2019 22:32:41 Caused by: org.h2.jdbc.JdbcSQLException: Method is only allowed for a query. Use execute or executeUpdate instead of executeQuery; SQL statement:
25-Oct-2019 22:32:41 update person set gender='F'  [90002-173]
25-Oct-2019 22:32:41         at org.h2.message.DbException.getJdbcSQLException(DbException.java:331)
25-Oct-2019 22:32:41         at org.h2.message.DbException.get(DbException.java:171)
25-Oct-2019 22:32:41         at org.h2.message.DbException.get(DbException.java:148)
25-Oct-2019 22:32:41         at org.h2.message.DbException.get(DbException.java:137)
25-Oct-2019 22:32:41         at org.h2.command.Prepared.query(Prepared.java:211)
25-Oct-2019 22:32:41         at org.h2.command.CommandContainer.query(CommandContainer.java:91)
25-Oct-2019 22:32:41         at org.h2.command.Command.executeQuery(Command.java:195)
25-Oct-2019 22:32:41         at org.h2.jdbc.JdbcPreparedStatement.executeQuery(JdbcPreparedStatement.java:106)
25-Oct-2019 22:32:41         at com.mchange.v2.c3p0.impl.NewProxyPreparedStatement.executeQuery(NewProxyPreparedStatement.java:116)
25-Oct-2019 22:32:41         at org.openmrs.module.reporting.evaluation.querybuilder.SqlQueryBuilder$2.execute(SqlQueryBuilder.java:159)
25-Oct-2019 22:32:41         at org.hibernate.jdbc.WorkExecutor.executeWork(WorkExecutor.java:54)
25-Oct-2019 22:32:41         at org.hibernate.internal.SessionImpl$2.accept(SessionImpl.java:2076)
25-Oct-2019 22:32:41         at org.hibernate.internal.SessionImpl$2.accept(SessionImpl.java:2073)
25-Oct-2019 22:32:41         at org.hibernate.engine.jdbc.internal.JdbcCoordinatorImpl.coordinateWork(JdbcCoordinatorImpl.java:313)
25-Oct-2019 22:32:41         ... 110 more
25-Oct-2019 22:32:41 Tests run: 13, Failures: 0, Errors: 0, Skipped: 0, Time elapsed: 2.143 sec
25-Oct-2019 22:32:41 Running org.openmrs.module.reporting.evaluation.service.EvaluationServiceTest
25-Oct-2019 22:32:43 Tests run: 6, Failures: 0, Errors: 0, Skipped: 0, Time elapsed: 1.694 sec
25-Oct-2019 22:32:43 Running org.openmrs.module.reporting.data.obs.evaluator.EncounterToObsDataEvaluatorTest
25-Oct-2019 22:32:43 Tests run: 3, Failures: 0, Errors: 0, Skipped: 0, Time elapsed: 0.467 sec
25-Oct-2019 22:32:43 Running org.openmrs.module.reporting.query.encounter.evaluator.MappedParametersEncounterQueryEvaluatorTest
25-Oct-2019 22:32:44 Tests run: 1, Failures: 0, Errors: 0, Skipped: 0, Time elapsed: 0.192 sec
25-Oct-2019 22:32:44 Running org.openmrs.module.reporting.validator.InStateCohortDefinitionValidatorTest
25-Oct-2019 22:32:44 Tests run: 3, Failures: 0, Errors: 0, Skipped: 0, Time elapsed: 0.091 sec
25-Oct-2019 22:32:44 Running org.openmrs.module.reporting.common.ReflectionUtilTest
25-Oct-2019 22:32:44 Tests run: 6, Failures: 0, Errors: 0, Skipped: 0, Time elapsed: 0.006 sec
25-Oct-2019 22:32:44 Running org.openmrs.module.reporting.template.HandlebarsHelpersTest
25-Oct-2019 22:32:44 Tests run: 3, Failures: 0, Errors: 0, Skipped: 0, Time elapsed: 0.42 sec
25-Oct-2019 22:32:44 Running org.openmrs.module.reporting.data.visit.evaluator.VisitIdDataEvaluatorTest
25-Oct-2019 22:32:45 Tests run: 2, Failures: 0, Errors: 0, Skipped: 0, Time elapsed: 0.465 sec
25-Oct-2019 22:32:45 Running org.openmrs.module.reporting.cohort.definition.evaluator.ConditionalParameterCohortDefinitionEvaluatorTest
25-Oct-2019 22:32:45 Tests run: 1, Failures: 0, Errors: 0, Skipped: 0, Time elapsed: 0.234 sec
25-Oct-2019 22:32:45 Running org.openmrs.module.reporting.data.patient.evaluator.CurrentPatientStateDataEvaluatorTest
25-Oct-2019 22:32:45 Tests run: 1, Failures: 0, Errors: 0, Skipped: 0, Time elapsed: 0.138 sec
25-Oct-2019 22:32:45 Running org.openmrs.module.reporting.data.encounter.evaluator.ObsOnSameDateEncounterDataEvaluatorTest
25-Oct-2019 22:32:45 Tests run: 3, Failures: 0, Errors: 0, Skipped: 0, Time elapsed: 0.505 sec
25-Oct-2019 22:32:45 Running org.openmrs.module.reporting.cohort.query.service.CohortQueryServiceTest
25-Oct-2019 22:32:46 Tests run: 1, Failures: 0, Errors: 0, Skipped: 0, Time elapsed: 0.122 sec
25-Oct-2019 22:32:46 Running org.openmrs.module.reporting.data.person.evaluator.ObsForPersonDataEvaluatorTest
25-Oct-2019 22:32:46 Tests run: 3, Failures: 0, Errors: 0, Skipped: 0, Time elapsed: 0.509 sec
25-Oct-2019 22:32:46 Running org.openmrs.module.reporting.validator.StaticCohortDefinitionValidatorTest
25-Oct-2019 22:32:46 Tests run: 1, Failures: 0, Errors: 0, Skipped: 0, Time elapsed: 0.034 sec
25-Oct-2019 22:32:46 Running org.openmrs.module.reporting.dataset.definition.evaluator.EncounterDataSetEvaluatorTest
25-Oct-2019 22:32:46 ENCOUNTER ID        EMR ID        BIRTHDATE           ENCOUNTER DATE        Age At Start        Age At End        
25-Oct-2019 22:32:46 ------------        ------        ------------        --------------        ------------        ----------        
25-Oct-2019 22:32:46 3                   7             ~25/Aug/1976        01/Aug/2008           33                  34                
25-Oct-2019 22:32:46 4                   7             ~25/Aug/1976        15/Aug/2008           33                  34                
25-Oct-2019 22:32:46 5                   7             ~25/Aug/1976        19/Aug/2008           33                  34                
25-Oct-2019 22:32:46 6                   20            08/Feb/1925         19/Aug/2009           80                  80                
25-Oct-2019 22:32:46 7                   21            ~08/Jun/1959        19/Aug/2009           50                  51                
25-Oct-2019 22:32:46 8                   21            ~08/Jun/1959        19/Sep/2009           50                  51                
25-Oct-2019 22:32:46 9                   22            08/Jul/1997         19/Sep/2009           12                  13                
25-Oct-2019 22:32:46 10                  22            08/Jul/1997         19/Oct/2009           12                  13                
25-Oct-2019 22:32:46 11                  23            08/Nov/2000         19/Aug/2009           9                   10                
25-Oct-2019 22:32:46 12                  24            08/Dec/2006         19/Sep/2009           3                   4                 
25-Oct-2019 22:32:46 Tests run: 1, Failures: 0, Errors: 0, Skipped: 0, Time elapsed: 0.206 sec
25-Oct-2019 22:32:46 Running org.openmrs.module.reporting.data.person.evaluator.BirthdateDataEvaluatorTest
25-Oct-2019 22:32:46 Tests run: 1, Failures: 0, Errors: 0, Skipped: 0, Time elapsed: 0.129 sec
25-Oct-2019 22:32:46 Running org.openmrs.module.reporting.cohort.definition.evaluator.EncounterCohortDefinitionEvaluatorTest
25-Oct-2019 22:32:48 Tests run: 9, Failures: 0, Errors: 0, Skipped: 2, Time elapsed: 1.086 sec
25-Oct-2019 22:32:48 Running org.openmrs.module.reporting.data.person.evaluator.PreferredAddressDataEvaluatorTest
25-Oct-2019 22:32:48 Tests run: 1, Failures: 0, Errors: 0, Skipped: 0, Time elapsed: 0.178 sec
25-Oct-2019 22:32:48 Running org.openmrs.module.reporting.cohort.definition.evaluator.GenderCohortDefinitionEvaluatorTest
25-Oct-2019 22:32:49 Tests run: 5, Failures: 0, Errors: 0, Skipped: 0, Time elapsed: 0.831 sec
25-Oct-2019 22:32:49 Running org.openmrs.module.reporting.data.converter.BirthdateConverterTest
25-Oct-2019 22:32:49 Tests run: 1, Failures: 0, Errors: 0, Skipped: 0, Time elapsed: 0.024 sec
25-Oct-2019 22:32:49 Running org.openmrs.module.reporting.data.patient.evaluator.ProgramStatesForPatientDataEvaluatorTest
25-Oct-2019 22:32:50 Tests run: 9, Failures: 0, Errors: 0, Skipped: 0, Time elapsed: 1.352 sec
25-Oct-2019 22:32:50 Running org.openmrs.module.reporting.data.visit.library.BuiltInVisitDataLibraryTest
25-Oct-2019 22:32:50 Tests run: 1, Failures: 0, Errors: 0, Skipped: 0, Time elapsed: 0.034 sec
25-Oct-2019 22:32:50 Running org.openmrs.module.reporting.cohort.definition.evaluator.AgeCohortDefinitionEvaluatorTest
25-Oct-2019 22:32:50 Tests run: 5, Failures: 0, Errors: 0, Skipped: 0, Time elapsed: 0.243 sec
25-Oct-2019 22:32:50 Running org.openmrs.module.reporting.data.encounter.evaluator.EncounterLocationDataEvaluatorTest
25-Oct-2019 22:32:51 Tests run: 3, Failures: 0, Errors: 0, Skipped: 0, Time elapsed: 0.36 sec
25-Oct-2019 22:32:51 Running org.openmrs.module.reporting.data.obs.evaluator.PersonToObsEvaluatorTest
25-Oct-2019 22:32:51 Tests run: 3, Failures: 0, Errors: 0, Skipped: 0, Time elapsed: 0.422 sec
25-Oct-2019 22:32:51 Running org.openmrs.module.reporting.common.DateRangeTest
25-Oct-2019 22:32:51 Tests run: 9, Failures: 0, Errors: 0, Skipped: 0, Time elapsed: 0.005 sec
25-Oct-2019 22:32:51 Running org.openmrs.module.reporting.cohort.definition.evaluator.NumericObsCohortDefinitionEvaluatorTest
25-Oct-2019 22:32:53 Tests run: 11, Failures: 0, Errors: 0, Skipped: 0, Time elapsed: 1.63 sec
25-Oct-2019 22:32:53 Running org.openmrs.module.reporting.indicator.QueryCountIndicatorEvaluatorTest
25-Oct-2019 22:32:53 Tests run: 3, Failures: 0, Errors: 0, Skipped: 0, Time elapsed: 0.369 sec
25-Oct-2019 22:32:53 Running org.openmrs.module.reporting.data.encounter.evaluator.ObsForEncounterEvaluatorTest
25-Oct-2019 22:32:54 Tests run: 7, Failures: 0, Errors: 0, Skipped: 0, Time elapsed: 1.036 sec
25-Oct-2019 22:32:54 Running org.openmrs.module.reporting.common.DateUtilTest
25-Oct-2019 22:32:54 Tests run: 15, Failures: 0, Errors: 0, Skipped: 0, Time elapsed: 0.092 sec
25-Oct-2019 22:32:54 Running org.openmrs.module.reporting.data.patient.evaluator.DrugOrdersForPatientDataEvaluatorTest
25-Oct-2019 22:32:56 Tests run: 8, Failures: 0, Errors: 0, Skipped: 0, Time elapsed: 1.773 sec
25-Oct-2019 22:32:56 Running org.openmrs.module.reporting.query.encounter.evaluator.MappedParametersObsQueryEvaluatorTest
25-Oct-2019 22:32:57 Tests run: 1, Failures: 0, Errors: 0, Skipped: 0, Time elapsed: 0.814 sec
25-Oct-2019 22:32:57 Running org.openmrs.module.reporting.serializer.ReportingSerializerTest
25-Oct-2019 22:32:57 Tests run: 6, Failures: 0, Errors: 0, Skipped: 0, Time elapsed: 0.143 sec
25-Oct-2019 22:32:57 Running org.openmrs.module.reporting.dataset.definition.evaluator.CohortCrossTabDataSetEvaluatorTest
25-Oct-2019 22:32:57 Tests run: 1, Failures: 0, Errors: 0, Skipped: 0, Time elapsed: 0.168 sec
25-Oct-2019 22:32:57 Running org.openmrs.module.reporting.query.person.service.PersonQueryServiceImplTest
25-Oct-2019 22:32:57 Tests run: 2, Failures: 0, Errors: 0, Skipped: 0, Time elapsed: 0.282 sec
25-Oct-2019 22:32:57 Running org.openmrs.module.reporting.dataset.definition.evaluator.MySqlDataSetEvaluatorTest
25-Oct-2019 22:32:57 Tests run: 1, Failures: 0, Errors: 0, Skipped: 1, Time elapsed: 0 sec
25-Oct-2019 22:32:57 Running org.openmrs.module.reporting.report.renderer.TextTemplateRendererTest
25-Oct-2019 22:32:58 Tests run: 3, Failures: 0, Errors: 0, Skipped: 0, Time elapsed: 0.793 sec
25-Oct-2019 22:32:58 Running org.openmrs.module.reporting.validator.InverseCohortDefinitionValidatorTest
25-Oct-2019 22:32:58 Tests run: 2, Failures: 0, Errors: 0, Skipped: 0, Time elapsed: 0.02 sec
25-Oct-2019 22:32:58 Running org.openmrs.module.reporting.validator.PatientStateCohortDefinitionValidatorTest
25-Oct-2019 22:32:58 Tests run: 3, Failures: 0, Errors: 0, Skipped: 0, Time elapsed: 0.027 sec
25-Oct-2019 22:32:58 Running org.openmrs.module.reporting.report.service.db.PropertiesTypeTest
25-Oct-2019 22:32:58 Tests run: 1, Failures: 0, Errors: 0, Skipped: 0, Time elapsed: 0.002 sec
25-Oct-2019 22:32:58 Running org.openmrs.module.reporting.query.encounter.evaluator.ObsForEncounterQueryEvaluatorTest
25-Oct-2019 22:33:00 Tests run: 8, Failures: 0, Errors: 0, Skipped: 0, Time elapsed: 1.433 sec
25-Oct-2019 22:33:00 Running org.openmrs.module.reporting.data.encounter.service.EncounterDataServiceImplTest
25-Oct-2019 22:33:00 Tests run: 2, Failures: 0, Errors: 0, Skipped: 0, Time elapsed: 0.322 sec
25-Oct-2019 22:33:00 Running org.openmrs.module.reporting.cohort.definition.evaluator.MappedParametersCohortDefinitionEvaluatorTest
25-Oct-2019 22:33:00 Tests run: 1, Failures: 0, Errors: 0, Skipped: 0, Time elapsed: 0.11 sec
25-Oct-2019 22:33:00 Running org.openmrs.module.reporting.data.encounter.evaluator.ConvertedEncounterDataEvaluatorTest
25-Oct-2019 22:33:00 Tests run: 1, Failures: 0, Errors: 0, Skipped: 0, Time elapsed: 0.124 sec
25-Oct-2019 22:33:00 Running org.openmrs.module.reporting.data.patient.evaluator.PatientIdentifierDataEvaluatorTest
25-Oct-2019 22:33:01 Tests run: 4, Failures: 0, Errors: 0, Skipped: 0, Time elapsed: 0.469 sec
25-Oct-2019 22:33:01 Running org.openmrs.module.reporting.data.converter.ListConverterTest
25-Oct-2019 22:33:01 Tests run: 6, Failures: 0, Errors: 0, Skipped: 0, Time elapsed: 0.002 sec
25-Oct-2019 22:33:01 Running org.openmrs.module.reporting.data.converter.ObsFromObsGroupConverterTest
25-Oct-2019 22:33:01 Tests run: 2, Failures: 0, Errors: 0, Skipped: 0, Time elapsed: 0.021 sec
25-Oct-2019 22:33:01 Running org.openmrs.module.reporting.common.AgeTest
25-Oct-2019 22:33:01 Tests run: 5, Failures: 0, Errors: 0, Skipped: 0, Time elapsed: 0.002 sec
25-Oct-2019 22:33:01 Running org.openmrs.module.reporting.evaluation.CachingCohortDefinitionTest
25-Oct-2019 22:33:01 Tests run: 1, Failures: 0, Errors: 0, Skipped: 0, Time elapsed: 0.162 sec
25-Oct-2019 22:33:01 Running org.openmrs.module.reporting.common.TestUtil
25-Oct-2019 22:33:01 Tests run: 1, Failures: 0, Errors: 0, Skipped: 1, Time elapsed: 0.002 sec
25-Oct-2019 22:33:01 Running org.openmrs.module.reporting.query.encounter.evaluator.CompositionEncounterQueryEvaluatorTest
25-Oct-2019 22:33:01 Tests run: 4, Failures: 0, Errors: 0, Skipped: 0, Time elapsed: 0.535 sec
25-Oct-2019 22:33:01 Running org.openmrs.module.reporting.definition.library.implementerconfigured.ImplementerConfiguredVisitDataDefinitionLibraryTest
25-Oct-2019 22:33:01 Tests run: 2, Failures: 0, Errors: 0, Skipped: 0, Time elapsed: 0.042 sec
25-Oct-2019 22:33:01 Running org.openmrs.module.reporting.common.ObjectUtilTest
25-Oct-2019 22:33:02 Tests run: 23, Failures: 0, Errors: 0, Skipped: 0, Time elapsed: 0.661 sec
25-Oct-2019 22:33:02 Running org.openmrs.module.reporting.data.person.evaluator.AgeDataEvaluatorTest
25-Oct-2019 22:33:02 Tests run: 2, Failures: 0, Errors: 0, Skipped: 0, Time elapsed: 0.381 sec
25-Oct-2019 22:33:02 Running org.openmrs.module.reporting.evaluation.querybuilder.HqlQueryBuilderTest
25-Oct-2019 22:33:07 Tests run: 39, Failures: 0, Errors: 0, Skipped: 0, Time elapsed: 4.776 sec
25-Oct-2019 22:33:07 Running org.openmrs.module.reporting.data.visit.evaluator.ObsForVisitDataEvaluatorTest
25-Oct-2019 22:33:07 Tests run: 2, Failures: 0, Errors: 0, Skipped: 0, Time elapsed: 0.253 sec
25-Oct-2019 22:33:07 Running org.openmrs.module.reporting.query.encounter.evaluator.MostRecentEncounterForPatientQueryEvaluatorTest
25-Oct-2019 22:33:08 Tests run: 1, Failures: 0, Errors: 0, Skipped: 0, Time elapsed: 0.127 sec
25-Oct-2019 22:33:08 Running org.openmrs.module.reporting.cohort.definition.evaluator.OptionalParameterCohortDefinitionEvaluatorTest
25-Oct-2019 22:33:08 Tests run: 1, Failures: 0, Errors: 0, Skipped: 0, Time elapsed: 0.126 sec
25-Oct-2019 22:33:08 Running org.openmrs.module.reporting.report.util.SqlUtilsTest
25-Oct-2019 22:33:08 Tests run: 3, Failures: 0, Errors: 0, Skipped: 0, Time elapsed: 0.002 sec
25-Oct-2019 22:33:08 Running org.openmrs.module.reporting.validator.InProgramCohortDefinitionValidatorTest
25-Oct-2019 22:33:08 Tests run: 3, Failures: 0, Errors: 0, Skipped: 0, Time elapsed: 0.028 sec
25-Oct-2019 22:33:08 Running org.openmrs.module.reporting.data.obs.evaluator.PatientToObsDataEvaluatorTest
25-Oct-2019 22:33:08 Tests run: 3, Failures: 0, Errors: 0, Skipped: 0, Time elapsed: 0.402 sec
25-Oct-2019 22:33:08 Running org.openmrs.module.reporting.definition.library.BaseDefinitionLibraryTest
25-Oct-2019 22:33:08 Tests run: 4, Failures: 0, Errors: 0, Skipped: 0, Time elapsed: 0.057 sec
25-Oct-2019 22:33:08 Running org.openmrs.module.reporting.data.person.evaluator.PersonAttributeDataEvaluatorTest
25-Oct-2019 22:33:08 Tests run: 1, Failures: 0, Errors: 0, Skipped: 0, Time elapsed: 0.152 sec
25-Oct-2019 22:33:08 Running org.openmrs.module.reporting.data.person.evaluator.PreferredNameDataEvaluatorTest
25-Oct-2019 22:33:09 Tests run: 3, Failures: 0, Errors: 0, Skipped: 0, Time elapsed: 0.437 sec
25-Oct-2019 22:33:09 Running org.openmrs.module.reporting.definition.library.implementerconfigured.ImplementerConfiguredCohortDefinitionLibraryTest
25-Oct-2019 22:33:09 Tests run: 3, Failures: 0, Errors: 0, Skipped: 0, Time elapsed: 0.227 sec
25-Oct-2019 22:33:09 Running org.openmrs.module.reporting.evaluation.parameter.ParameterUtilTest
25-Oct-2019 22:33:09 Tests run: 2, Failures: 0, Errors: 0, Skipped: 0, Time elapsed: 0.032 sec
25-Oct-2019 22:33:09 Running org.openmrs.module.reporting.data.encounter.library.BuiltInEncounterDataLibraryTest
25-Oct-2019 22:33:09 Tests run: 6, Failures: 0, Errors: 0, Skipped: 0, Time elapsed: 0.182 sec
25-Oct-2019 22:33:09 Running org.openmrs.module.reporting.cohort.definition.evaluator.ScriptedCohortDefinitionEvaluatorTest
25-Oct-2019 22:33:09 Tests run: 1, Failures: 0, Errors: 0, Skipped: 0, Time elapsed: 0.073 sec
25-Oct-2019 22:33:09 Running org.openmrs.module.reporting.data.converter.PersonNameConverterTest
25-Oct-2019 22:33:09 Tests run: 1, Failures: 0, Errors: 0, Skipped: 0, Time elapsed: 0.014 sec
25-Oct-2019 22:33:09 Running org.openmrs.module.reporting.definition.library.AllDefinitionLibrariesComponentTest
25-Oct-2019 22:33:09 Tests run: 2, Failures: 0, Errors: 0, Skipped: 0, Time elapsed: 0.022 sec
25-Oct-2019 22:33:09 Running org.openmrs.module.reporting.data.person.evaluator.VitalStatusDataEvaluatorTest
25-Oct-2019 22:33:09 Tests run: 1, Failures: 0, Errors: 0, Skipped: 0, Time elapsed: 0.136 sec
25-Oct-2019 22:33:09 Running org.openmrs.module.reporting.dataset.definition.evaluator.PatientDataSetEvaluatorTest
25-Oct-2019 22:33:10 Tests run: 8, Failures: 0, Errors: 0, Skipped: 0, Time elapsed: 1.05 sec
25-Oct-2019 22:33:10 Running org.openmrs.module.reporting.cohort.definition.evaluator.TextObsCohortDefinitionEvaluatorTest
25-Oct-2019 22:33:11 Tests run: 2, Failures: 0, Errors: 0, Skipped: 0, Time elapsed: 0.304 sec
25-Oct-2019 22:33:11 Running org.openmrs.module.reporting.data.encounter.evaluator.AuditInfoEncounterDataEvaluatorTest
25-Oct-2019 22:33:11 Tests run: 1, Failures: 0, Errors: 0, Skipped: 0, Time elapsed: 0.048 sec
25-Oct-2019 22:33:11 Running org.openmrs.module.reporting.data.patient.evaluator.LogicDataEvaluatorTest
25-Oct-2019 22:33:11 Tests run: 1, Failures: 0, Errors: 0, Skipped: 1, Time elapsed: 0 sec
25-Oct-2019 22:33:11 Running org.openmrs.module.reporting.data.visit.evaluator.PersonToVisitDataEvaluatorTest
25-Oct-2019 22:33:11 Tests run: 3, Failures: 0, Errors: 0, Skipped: 0, Time elapsed: 0.518 sec
25-Oct-2019 22:33:11 Running org.openmrs.module.reporting.cohort.definition.evaluator.DateObsCohortDefinitionEvaluatorTest
25-Oct-2019 22:33:12 Tests run: 3, Failures: 0, Errors: 0, Skipped: 0, Time elapsed: 0.416 sec
25-Oct-2019 22:33:12 Running org.openmrs.module.reporting.cohort.definition.evaluator.VisitCohortDefinitionEvaluatorTest
25-Oct-2019 22:33:12 Tests run: 13, Failures: 0, Errors: 0, Skipped: 0, Time elapsed: 0.238 sec
25-Oct-2019 22:33:12 Running org.openmrs.module.reporting.data.encounter.evaluator.AgeAtEncounterDataEvaluatorTest
25-Oct-2019 22:33:12 Tests run: 1, Failures: 0, Errors: 0, Skipped: 0, Time elapsed: 0.169 sec
25-Oct-2019 22:33:12 Running org.openmrs.module.reporting.indicator.CohortIndicatorDataSetEvaluatorTest
25-Oct-2019 22:33:12 Tests run: 1, Failures: 0, Errors: 0, Skipped: 0, Time elapsed: 0.165 sec
25-Oct-2019 22:33:12 Running org.openmrs.module.reporting.data.person.evaluator.ObsActiveListPersonDataEvaluatorTest
25-Oct-2019 22:33:13 Tests run: 1, Failures: 0, Errors: 0, Skipped: 0, Time elapsed: 0.207 sec
25-Oct-2019 22:33:13 Running org.openmrs.module.reporting.common.ExcelUtilTest
25-Oct-2019 22:33:13 Tests run: 5, Failures: 0, Errors: 0, Skipped: 0, Time elapsed: 0.249 sec
25-Oct-2019 22:33:13 Running org.openmrs.module.reporting.data.obs.evaluator.GroupMemberObsDataEvaluatorTest
25-Oct-2019 22:33:13 Tests run: 5, Failures: 0, Errors: 0, Skipped: 2, Time elapsed: 0.474 sec
25-Oct-2019 22:33:13 Running org.openmrs.module.reporting.query.visit.evaluator.BasicVisitQueryEvaluatorTest
25-Oct-2019 22:33:14 Tests run: 3, Failures: 0, Errors: 0, Skipped: 0, Time elapsed: 0.836 sec
25-Oct-2019 22:33:14 Running org.openmrs.module.reporting.common.ExcelBuilderTest
25-Oct-2019 22:33:18 Tests run: 3, Failures: 0, Errors: 0, Skipped: 0, Time elapsed: 3.926 sec
25-Oct-2019 22:33:18 Running org.openmrs.module.reporting.query.obs.evaluator.AllObsQueryEvaluatorTest
25-Oct-2019 22:33:19 Tests run: 5, Failures: 0, Errors: 0, Skipped: 0, Time elapsed: 0.954 sec
25-Oct-2019 22:33:19 Running org.openmrs.module.reporting.cohort.definition.evaluator.AllPatientsCohortDefinitionEvaluatorTest
25-Oct-2019 22:33:19 Tests run: 1, Failures: 0, Errors: 0, Skipped: 0, Time elapsed: 0.154 sec
25-Oct-2019 22:33:19 Running org.openmrs.module.reporting.data.encounter.evaluator.SimultaneousEncountersDataEvaluatorTest
25-Oct-2019 22:33:19 Tests run: 2, Failures: 0, Errors: 0, Skipped: 0, Time elapsed: 0.196 sec
25-Oct-2019 22:33:19 Running org.openmrs.module.reporting.validator.ProgramEnrollmentCohortDefinitionValidatorTest
25-Oct-2019 22:33:19 Tests run: 3, Failures: 0, Errors: 0, Skipped: 0, Time elapsed: 0.026 sec
25-Oct-2019 22:33:19 Running org.openmrs.module.reporting.evaluation.EvaluationContextTest
25-Oct-2019 22:33:19 Tests run: 4, Failures: 0, Errors: 0, Skipped: 0, Time elapsed: 0.038 sec
25-Oct-2019 22:33:19 Running org.openmrs.module.reporting.data.patient.evaluator.PreferredIdentifierDataEvaluatorTest
25-Oct-2019 22:33:20 Tests run: 2, Failures: 0, Errors: 0, Skipped: 0, Time elapsed: 0.324 sec
25-Oct-2019 22:33:20 Running org.openmrs.module.reporting.data.encounter.evaluator.EncounterVisitDataEvaluatorTest
25-Oct-2019 22:33:20 Tests run: 1, Failures: 0, Errors: 0, Skipped: 0, Time elapsed: 0.171 sec
25-Oct-2019 22:33:20 Running org.openmrs.module.reporting.query.obs.service.ObsQueryServiceImplTest
25-Oct-2019 22:33:20 Tests run: 2, Failures: 0, Errors: 0, Skipped: 1, Time elapsed: 0.168 sec
25-Oct-2019 22:33:20 Running org.openmrs.module.reporting.data.patient.library.BuiltInPatientDataLibraryTest
25-Oct-2019 22:33:20 Tests run: 4, Failures: 0, Errors: 0, Skipped: 0, Time elapsed: 0.14 sec
25-Oct-2019 22:33:20 Running org.openmrs.module.reporting.indicator.util.IndicatorUtilTest
25-Oct-2019 22:33:20 Tests run: 1, Failures: 0, Errors: 0, Skipped: 0, Time elapsed: 0.002 sec
25-Oct-2019 22:33:20 Running org.openmrs.module.reporting.cohort.definition.evaluator.EvaluatableCohortDefinitionEvaluatorTest
25-Oct-2019 22:33:20 Tests run: 1, Failures: 0, Errors: 0, Skipped: 0, Time elapsed: 0.019 sec
25-Oct-2019 22:33:20 Running org.openmrs.module.reporting.data.patient.evaluator.ConvertedPatientDataEvaluatorTest
25-Oct-2019 22:33:21 Tests run: 2, Failures: 0, Errors: 0, Skipped: 0, Time elapsed: 0.351 sec
25-Oct-2019 22:33:21 Running org.openmrs.module.reporting.cohort.definition.evaluator.CompositionCohortDefinitionEvaluatorTest
25-Oct-2019 22:33:21 Tests run: 4, Failures: 0, Errors: 0, Skipped: 0, Time elapsed: 0.552 sec
25-Oct-2019 22:33:21 Running org.openmrs.module.reporting.data.converter.MapConverterTest
25-Oct-2019 22:33:21 Tests run: 5, Failures: 0, Errors: 0, Skipped: 0, Time elapsed: 0.004 sec
25-Oct-2019 22:33:21 Running org.openmrs.module.reporting.data.patient.evaluator.EncountersForPatientDataEvaluatorTest
25-Oct-2019 22:33:21 Tests run: 1, Failures: 0, Errors: 0, Skipped: 0, Time elapsed: 0.177 sec
25-Oct-2019 22:33:21 Running org.openmrs.module.reporting.indicator.SqlIndicatorTest
25-Oct-2019 22:33:22 ERROR - EvaluationProfiler.log(111) |2019-10-25 22:33:22,257| 1336        2019-10-25 22:33:22.257        >        ERROR        EVALUATING_DEFINITION                        SqlIndicator[sql=SELECT distinct(.222) as res, 33 as res2 from patient]: Failed to evaluate sql because:
25-Oct-2019 22:33:22 Unable to evaluate to a single value. Exactly one column must be defined.
25-Oct-2019 22:33:22 org.openmrs.module.reporting.evaluation.EvaluationException: Failed to evaluate sql because:
25-Oct-2019 22:33:22 Unable to evaluate to a single value. Exactly one column must be defined.
25-Oct-2019 22:33:22         at org.openmrs.module.reporting.indicator.evaluator.SqlIndicatorEvaluator.evaluateSql(SqlIndicatorEvaluator.java:57)
25-Oct-2019 22:33:22         at org.openmrs.module.reporting.indicator.evaluator.SqlIndicatorEvaluator.evaluate(SqlIndicatorEvaluator.java:41)
25-Oct-2019 22:33:22         at org.openmrs.module.reporting.indicator.evaluator.SqlIndicatorEvaluator.evaluate(SqlIndicatorEvaluator.java:28)
25-Oct-2019 22:33:22         at org.openmrs.module.reporting.definition.service.BaseDefinitionService.executeEvaluator(BaseDefinitionService.java:369)
25-Oct-2019 22:33:22         at org.openmrs.module.reporting.definition.service.BaseDefinitionService.evaluateBypassingExclusionOfTestPatients(BaseDefinitionService.java:264)
25-Oct-2019 22:33:22         at org.openmrs.module.reporting.definition.service.BaseDefinitionService.evaluate(BaseDefinitionService.java:229)
25-Oct-2019 22:33:22         at org.openmrs.module.reporting.indicator.service.IndicatorServiceImpl.evaluate(IndicatorServiceImpl.java:41)
25-Oct-2019 22:33:22         at sun.reflect.NativeMethodAccessorImpl.invoke0(Native Method)
25-Oct-2019 22:33:22         at sun.reflect.NativeMethodAccessorImpl.invoke(NativeMethodAccessorImpl.java:62)
25-Oct-2019 22:33:22         at sun.reflect.DelegatingMethodAccessorImpl.invoke(DelegatingMethodAccessorImpl.java:43)
25-Oct-2019 22:33:22         at java.lang.reflect.Method.invoke(Method.java:498)
25-Oct-2019 22:33:22         at org.springframework.aop.support.AopUtils.invokeJoinpointUsingReflection(AopUtils.java:317)
25-Oct-2019 22:33:22         at org.springframework.aop.framework.ReflectiveMethodInvocation.invokeJoinpoint(ReflectiveMethodInvocation.java:190)
25-Oct-2019 22:33:22         at org.springframework.aop.framework.ReflectiveMethodInvocation.proceed(ReflectiveMethodInvocation.java:157)
25-Oct-2019 22:33:22         at org.springframework.cache.interceptor.CacheInterceptor$1.invoke(CacheInterceptor.java:52)
25-Oct-2019 22:33:22         at org.springframework.cache.interceptor.CacheAspectSupport.execute(CacheAspectSupport.java:303)
25-Oct-2019 22:33:22         at org.springframework.cache.interceptor.CacheInterceptor.invoke(CacheInterceptor.java:61)
25-Oct-2019 22:33:22         at org.springframework.aop.framework.ReflectiveMethodInvocation.proceed(ReflectiveMethodInvocation.java:179)
25-Oct-2019 22:33:22         at org.openmrs.aop.LoggingAdvice.invoke(LoggingAdvice.java:121)
25-Oct-2019 22:33:22         at org.springframework.aop.framework.ReflectiveMethodInvocation.proceed(ReflectiveMethodInvocation.java:179)
25-Oct-2019 22:33:22         at org.springframework.aop.framework.adapter.MethodBeforeAdviceInterceptor.invoke(MethodBeforeAdviceInterceptor.java:52)
25-Oct-2019 22:33:22         at org.springframework.aop.framework.ReflectiveMethodInvocation.proceed(ReflectiveMethodInvocation.java:179)
25-Oct-2019 22:33:22         at org.springframework.aop.framework.adapter.MethodBeforeAdviceInterceptor.invoke(MethodBeforeAdviceInterceptor.java:52)
25-Oct-2019 22:33:22         at org.springframework.aop.framework.ReflectiveMethodInvocation.proceed(ReflectiveMethodInvocation.java:179)
25-Oct-2019 22:33:22         at org.springframework.aop.framework.JdkDynamicAopProxy.invoke(JdkDynamicAopProxy.java:207)
25-Oct-2019 22:33:22         at com.sun.proxy.$Proxy47.evaluate(Unknown Source)
25-Oct-2019 22:33:22         at sun.reflect.NativeMethodAccessorImpl.invoke0(Native Method)
25-Oct-2019 22:33:22         at sun.reflect.NativeMethodAccessorImpl.invoke(NativeMethodAccessorImpl.java:62)
25-Oct-2019 22:33:22         at sun.reflect.DelegatingMethodAccessorImpl.invoke(DelegatingMethodAccessorImpl.java:43)
25-Oct-2019 22:33:22         at java.lang.reflect.Method.invoke(Method.java:498)
25-Oct-2019 22:33:22         at org.springframework.aop.support.AopUtils.invokeJoinpointUsingReflection(AopUtils.java:317)
25-Oct-2019 22:33:22         at org.springframework.aop.framework.JdkDynamicAopProxy.invoke(JdkDynamicAopProxy.java:201)
25-Oct-2019 22:33:22         at com.sun.proxy.$Proxy160.evaluate(Unknown Source)
25-Oct-2019 22:33:22         at org.openmrs.module.reporting.indicator.SqlIndicatorTest.assertIndicatorValue(SqlIndicatorTest.java:94)
25-Oct-2019 22:33:22         at org.openmrs.module.reporting.indicator.SqlIndicatorTest.assertIndicatorValue(SqlIndicatorTest.java:103)
25-Oct-2019 22:33:22         at org.openmrs.module.reporting.indicator.SqlIndicatorTest.assertIndicatorValue(SqlIndicatorTest.java:114)
25-Oct-2019 22:33:22         at org.openmrs.module.reporting.indicator.SqlIndicatorTest.assertIndicatorValue(SqlIndicatorTest.java:107)
25-Oct-2019 22:33:22         at org.openmrs.module.reporting.indicator.SqlIndicatorTest.sqlIndicator_shouldNotAllowQueriesThatReturnMoreThanOneColumn(SqlIndicatorTest.java:85)
25-Oct-2019 22:33:22         at sun.reflect.NativeMethodAccessorImpl.invoke0(Native Method)
25-Oct-2019 22:33:22         at sun.reflect.NativeMethodAccessorImpl.invoke(NativeMethodAccessorImpl.java:62)
25-Oct-2019 22:33:22         at sun.reflect.DelegatingMethodAccessorImpl.invoke(DelegatingMethodAccessorImpl.java:43)
25-Oct-2019 22:33:22         at java.lang.reflect.Method.invoke(Method.java:498)
25-Oct-2019 22:33:22         at org.junit.runners.model.FrameworkMethod$1.runReflectiveCall(FrameworkMethod.java:47)
25-Oct-2019 22:33:22         at org.junit.internal.runners.model.ReflectiveCallable.run(ReflectiveCallable.java:12)
25-Oct-2019 22:33:22         at org.junit.runners.model.FrameworkMethod.invokeExplosively(FrameworkMethod.java:44)
25-Oct-2019 22:33:22         at org.junit.internal.runners.statements.InvokeMethod.evaluate(InvokeMethod.java:17)
25-Oct-2019 22:33:22         at org.junit.internal.runners.statements.ExpectException.evaluate(ExpectException.java:19)
25-Oct-2019 22:33:22         at org.junit.internal.runners.statements.RunBefores.evaluate(RunBefores.java:26)
25-Oct-2019 22:33:22         at org.springframework.test.context.junit4.statements.RunBeforeTestMethodCallbacks.evaluate(RunBeforeTestMethodCallbacks.java:73)
25-Oct-2019 22:33:22         at org.junit.internal.runners.statements.RunAfters.evaluate(RunAfters.java:27)
25-Oct-2019 22:33:22         at org.springframework.test.context.junit4.statements.RunAfterTestMethodCallbacks.evaluate(RunAfterTestMethodCallbacks.java:82)
25-Oct-2019 22:33:22         at org.springframework.test.context.junit4.statements.SpringRepeat.evaluate(SpringRepeat.java:73)
25-Oct-2019 22:33:22         at org.junit.runners.ParentRunner.runLeaf(ParentRunner.java:271)
25-Oct-2019 22:33:22         at org.springframework.test.context.junit4.SpringJUnit4ClassRunner.runChild(SpringJUnit4ClassRunner.java:217)
25-Oct-2019 22:33:22         at org.springframework.test.context.junit4.SpringJUnit4ClassRunner.runChild(SpringJUnit4ClassRunner.java:83)
25-Oct-2019 22:33:22         at org.junit.runners.ParentRunner$3.run(ParentRunner.java:238)
25-Oct-2019 22:33:22         at org.junit.runners.ParentRunner$1.schedule(ParentRunner.java:63)
25-Oct-2019 22:33:22         at org.junit.runners.ParentRunner.runChildren(ParentRunner.java:236)
25-Oct-2019 22:33:22         at org.junit.runners.ParentRunner.access$000(ParentRunner.java:53)
25-Oct-2019 22:33:22         at org.junit.runners.ParentRunner$2.evaluate(ParentRunner.java:229)
25-Oct-2019 22:33:22         at org.springframework.test.context.junit4.statements.RunBeforeTestClassCallbacks.evaluate(RunBeforeTestClassCallbacks.java:61)
25-Oct-2019 22:33:22         at org.junit.internal.runners.statements.RunAfters.evaluate(RunAfters.java:27)
25-Oct-2019 22:33:22         at org.springframework.test.context.junit4.statements.RunAfterTestClassCallbacks.evaluate(RunAfterTestClassCallbacks.java:68)
25-Oct-2019 22:33:22         at org.junit.runners.ParentRunner.run(ParentRunner.java:309)
25-Oct-2019 22:33:22         at org.springframework.test.context.junit4.SpringJUnit4ClassRunner.run(SpringJUnit4ClassRunner.java:163)
25-Oct-2019 22:33:22         at org.apache.maven.surefire.junit4.JUnit4TestSet.execute(JUnit4TestSet.java:59)
25-Oct-2019 22:33:22         at org.apache.maven.surefire.suite.AbstractDirectoryTestSuite.executeTestSet(AbstractDirectoryTestSuite.java:115)
25-Oct-2019 22:33:22         at org.apache.maven.surefire.suite.AbstractDirectoryTestSuite.execute(AbstractDirectoryTestSuite.java:102)
25-Oct-2019 22:33:22         at org.apache.maven.surefire.Surefire.run(Surefire.java:180)
25-Oct-2019 22:33:22         at sun.reflect.NativeMethodAccessorImpl.invoke0(Native Method)
25-Oct-2019 22:33:22         at sun.reflect.NativeMethodAccessorImpl.invoke(NativeMethodAccessorImpl.java:62)
25-Oct-2019 22:33:22         at sun.reflect.DelegatingMethodAccessorImpl.invoke(DelegatingMethodAccessorImpl.java:43)
25-Oct-2019 22:33:22         at java.lang.reflect.Method.invoke(Method.java:498)
25-Oct-2019 22:33:22         at org.apache.maven.surefire.booter.SurefireBooter.runSuitesInProcess(SurefireBooter.java:350)
25-Oct-2019 22:33:22         at org.apache.maven.surefire.booter.SurefireBooter.main(SurefireBooter.java:1021)
25-Oct-2019 22:33:22 Caused by: java.lang.IllegalArgumentException: Unable to evaluate to a single value. Exactly one column must be defined.
25-Oct-2019 22:33:22         at org.openmrs.module.reporting.evaluation.service.EvaluationServiceImpl.evaluateToObject(EvaluationServiceImpl.java:90)
25-Oct-2019 22:33:22         at sun.reflect.NativeMethodAccessorImpl.invoke0(Native Method)
25-Oct-2019 22:33:22         at sun.reflect.NativeMethodAccessorImpl.invoke(NativeMethodAccessorImpl.java:62)
25-Oct-2019 22:33:22         at sun.reflect.DelegatingMethodAccessorImpl.invoke(DelegatingMethodAccessorImpl.java:43)
25-Oct-2019 22:33:22         at java.lang.reflect.Method.invoke(Method.java:498)
25-Oct-2019 22:33:22         at org.springframework.aop.support.AopUtils.invokeJoinpointUsingReflection(AopUtils.java:317)
25-Oct-2019 22:33:22         at org.springframework.aop.framework.ReflectiveMethodInvocation.invokeJoinpoint(ReflectiveMethodInvocation.java:190)
25-Oct-2019 22:33:22         at org.springframework.aop.framework.ReflectiveMethodInvocation.proceed(ReflectiveMethodInvocation.java:157)
25-Oct-2019 22:33:22         at org.springframework.transaction.interceptor.TransactionInterceptor$1.proceedWithInvocation(TransactionInterceptor.java:99)
25-Oct-2019 22:33:22         at org.springframework.transaction.interceptor.TransactionAspectSupport.invokeWithinTransaction(TransactionAspectSupport.java:281)
25-Oct-2019 22:33:22         at org.springframework.transaction.interceptor.TransactionInterceptor.invoke(TransactionInterceptor.java:96)
25-Oct-2019 22:33:22         at org.springframework.aop.framework.ReflectiveMethodInvocation.proceed(ReflectiveMethodInvocation.java:179)
25-Oct-2019 22:33:22         at org.springframework.cache.interceptor.CacheInterceptor$1.invoke(CacheInterceptor.java:52)
25-Oct-2019 22:33:22         at org.springframework.cache.interceptor.CacheAspectSupport.execute(CacheAspectSupport.java:303)
25-Oct-2019 22:33:22         at org.springframework.cache.interceptor.CacheInterceptor.invoke(CacheInterceptor.java:61)
25-Oct-2019 22:33:22         at org.springframework.aop.framework.ReflectiveMethodInvocation.proceed(ReflectiveMethodInvocation.java:179)
25-Oct-2019 22:33:22         at org.openmrs.aop.LoggingAdvice.invoke(LoggingAdvice.java:121)
25-Oct-2019 22:33:22         at org.springframework.aop.framework.ReflectiveMethodInvocation.proceed(ReflectiveMethodInvocation.java:179)
25-Oct-2019 22:33:22         at org.springframework.aop.framework.adapter.MethodBeforeAdviceInterceptor.invoke(MethodBeforeAdviceInterceptor.java:52)
25-Oct-2019 22:33:22         at org.springframework.aop.framework.ReflectiveMethodInvocation.proceed(ReflectiveMethodInvocation.java:179)
25-Oct-2019 22:33:22         at org.springframework.aop.framework.adapter.MethodBeforeAdviceInterceptor.invoke(MethodBeforeAdviceInterceptor.java:52)
25-Oct-2019 22:33:22         at org.springframework.aop.framework.ReflectiveMethodInvocation.proceed(ReflectiveMethodInvocation.java:179)
25-Oct-2019 22:33:22         at org.springframework.aop.framework.JdkDynamicAopProxy.invoke(JdkDynamicAopProxy.java:207)
25-Oct-2019 22:33:22         at com.sun.proxy.$Proxy34.evaluateToObject(Unknown Source)
25-Oct-2019 22:33:22         at sun.reflect.NativeMethodAccessorImpl.invoke0(Native Method)
25-Oct-2019 22:33:22         at sun.reflect.NativeMethodAccessorImpl.invoke(NativeMethodAccessorImpl.java:62)
25-Oct-2019 22:33:22         at sun.reflect.DelegatingMethodAccessorImpl.invoke(DelegatingMethodAccessorImpl.java:43)
25-Oct-2019 22:33:22         at java.lang.reflect.Method.invoke(Method.java:498)
25-Oct-2019 22:33:22         at org.springframework.aop.support.AopUtils.invokeJoinpointUsingReflection(AopUtils.java:317)
25-Oct-2019 22:33:22         at org.springframework.aop.framework.ReflectiveMethodInvocation.invokeJoinpoint(ReflectiveMethodInvocation.java:190)
25-Oct-2019 22:33:22         at org.springframework.aop.framework.ReflectiveMethodInvocation.proceed(ReflectiveMethodInvocation.java:157)
25-Oct-2019 22:33:22         at org.springframework.transaction.interceptor.TransactionInterceptor$1.proceedWithInvocation(TransactionInterceptor.java:99)
25-Oct-2019 22:33:22         at org.springframework.transaction.interceptor.TransactionAspectSupport.invokeWithinTransaction(TransactionAspectSupport.java:281)
25-Oct-2019 22:33:22         at org.springframework.transaction.interceptor.TransactionInterceptor.invoke(TransactionInterceptor.java:96)
25-Oct-2019 22:33:22         at org.springframework.aop.framework.ReflectiveMethodInvocation.proceed(ReflectiveMethodInvocation.java:179)
25-Oct-2019 22:33:22         at org.springframework.aop.framework.JdkDynamicAopProxy.invoke(JdkDynamicAopProxy.java:207)
25-Oct-2019 22:33:22         at com.sun.proxy.$Proxy137.evaluateToObject(Unknown Source)
25-Oct-2019 22:33:22         at org.openmrs.module.reporting.indicator.evaluator.SqlIndicatorEvaluator.evaluateSql(SqlIndicatorEvaluator.java:54)
25-Oct-2019 22:33:22         ... 74 more
25-Oct-2019 22:33:22 ERROR - EvaluationProfiler.log(111) |2019-10-25 22:33:22,607| 1344        2019-10-25 22:33:22.607        >        ERROR        EVALUATING_DEFINITION                        SqlIndicator[sql=SELECT person_id from person]: Failed to evaluate sql because:
25-Oct-2019 22:33:22 Unable to evaluate to a single value. Exactly one row must be returned by query.
25-Oct-2019 22:33:22 org.openmrs.module.reporting.evaluation.EvaluationException: Failed to evaluate sql because:
25-Oct-2019 22:33:22 Unable to evaluate to a single value. Exactly one row must be returned by query.
25-Oct-2019 22:33:22         at org.openmrs.module.reporting.indicator.evaluator.SqlIndicatorEvaluator.evaluateSql(SqlIndicatorEvaluator.java:57)
25-Oct-2019 22:33:22         at org.openmrs.module.reporting.indicator.evaluator.SqlIndicatorEvaluator.evaluate(SqlIndicatorEvaluator.java:41)
25-Oct-2019 22:33:22         at org.openmrs.module.reporting.indicator.evaluator.SqlIndicatorEvaluator.evaluate(SqlIndicatorEvaluator.java:28)
25-Oct-2019 22:33:22         at org.openmrs.module.reporting.definition.service.BaseDefinitionService.executeEvaluator(BaseDefinitionService.java:369)
25-Oct-2019 22:33:22         at org.openmrs.module.reporting.definition.service.BaseDefinitionService.evaluateBypassingExclusionOfTestPatients(BaseDefinitionService.java:264)
25-Oct-2019 22:33:22         at org.openmrs.module.reporting.definition.service.BaseDefinitionService.evaluate(BaseDefinitionService.java:229)
25-Oct-2019 22:33:22         at org.openmrs.module.reporting.indicator.service.IndicatorServiceImpl.evaluate(IndicatorServiceImpl.java:41)
25-Oct-2019 22:33:22         at sun.reflect.GeneratedMethodAccessor1195.invoke(Unknown Source)
25-Oct-2019 22:33:22         at sun.reflect.DelegatingMethodAccessorImpl.invoke(DelegatingMethodAccessorImpl.java:43)
25-Oct-2019 22:33:22         at java.lang.reflect.Method.invoke(Method.java:498)
25-Oct-2019 22:33:22         at org.springframework.aop.support.AopUtils.invokeJoinpointUsingReflection(AopUtils.java:317)
25-Oct-2019 22:33:22         at org.springframework.aop.framework.ReflectiveMethodInvocation.invokeJoinpoint(ReflectiveMethodInvocation.java:190)
25-Oct-2019 22:33:22         at org.springframework.aop.framework.ReflectiveMethodInvocation.proceed(ReflectiveMethodInvocation.java:157)
25-Oct-2019 22:33:22         at org.springframework.cache.interceptor.CacheInterceptor$1.invoke(CacheInterceptor.java:52)
25-Oct-2019 22:33:22         at org.springframework.cache.interceptor.CacheAspectSupport.execute(CacheAspectSupport.java:303)
25-Oct-2019 22:33:22         at org.springframework.cache.interceptor.CacheInterceptor.invoke(CacheInterceptor.java:61)
25-Oct-2019 22:33:22         at org.springframework.aop.framework.ReflectiveMethodInvocation.proceed(ReflectiveMethodInvocation.java:179)
25-Oct-2019 22:33:22         at org.openmrs.aop.LoggingAdvice.invoke(LoggingAdvice.java:121)
25-Oct-2019 22:33:22         at org.springframework.aop.framework.ReflectiveMethodInvocation.proceed(ReflectiveMethodInvocation.java:179)
25-Oct-2019 22:33:22         at org.springframework.aop.framework.adapter.MethodBeforeAdviceInterceptor.invoke(MethodBeforeAdviceInterceptor.java:52)
25-Oct-2019 22:33:22         at org.springframework.aop.framework.ReflectiveMethodInvocation.proceed(ReflectiveMethodInvocation.java:179)
25-Oct-2019 22:33:22         at org.springframework.aop.framework.adapter.MethodBeforeAdviceInterceptor.invoke(MethodBeforeAdviceInterceptor.java:52)
25-Oct-2019 22:33:22         at org.springframework.aop.framework.ReflectiveMethodInvocation.proceed(ReflectiveMethodInvocation.java:179)
25-Oct-2019 22:33:22         at org.springframework.aop.framework.JdkDynamicAopProxy.invoke(JdkDynamicAopProxy.java:207)
25-Oct-2019 22:33:22         at com.sun.proxy.$Proxy47.evaluate(Unknown Source)
25-Oct-2019 22:33:22         at sun.reflect.GeneratedMethodAccessor1195.invoke(Unknown Source)
25-Oct-2019 22:33:22         at sun.reflect.DelegatingMethodAccessorImpl.invoke(DelegatingMethodAccessorImpl.java:43)
25-Oct-2019 22:33:22         at java.lang.reflect.Method.invoke(Method.java:498)
25-Oct-2019 22:33:22         at org.springframework.aop.support.AopUtils.invokeJoinpointUsingReflection(AopUtils.java:317)
25-Oct-2019 22:33:22         at org.springframework.aop.framework.JdkDynamicAopProxy.invoke(JdkDynamicAopProxy.java:201)
25-Oct-2019 22:33:22         at com.sun.proxy.$Proxy160.evaluate(Unknown Source)
25-Oct-2019 22:33:22         at org.openmrs.module.reporting.indicator.SqlIndicatorTest.assertIndicatorValue(SqlIndicatorTest.java:94)
25-Oct-2019 22:33:22         at org.openmrs.module.reporting.indicator.SqlIndicatorTest.assertIndicatorValue(SqlIndicatorTest.java:103)
25-Oct-2019 22:33:22         at org.openmrs.module.reporting.indicator.SqlIndicatorTest.assertIndicatorValue(SqlIndicatorTest.java:114)
25-Oct-2019 22:33:22         at org.openmrs.module.reporting.indicator.SqlIndicatorTest.assertIndicatorValue(SqlIndicatorTest.java:107)
25-Oct-2019 22:33:22         at org.openmrs.module.reporting.indicator.SqlIndicatorTest.sqlIndicator_shouldNotAllowQueriesThatReturnMoreThanOneRow(SqlIndicatorTest.java:90)
25-Oct-2019 22:33:22         at sun.reflect.NativeMethodAccessorImpl.invoke0(Native Method)
25-Oct-2019 22:33:22         at sun.reflect.NativeMethodAccessorImpl.invoke(NativeMethodAccessorImpl.java:62)
25-Oct-2019 22:33:22         at sun.reflect.DelegatingMethodAccessorImpl.invoke(DelegatingMethodAccessorImpl.java:43)
25-Oct-2019 22:33:22         at java.lang.reflect.Method.invoke(Method.java:498)
25-Oct-2019 22:33:22         at org.junit.runners.model.FrameworkMethod$1.runReflectiveCall(FrameworkMethod.java:47)
25-Oct-2019 22:33:22         at org.junit.internal.runners.model.ReflectiveCallable.run(ReflectiveCallable.java:12)
25-Oct-2019 22:33:22         at org.junit.runners.model.FrameworkMethod.invokeExplosively(FrameworkMethod.java:44)
25-Oct-2019 22:33:22         at org.junit.internal.runners.statements.InvokeMethod.evaluate(InvokeMethod.java:17)
25-Oct-2019 22:33:22         at org.junit.internal.runners.statements.ExpectException.evaluate(ExpectException.java:19)
25-Oct-2019 22:33:22         at org.junit.internal.runners.statements.RunBefores.evaluate(RunBefores.java:26)
25-Oct-2019 22:33:22         at org.springframework.test.context.junit4.statements.RunBeforeTestMethodCallbacks.evaluate(RunBeforeTestMethodCallbacks.java:73)
25-Oct-2019 22:33:22         at org.junit.internal.runners.statements.RunAfters.evaluate(RunAfters.java:27)
25-Oct-2019 22:33:22         at org.springframework.test.context.junit4.statements.RunAfterTestMethodCallbacks.evaluate(RunAfterTestMethodCallbacks.java:82)
25-Oct-2019 22:33:22         at org.springframework.test.context.junit4.statements.SpringRepeat.evaluate(SpringRepeat.java:73)
25-Oct-2019 22:33:22         at org.junit.runners.ParentRunner.runLeaf(ParentRunner.java:271)
25-Oct-2019 22:33:22         at org.springframework.test.context.junit4.SpringJUnit4ClassRunner.runChild(SpringJUnit4ClassRunner.java:217)
25-Oct-2019 22:33:22         at org.springframework.test.context.junit4.SpringJUnit4ClassRunner.runChild(SpringJUnit4ClassRunner.java:83)
25-Oct-2019 22:33:22         at org.junit.runners.ParentRunner$3.run(ParentRunner.java:238)
25-Oct-2019 22:33:22         at org.junit.runners.ParentRunner$1.schedule(ParentRunner.java:63)
25-Oct-2019 22:33:22         at org.junit.runners.ParentRunner.runChildren(ParentRunner.java:236)
25-Oct-2019 22:33:22         at org.junit.runners.ParentRunner.access$000(ParentRunner.java:53)
25-Oct-2019 22:33:22         at org.junit.runners.ParentRunner$2.evaluate(ParentRunner.java:229)
25-Oct-2019 22:33:22         at org.springframework.test.context.junit4.statements.RunBeforeTestClassCallbacks.evaluate(RunBeforeTestClassCallbacks.java:61)
25-Oct-2019 22:33:22         at org.junit.internal.runners.statements.RunAfters.evaluate(RunAfters.java:27)
25-Oct-2019 22:33:22         at org.springframework.test.context.junit4.statements.RunAfterTestClassCallbacks.evaluate(RunAfterTestClassCallbacks.java:68)
25-Oct-2019 22:33:22         at org.junit.runners.ParentRunner.run(ParentRunner.java:309)
25-Oct-2019 22:33:22         at org.springframework.test.context.junit4.SpringJUnit4ClassRunner.run(SpringJUnit4ClassRunner.java:163)
25-Oct-2019 22:33:22         at org.apache.maven.surefire.junit4.JUnit4TestSet.execute(JUnit4TestSet.java:59)
25-Oct-2019 22:33:22         at org.apache.maven.surefire.suite.AbstractDirectoryTestSuite.executeTestSet(AbstractDirectoryTestSuite.java:115)
25-Oct-2019 22:33:22         at org.apache.maven.surefire.suite.AbstractDirectoryTestSuite.execute(AbstractDirectoryTestSuite.java:102)
25-Oct-2019 22:33:22         at org.apache.maven.surefire.Surefire.run(Surefire.java:180)
25-Oct-2019 22:33:22         at sun.reflect.NativeMethodAccessorImpl.invoke0(Native Method)
25-Oct-2019 22:33:22         at sun.reflect.NativeMethodAccessorImpl.invoke(NativeMethodAccessorImpl.java:62)
25-Oct-2019 22:33:22         at sun.reflect.DelegatingMethodAccessorImpl.invoke(DelegatingMethodAccessorImpl.java:43)
25-Oct-2019 22:33:22         at java.lang.reflect.Method.invoke(Method.java:498)
25-Oct-2019 22:33:22         at org.apache.maven.surefire.booter.SurefireBooter.runSuitesInProcess(SurefireBooter.java:350)
25-Oct-2019 22:33:22         at org.apache.maven.surefire.booter.SurefireBooter.main(SurefireBooter.java:1021)
25-Oct-2019 22:33:22 Caused by: java.lang.IllegalArgumentException: Unable to evaluate to a single value. Exactly one row must be returned by query.
25-Oct-2019 22:33:22         at org.openmrs.module.reporting.evaluation.service.EvaluationServiceImpl.evaluateToObject(EvaluationServiceImpl.java:86)
25-Oct-2019 22:33:22         at sun.reflect.GeneratedMethodAccessor1198.invoke(Unknown Source)
25-Oct-2019 22:33:22         at sun.reflect.DelegatingMethodAccessorImpl.invoke(DelegatingMethodAccessorImpl.java:43)
25-Oct-2019 22:33:22         at java.lang.reflect.Method.invoke(Method.java:498)
25-Oct-2019 22:33:22         at org.springframework.aop.support.AopUtils.invokeJoinpointUsingReflection(AopUtils.java:317)
25-Oct-2019 22:33:22         at org.springframework.aop.framework.ReflectiveMethodInvocation.invokeJoinpoint(ReflectiveMethodInvocation.java:190)
25-Oct-2019 22:33:22         at org.springframework.aop.framework.ReflectiveMethodInvocation.proceed(ReflectiveMethodInvocation.java:157)
25-Oct-2019 22:33:22         at org.springframework.transaction.interceptor.TransactionInterceptor$1.proceedWithInvocation(TransactionInterceptor.java:99)
25-Oct-2019 22:33:22         at org.springframework.transaction.interceptor.TransactionAspectSupport.invokeWithinTransaction(TransactionAspectSupport.java:281)
25-Oct-2019 22:33:22         at org.springframework.transaction.interceptor.TransactionInterceptor.invoke(TransactionInterceptor.java:96)
25-Oct-2019 22:33:22         at org.springframework.aop.framework.ReflectiveMethodInvocation.proceed(ReflectiveMethodInvocation.java:179)
25-Oct-2019 22:33:22         at org.springframework.cache.interceptor.CacheInterceptor$1.invoke(CacheInterceptor.java:52)
25-Oct-2019 22:33:22         at org.springframework.cache.interceptor.CacheAspectSupport.execute(CacheAspectSupport.java:303)
25-Oct-2019 22:33:22         at org.springframework.cache.interceptor.CacheInterceptor.invoke(CacheInterceptor.java:61)
25-Oct-2019 22:33:22         at org.springframework.aop.framework.ReflectiveMethodInvocation.proceed(ReflectiveMethodInvocation.java:179)
25-Oct-2019 22:33:22         at org.openmrs.aop.LoggingAdvice.invoke(LoggingAdvice.java:121)
25-Oct-2019 22:33:22         at org.springframework.aop.framework.ReflectiveMethodInvocation.proceed(ReflectiveMethodInvocation.java:179)
25-Oct-2019 22:33:22         at org.springframework.aop.framework.adapter.MethodBeforeAdviceInterceptor.invoke(MethodBeforeAdviceInterceptor.java:52)
25-Oct-2019 22:33:22         at org.springframework.aop.framework.ReflectiveMethodInvocation.proceed(ReflectiveMethodInvocation.java:179)
25-Oct-2019 22:33:22         at org.springframework.aop.framework.adapter.MethodBeforeAdviceInterceptor.invoke(MethodBeforeAdviceInterceptor.java:52)
25-Oct-2019 22:33:22         at org.springframework.aop.framework.ReflectiveMethodInvocation.proceed(ReflectiveMethodInvocation.java:179)
25-Oct-2019 22:33:22         at org.springframework.aop.framework.JdkDynamicAopProxy.invoke(JdkDynamicAopProxy.java:207)
25-Oct-2019 22:33:22         at com.sun.proxy.$Proxy34.evaluateToObject(Unknown Source)
25-Oct-2019 22:33:22         at sun.reflect.GeneratedMethodAccessor1198.invoke(Unknown Source)
25-Oct-2019 22:33:22         at sun.reflect.DelegatingMethodAccessorImpl.invoke(DelegatingMethodAccessorImpl.java:43)
25-Oct-2019 22:33:22         at java.lang.reflect.Method.invoke(Method.java:498)
25-Oct-2019 22:33:22         at org.springframework.aop.support.AopUtils.invokeJoinpointUsingReflection(AopUtils.java:317)
25-Oct-2019 22:33:22         at org.springframework.aop.framework.ReflectiveMethodInvocation.invokeJoinpoint(ReflectiveMethodInvocation.java:190)
25-Oct-2019 22:33:22         at org.springframework.aop.framework.ReflectiveMethodInvocation.proceed(ReflectiveMethodInvocation.java:157)
25-Oct-2019 22:33:22         at org.springframework.transaction.interceptor.TransactionInterceptor$1.proceedWithInvocation(TransactionInterceptor.java:99)
25-Oct-2019 22:33:22         at org.springframework.transaction.interceptor.TransactionAspectSupport.invokeWithinTransaction(TransactionAspectSupport.java:281)
25-Oct-2019 22:33:22         at org.springframework.transaction.interceptor.TransactionInterceptor.invoke(TransactionInterceptor.java:96)
25-Oct-2019 22:33:22         at org.springframework.aop.framework.ReflectiveMethodInvocation.proceed(ReflectiveMethodInvocation.java:179)
25-Oct-2019 22:33:22         at org.springframework.aop.framework.JdkDynamicAopProxy.invoke(JdkDynamicAopProxy.java:207)
25-Oct-2019 22:33:22         at com.sun.proxy.$Proxy137.evaluateToObject(Unknown Source)
25-Oct-2019 22:33:22         at org.openmrs.module.reporting.indicator.evaluator.SqlIndicatorEvaluator.evaluateSql(SqlIndicatorEvaluator.java:54)
25-Oct-2019 22:33:22         ... 72 more
25-Oct-2019 22:33:22 Tests run: 8, Failures: 0, Errors: 0, Skipped: 0, Time elapsed: 0.875 sec
25-Oct-2019 22:33:22 Running org.openmrs.module.reporting.report.renderer.ExcelTemplateRendererTest
25-Oct-2019 22:33:22 Tests run: 2, Failures: 0, Errors: 0, Skipped: 0, Time elapsed: 0.233 sec
25-Oct-2019 22:33:22 Running org.openmrs.module.reporting.cohort.CohortsTest
25-Oct-2019 22:33:22 Tests run: 3, Failures: 0, Errors: 0, Skipped: 0, Time elapsed: 0.039 sec
25-Oct-2019 22:33:22 Running org.openmrs.module.reporting.data.converter.StringConverterTest
25-Oct-2019 22:33:22 Tests run: 1, Failures: 0, Errors: 0, Skipped: 0, Time elapsed: 0.001 sec
25-Oct-2019 22:33:22 Running org.openmrs.module.reporting.dataset.definition.evaluator.RepeatPerTimePeriodDataSetEvaluatorTest
25-Oct-2019 22:33:23 Tests run: 4, Failures: 0, Errors: 0, Skipped: 0, Time elapsed: 0.111 sec
25-Oct-2019 22:33:23 Running org.openmrs.module.reporting.data.JoinDataDefinitionTest
25-Oct-2019 22:33:23 Tests run: 2, Failures: 0, Errors: 0, Skipped: 0, Time elapsed: 0.001 sec
25-Oct-2019 22:33:23 Running org.openmrs.module.reporting.query.obs.evaluator.BasicObsQueryEvaluatorTest
25-Oct-2019 22:33:23 Tests run: 1, Failures: 0, Errors: 0, Skipped: 0, Time elapsed: 0.224 sec
25-Oct-2019 22:33:23 Running org.openmrs.module.reporting.query.person.evaluator.PatientPersonQueryEvaluatorTest
25-Oct-2019 22:33:23 Tests run: 1, Failures: 0, Errors: 0, Skipped: 0, Time elapsed: 0.135 sec
25-Oct-2019 22:33:23 Running org.openmrs.module.reporting.data.patient.evaluator.ScriptedCompositionPatientDataEvaluatorTest
25-Oct-2019 22:33:23 Tests run: 2, Failures: 0, Errors: 0, Skipped: 0, Time elapsed: 0.391 sec
25-Oct-2019 22:33:23 Running org.openmrs.module.reporting.definition.library.implementerconfigured.ImplementerConfiguredEncounterDataDefinitionLibraryTest
25-Oct-2019 22:33:23 Tests run: 2, Failures: 0, Errors: 0, Skipped: 0, Time elapsed: 0.033 sec
25-Oct-2019 22:33:23 Running org.openmrs.module.reporting.data.encounter.evaluator.PersonToEncounterDataEvaluatorTest
25-Oct-2019 22:33:24 Tests run: 3, Failures: 0, Errors: 0, Skipped: 0, Time elapsed: 0.375 sec
25-Oct-2019 22:33:24 Running org.openmrs.module.reporting.data.visit.evaluator.PatientToVisitDataEvaluatorTest
25-Oct-2019 22:33:24 {1=102, 4=12345K}
25-Oct-2019 22:33:24 Tests run: 3, Failures: 0, Errors: 0, Skipped: 0, Time elapsed: 0.349 sec
25-Oct-2019 22:33:24 Running org.openmrs.module.reporting.validator.CompositionCohortDefinitionValidatorTest
25-Oct-2019 22:33:24 Tests run: 5, Failures: 0, Errors: 0, Skipped: 0, Time elapsed: 0.063 sec
25-Oct-2019 22:33:24 Running org.openmrs.module.reporting.cohort.definition.evaluator.InProgramCohortDefinitionEvaluatorTest
25-Oct-2019 22:33:25 Tests run: 5, Failures: 0, Errors: 0, Skipped: 0, Time elapsed: 0.657 sec
25-Oct-2019 22:33:25 Running org.openmrs.module.reporting.calculation.PatientDataCalculationBehaviorTest
25-Oct-2019 22:33:25 Tests run: 3, Failures: 0, Errors: 0, Skipped: 0, Time elapsed: 0.402 sec
25-Oct-2019 22:33:25 Running org.openmrs.module.reporting.dataset.definition.evaluator.CohortIndicatorDataSetEvaluatorTest
25-Oct-2019 22:33:25 Tests run: 1, Failures: 0, Errors: 0, Skipped: 0, Time elapsed: 0.164 sec
25-Oct-2019 22:33:25 Running org.openmrs.module.reporting.query.encounter.evaluator.AuditEncounterQueryEvaluatorTest
25-Oct-2019 22:33:26 Tests run: 5, Failures: 0, Errors: 0, Skipped: 0, Time elapsed: 0.773 sec
25-Oct-2019 22:33:26 Running org.openmrs.module.reporting.definition.service.DefinitionServiceTest
25-Oct-2019 22:33:26 Tests run: 1, Failures: 0, Errors: 0, Skipped: 0, Time elapsed: 0.027 sec
25-Oct-2019 22:33:26 Running org.openmrs.module.reporting.indicator.aggregation.AggregationTest
25-Oct-2019 22:33:26 Tests run: 12, Failures: 0, Errors: 0, Skipped: 0, Time elapsed: 0.003 sec
25-Oct-2019 22:33:26 Running org.openmrs.module.reporting.data.person.evaluator.ConvertedPersonDataEvaluatorTest
25-Oct-2019 22:33:26 Tests run: 1, Failures: 0, Errors: 0, Skipped: 0, Time elapsed: 0.147 sec
25-Oct-2019 22:33:26 Running org.openmrs.module.reporting.query.encounter.evaluator.SqlEncounterQueryEvaluatorTest
25-Oct-2019 22:33:27 Tests run: 3, Failures: 0, Errors: 0, Skipped: 0, Time elapsed: 0.4 sec
25-Oct-2019 22:33:27 Running org.openmrs.module.reporting.report.renderer.CsvReportRendererTest
25-Oct-2019 22:33:27 Tests run: 1, Failures: 0, Errors: 0, Skipped: 0, Time elapsed: 0.015 sec
25-Oct-2019 22:33:27 Running org.openmrs.module.reporting.dataset.definition.evaluator.LogicDataSetEvaluatorTest
25-Oct-2019 22:33:27 Tests run: 1, Failures: 0, Errors: 0, Skipped: 1, Time elapsed: 0.001 sec
25-Oct-2019 22:33:27 Running org.openmrs.module.reporting.dataset.definition.evaluator.VisitDataSetEvaluatorTest
25-Oct-2019 22:33:27 VISIT ID        EMR ID        BIRTHDATE          
25-Oct-2019 22:33:27 --------        ------        -----------        
25-Oct-2019 22:33:27 1               2             08/Apr/1975        
25-Oct-2019 22:33:27 2               2             08/Apr/1975        
25-Oct-2019 22:33:27 3               2             08/Apr/1975        
25-Oct-2019 22:33:27 4               6             27/May/2007        
25-Oct-2019 22:33:27 5               6             27/May/2007        
25-Oct-2019 22:33:27 Tests run: 1, Failures: 0, Errors: 0, Skipped: 0, Time elapsed: 0.131 sec
25-Oct-2019 22:33:27 Running org.openmrs.module.reporting.data.person.evaluator.PersonIdDataEvaluatorTest
25-Oct-2019 22:33:27 Tests run: 1, Failures: 0, Errors: 0, Skipped: 0, Time elapsed: 0.11 sec
25-Oct-2019 22:33:27 Running org.openmrs.module.reporting.cohort.definition.evaluator.BirthAndDeathCohortDefinitionEvaluatorTest
25-Oct-2019 22:33:28 Tests run: 8, Failures: 0, Errors: 0, Skipped: 0, Time elapsed: 1.077 sec
25-Oct-2019 22:33:28 Running org.openmrs.module.reporting.data.encounter.evaluator.SqlEncounterDataEvaluatorTest
25-Oct-2019 22:33:28 Tests run: 1, Failures: 0, Errors: 0, Skipped: 0, Time elapsed: 0.112 sec
25-Oct-2019 22:33:28 Running org.openmrs.module.reporting.data.converter.PersonAddressConverterTest
25-Oct-2019 22:33:28 Tests run: 1, Failures: 0, Errors: 0, Skipped: 0, Time elapsed: 0.014 sec
25-Oct-2019 22:33:28 Running org.openmrs.module.reporting.data.converter.AttributeValueConverterTest
25-Oct-2019 22:33:28 Tests run: 2, Failures: 0, Errors: 0, Skipped: 0, Time elapsed: 0.28 sec
25-Oct-2019 22:33:28 Running org.openmrs.module.reporting.common.DelimitedKeyComparatorTest
25-Oct-2019 22:33:28 Tests run: 1, Failures: 0, Errors: 0, Skipped: 0, Time elapsed: 0.001 sec
25-Oct-2019 22:33:28 Running org.openmrs.module.reporting.data.obs.evaluator.ConvertedObsDataEvaluatorTest
25-Oct-2019 22:33:29 Tests run: 1, Failures: 0, Errors: 0, Skipped: 0, Time elapsed: 0.138 sec
25-Oct-2019 22:33:29 Running org.openmrs.module.reporting.query.person.evaluator.SqlPersonQueryEvaluatorTest
25-Oct-2019 22:33:29 Tests run: 2, Failures: 0, Errors: 0, Skipped: 0, Time elapsed: 0.357 sec
25-Oct-2019 22:33:29 Running org.openmrs.module.reporting.query.person.evaluator.AllPersonQueryEvaluatorTest
25-Oct-2019 22:33:30 Tests run: 6, Failures: 0, Errors: 0, Skipped: 0, Time elapsed: 1.057 sec
25-Oct-2019 22:33:30 Running org.openmrs.module.reporting.dataset.definition.evaluator.SqlFileDataSetEvaluatorTest
25-Oct-2019 22:33:31 Tests run: 2, Failures: 0, Errors: 0, Skipped: 0, Time elapsed: 0.468 sec
25-Oct-2019 22:33:31 Running org.openmrs.module.reporting.data.person.evaluator.AgeAtDateOfOtherDataEvaluatorTest
25-Oct-2019 22:33:31 Tests run: 1, Failures: 0, Errors: 0, Skipped: 0, Time elapsed: 0.8 sec
25-Oct-2019 22:33:31 Running org.openmrs.module.reporting.indicator.PeriodIndicatorReportTest
25-Oct-2019 22:33:32 Tests run: 2, Failures: 0, Errors: 0, Skipped: 0, Time elapsed: 0.27 sec
25-Oct-2019 22:33:32 Running org.openmrs.module.reporting.report.renderer.DelimitedTextReportRendererTest
25-Oct-2019 22:33:32 Tests run: 11, Failures: 0, Errors: 0, Skipped: 0, Time elapsed: 0.276 sec
25-Oct-2019 22:33:32 Running org.openmrs.module.reporting.data.patient.evaluator.PatientObjectDataEvaluatorTest
25-Oct-2019 22:33:32 Tests run: 1, Failures: 0, Errors: 0, Skipped: 0, Time elapsed: 0.146 sec
25-Oct-2019 22:33:32 Running org.openmrs.module.reporting.data.patient.evaluator.TestPatientCalculation
25-Oct-2019 22:33:32 Tests run: 1, Failures: 0, Errors: 0, Skipped: 1, Time elapsed: 0.001 sec
25-Oct-2019 22:33:32 Running org.openmrs.module.reporting.validator.SqlCohortDefinitionValidatorTest
25-Oct-2019 22:33:32 Tests run: 3, Failures: 0, Errors: 0, Skipped: 0, Time elapsed: 0.023 sec
25-Oct-2019 22:33:32 Running org.openmrs.module.reporting.cohort.definition.evaluator.PatientStateCohortDefinitionEvaluatorTest
25-Oct-2019 22:33:33 Tests run: 7, Failures: 0, Errors: 0, Skipped: 0, Time elapsed: 0.85 sec
25-Oct-2019 22:33:33 Running org.openmrs.module.reporting.data.converter.NullValueConverterTest
25-Oct-2019 22:33:33 Tests run: 1, Failures: 0, Errors: 0, Skipped: 0, Time elapsed: 0.002 sec
25-Oct-2019 22:33:33 Running org.openmrs.module.reporting.query.encounter.evaluator.ConditionalParameterEncounterQueryEvaluatorTest
25-Oct-2019 22:33:33 Tests run: 1, Failures: 0, Errors: 0, Skipped: 0, Time elapsed: 0.133 sec
25-Oct-2019 22:33:33 Running org.openmrs.module.reporting.report.service.TestReportProcessor
25-Oct-2019 22:33:33 Tests run: 1, Failures: 0, Errors: 0, Skipped: 1, Time elapsed: 0.001 sec
25-Oct-2019 22:33:33 Running org.openmrs.module.reporting.common.FractionTest
25-Oct-2019 22:33:33 Tests run: 7, Failures: 0, Errors: 0, Skipped: 0, Time elapsed: 0.002 sec
25-Oct-2019 22:33:33 Running org.openmrs.module.reporting.report.renderer.ReportDesignRendererTest
25-Oct-2019 22:33:33 Tests run: 2, Failures: 0, Errors: 0, Skipped: 0, Time elapsed: 0.03 sec
25-Oct-2019 22:33:33 Running org.openmrs.module.reporting.data.patient.evaluator.ProgramEnrollmentsForPatientDataEvaluatorTest
25-Oct-2019 22:33:34 Tests run: 8, Failures: 0, Errors: 0, Skipped: 0, Time elapsed: 0.886 sec
25-Oct-2019 22:33:34 Running org.openmrs.module.reporting.data.visit.evaluator.OrderForVisitDataEvaluatorTest
25-Oct-2019 22:33:34 Tests run: 2, Failures: 0, Errors: 0, Skipped: 0, Time elapsed: 0.068 sec
25-Oct-2019 22:33:34 Running org.openmrs.module.reporting.report.util.SqlScriptParserTest
25-Oct-2019 22:33:34 Tests run: 4, Failures: 0, Errors: 0, Skipped: 0, Time elapsed: 0.002 sec
25-Oct-2019 22:33:34 Running org.openmrs.module.reporting.definition.library.implementerconfigured.ImplementerConfiguredDataSetDefinitionLibraryTest
25-Oct-2019 22:33:34 Tests run: 3, Failures: 0, Errors: 0, Skipped: 0, Time elapsed: 0.168 sec
25-Oct-2019 22:33:34 Running org.openmrs.module.reporting.cohort.definition.evaluator.PresenceOrAbsenceCohortDefinitionEvaluatorTest
25-Oct-2019 22:33:35 Tests run: 3, Failures: 0, Errors: 0, Skipped: 0, Time elapsed: 0.378 sec
25-Oct-2019 22:33:35 Running org.openmrs.module.reporting.report.definition.service.ReportDefinitionServiceImplTest
25-Oct-2019 22:33:35 Tests run: 2, Failures: 0, Errors: 0, Skipped: 0, Time elapsed: 0.144 sec
25-Oct-2019 22:33:35 Running org.openmrs.module.reporting.data.converter.ObsValueTextAsCodedConverterTest
25-Oct-2019 22:33:35 Tests run: 3, Failures: 0, Errors: 0, Skipped: 0, Time elapsed: 0.024 sec
25-Oct-2019 22:33:35 Running org.openmrs.module.reporting.cohort.definition.service.BaseCohortDefinitionServiceTest
25-Oct-2019 22:33:35 Tests run: 1, Failures: 0, Errors: 0, Skipped: 0, Time elapsed: 0.142 sec
25-Oct-2019 22:33:35 Running org.openmrs.module.reporting.cohort.definition.evaluator.InStateCohortDefinitionEvaluatorTest
25-Oct-2019 22:33:35 Cohort: Cohort id=null size=2
25-Oct-2019 22:33:36 Tests run: 7, Failures: 0, Errors: 0, Skipped: 0, Time elapsed: 1.004 sec
25-Oct-2019 22:33:36 Running org.openmrs.module.reporting.data.patient.evaluator.DefinitionLibraryPatientDataEvaluatorTest
25-Oct-2019 22:33:36 Tests run: 3, Failures: 0, Errors: 0, Skipped: 0, Time elapsed: 0.463 sec
25-Oct-2019 22:33:36 Running org.openmrs.module.reporting.cohort.definition.evaluator.DefinitionLibraryCohortDefinitionEvaluatorTest
25-Oct-2019 22:33:37 Tests run: 3, Failures: 0, Errors: 0, Skipped: 0, Time elapsed: 0.333 sec
25-Oct-2019 22:33:37 Running org.openmrs.module.reporting.dataset.definition.evaluator.CohortsWithVaryingParametersDataSetEvaluatorTest
25-Oct-2019 22:33:37 Tests run: 1, Failures: 0, Errors: 0, Skipped: 0, Time elapsed: 0.134 sec
25-Oct-2019 22:33:37 Running org.openmrs.module.reporting.dataset.definition.evaluator.ObsDataSetEvaluatorTest
25-Oct-2019 22:33:37 Tests run: 1, Failures: 0, Errors: 0, Skipped: 0, Time elapsed: 0.139 sec
25-Oct-2019 22:33:37 Running org.openmrs.module.reporting.data.patient.evaluator.SqlPatientDataEvaluatorTest
25-Oct-2019 22:33:37 Tests run: 1, Failures: 0, Errors: 0, Skipped: 0, Time elapsed: 0.109 sec
25-Oct-2019 22:33:37 Running org.openmrs.module.reporting.data.converter.PrivilegedDataConverterTest
25-Oct-2019 22:33:38 SLF4J: Class path contains multiple SLF4J bindings.
25-Oct-2019 22:33:38 SLF4J: Found binding in [jar:file:/home/bamboo-agent/.m2/repository/org/slf4j/slf4j-log4j12/1.6.0/slf4j-log4j12-1.6.0.jar!/org/slf4j/impl/StaticLoggerBinder.class]
25-Oct-2019 22:33:38 SLF4J: Found binding in [jar:file:/home/bamboo-agent/.m2/repository/org/slf4j/slf4j-log4j12/1.6.0/slf4j-log4j12-1.6.0.jar!/org/slf4j/impl/StaticLoggerBinder.class]
25-Oct-2019 22:33:38 SLF4J: See http://www.slf4j.org/codes.html#multiple_bindings for an explanation.
25-Oct-2019 22:33:38 Tests run: 2, Failures: 0, Errors: 0, Skipped: 0, Time elapsed: 0.958 sec
25-Oct-2019 22:33:38 Running org.openmrs.module.reporting.data.patient.evaluator.PatientCalculationDataEvaluatorTest
25-Oct-2019 22:33:38 ERROR - EvaluationProfiler.log(111) |2019-10-25 22:33:38,641| 1768        2019-10-25 22:33:38.641        >        ERROR        EVALUATING_DEFINITION                        PatientCalculationDataDefinition[Example]: Failed to evaluate No PatientCalculation found on this PatientCalculationDataDefinition
25-Oct-2019 22:33:38 org.openmrs.module.reporting.evaluation.EvaluationException: Failed to evaluate No PatientCalculation found on this PatientCalculationDataDefinition
25-Oct-2019 22:33:38         at org.openmrs.module.reporting.data.patient.evaluator.PatientCalculationDataEvaluator.evaluate(PatientCalculationDataEvaluator.java:50)
25-Oct-2019 22:33:38         at org.openmrs.module.reporting.data.patient.evaluator.PatientCalculationDataEvaluator.evaluate(PatientCalculationDataEvaluator.java:34)
25-Oct-2019 22:33:38         at org.openmrs.module.reporting.definition.service.BaseDefinitionService.executeEvaluator(BaseDefinitionService.java:369)
25-Oct-2019 22:33:38         at org.openmrs.module.reporting.data.patient.service.PatientDataServiceImpl.executeEvaluator(PatientDataServiceImpl.java:66)
25-Oct-2019 22:33:38         at org.openmrs.module.reporting.data.patient.service.PatientDataServiceImpl.executeEvaluator(PatientDataServiceImpl.java:34)
25-Oct-2019 22:33:38         at org.openmrs.module.reporting.definition.service.BaseDefinitionService.evaluateBypassingExclusionOfTestPatients(BaseDefinitionService.java:264)
25-Oct-2019 22:33:38         at org.openmrs.module.reporting.definition.service.BaseDefinitionService.evaluate(BaseDefinitionService.java:229)
25-Oct-2019 22:33:38         at org.openmrs.module.reporting.data.patient.service.PatientDataServiceImpl.evaluate(PatientDataServiceImpl.java:48)
25-Oct-2019 22:33:38         at sun.reflect.GeneratedMethodAccessor858.invoke(Unknown Source)
25-Oct-2019 22:33:38         at sun.reflect.DelegatingMethodAccessorImpl.invoke(DelegatingMethodAccessorImpl.java:43)
25-Oct-2019 22:33:38         at java.lang.reflect.Method.invoke(Method.java:498)
25-Oct-2019 22:33:38         at org.springframework.aop.support.AopUtils.invokeJoinpointUsingReflection(AopUtils.java:317)
25-Oct-2019 22:33:38         at org.springframework.aop.framework.ReflectiveMethodInvocation.invokeJoinpoint(ReflectiveMethodInvocation.java:190)
25-Oct-2019 22:33:38         at org.springframework.aop.framework.ReflectiveMethodInvocation.proceed(ReflectiveMethodInvocation.java:157)
25-Oct-2019 22:33:38         at org.springframework.cache.interceptor.CacheInterceptor$1.invoke(CacheInterceptor.java:52)
25-Oct-2019 22:33:38         at org.springframework.cache.interceptor.CacheAspectSupport.execute(CacheAspectSupport.java:303)
25-Oct-2019 22:33:38         at org.springframework.cache.interceptor.CacheInterceptor.invoke(CacheInterceptor.java:61)
25-Oct-2019 22:33:38         at org.springframework.aop.framework.ReflectiveMethodInvocation.proceed(ReflectiveMethodInvocation.java:179)
25-Oct-2019 22:33:38         at org.openmrs.aop.LoggingAdvice.invoke(LoggingAdvice.java:121)
25-Oct-2019 22:33:38         at org.springframework.aop.framework.ReflectiveMethodInvocation.proceed(ReflectiveMethodInvocation.java:179)
25-Oct-2019 22:33:38         at org.springframework.aop.framework.adapter.MethodBeforeAdviceInterceptor.invoke(MethodBeforeAdviceInterceptor.java:52)
25-Oct-2019 22:33:38         at org.springframework.aop.framework.ReflectiveMethodInvocation.proceed(ReflectiveMethodInvocation.java:179)
25-Oct-2019 22:33:38         at org.springframework.aop.framework.adapter.MethodBeforeAdviceInterceptor.invoke(MethodBeforeAdviceInterceptor.java:52)
25-Oct-2019 22:33:38         at org.springframework.aop.framework.ReflectiveMethodInvocation.proceed(ReflectiveMethodInvocation.java:179)
25-Oct-2019 22:33:38         at org.springframework.aop.framework.JdkDynamicAopProxy.invoke(JdkDynamicAopProxy.java:207)
25-Oct-2019 22:33:38         at com.sun.proxy.$Proxy37.evaluate(Unknown Source)
25-Oct-2019 22:33:38         at sun.reflect.GeneratedMethodAccessor858.invoke(Unknown Source)
25-Oct-2019 22:33:38         at sun.reflect.DelegatingMethodAccessorImpl.invoke(DelegatingMethodAccessorImpl.java:43)
25-Oct-2019 22:33:38         at java.lang.reflect.Method.invoke(Method.java:498)
25-Oct-2019 22:33:38         at org.springframework.aop.support.AopUtils.invokeJoinpointUsingReflection(AopUtils.java:317)
25-Oct-2019 22:33:38         at org.springframework.aop.framework.JdkDynamicAopProxy.invoke(JdkDynamicAopProxy.java:201)
25-Oct-2019 22:33:38         at com.sun.proxy.$Proxy143.evaluate(Unknown Source)
25-Oct-2019 22:33:38         at org.openmrs.module.reporting.data.patient.evaluator.PatientCalculationDataEvaluatorTest.evaluate_shouldThrowAnErrorIfNoCalculationRegistrationExistsOnTheDefinition(PatientCalculationDataEvaluatorTest.java:90)
25-Oct-2019 22:33:38         at sun.reflect.NativeMethodAccessorImpl.invoke0(Native Method)
25-Oct-2019 22:33:38         at sun.reflect.NativeMethodAccessorImpl.invoke(NativeMethodAccessorImpl.java:62)
25-Oct-2019 22:33:38         at sun.reflect.DelegatingMethodAccessorImpl.invoke(DelegatingMethodAccessorImpl.java:43)
25-Oct-2019 22:33:38         at java.lang.reflect.Method.invoke(Method.java:498)
25-Oct-2019 22:33:38         at org.junit.runners.model.FrameworkMethod$1.runReflectiveCall(FrameworkMethod.java:47)
25-Oct-2019 22:33:38         at org.junit.internal.runners.model.ReflectiveCallable.run(ReflectiveCallable.java:12)
25-Oct-2019 22:33:38         at org.junit.runners.model.FrameworkMethod.invokeExplosively(FrameworkMethod.java:44)
25-Oct-2019 22:33:38         at org.junit.internal.runners.statements.InvokeMethod.evaluate(InvokeMethod.java:17)
25-Oct-2019 22:33:38         at org.junit.internal.runners.statements.ExpectException.evaluate(ExpectException.java:19)
25-Oct-2019 22:33:38         at org.junit.internal.runners.statements.RunBefores.evaluate(RunBefores.java:26)
25-Oct-2019 22:33:38         at org.springframework.test.context.junit4.statements.RunBeforeTestMethodCallbacks.evaluate(RunBeforeTestMethodCallbacks.java:73)
25-Oct-2019 22:33:38         at org.junit.internal.runners.statements.RunAfters.evaluate(RunAfters.java:27)
25-Oct-2019 22:33:38         at org.springframework.test.context.junit4.statements.RunAfterTestMethodCallbacks.evaluate(RunAfterTestMethodCallbacks.java:82)
25-Oct-2019 22:33:38         at org.springframework.test.context.junit4.statements.SpringRepeat.evaluate(SpringRepeat.java:73)
25-Oct-2019 22:33:38         at org.junit.runners.ParentRunner.runLeaf(ParentRunner.java:271)
25-Oct-2019 22:33:38         at org.springframework.test.context.junit4.SpringJUnit4ClassRunner.runChild(SpringJUnit4ClassRunner.java:217)
25-Oct-2019 22:33:38         at org.springframework.test.context.junit4.SpringJUnit4ClassRunner.runChild(SpringJUnit4ClassRunner.java:83)
25-Oct-2019 22:33:38         at org.junit.runners.ParentRunner$3.run(ParentRunner.java:238)
25-Oct-2019 22:33:38         at org.junit.runners.ParentRunner$1.schedule(ParentRunner.java:63)
25-Oct-2019 22:33:38         at org.junit.runners.ParentRunner.runChildren(ParentRunner.java:236)
25-Oct-2019 22:33:38         at org.junit.runners.ParentRunner.access$000(ParentRunner.java:53)
25-Oct-2019 22:33:38         at org.junit.runners.ParentRunner$2.evaluate(ParentRunner.java:229)
25-Oct-2019 22:33:38         at org.springframework.test.context.junit4.statements.RunBeforeTestClassCallbacks.evaluate(RunBeforeTestClassCallbacks.java:61)
25-Oct-2019 22:33:38         at org.junit.internal.runners.statements.RunAfters.evaluate(RunAfters.java:27)
25-Oct-2019 22:33:38         at org.springframework.test.context.junit4.statements.RunAfterTestClassCallbacks.evaluate(RunAfterTestClassCallbacks.java:68)
25-Oct-2019 22:33:38         at org.junit.runners.ParentRunner.run(ParentRunner.java:309)
25-Oct-2019 22:33:38         at org.springframework.test.context.junit4.SpringJUnit4ClassRunner.run(SpringJUnit4ClassRunner.java:163)
25-Oct-2019 22:33:38         at org.apache.maven.surefire.junit4.JUnit4TestSet.execute(JUnit4TestSet.java:59)
25-Oct-2019 22:33:38         at org.apache.maven.surefire.suite.AbstractDirectoryTestSuite.executeTestSet(AbstractDirectoryTestSuite.java:115)
25-Oct-2019 22:33:38         at org.apache.maven.surefire.suite.AbstractDirectoryTestSuite.execute(AbstractDirectoryTestSuite.java:102)
25-Oct-2019 22:33:38         at org.apache.maven.surefire.Surefire.run(Surefire.java:180)
25-Oct-2019 22:33:38         at sun.reflect.NativeMethodAccessorImpl.invoke0(Native Method)
25-Oct-2019 22:33:38         at sun.reflect.NativeMethodAccessorImpl.invoke(NativeMethodAccessorImpl.java:62)
25-Oct-2019 22:33:38         at sun.reflect.DelegatingMethodAccessorImpl.invoke(DelegatingMethodAccessorImpl.java:43)
25-Oct-2019 22:33:38         at java.lang.reflect.Method.invoke(Method.java:498)
25-Oct-2019 22:33:38         at org.apache.maven.surefire.booter.SurefireBooter.runSuitesInProcess(SurefireBooter.java:350)
25-Oct-2019 22:33:38         at org.apache.maven.surefire.booter.SurefireBooter.main(SurefireBooter.java:1021)
25-Oct-2019 22:33:38 Tests run: 2, Failures: 0, Errors: 0, Skipped: 0, Time elapsed: 0.245 sec
25-Oct-2019 22:33:38 Running org.openmrs.module.reporting.data.converter.DateConverterTest
25-Oct-2019 22:33:38 Tests run: 1, Failures: 0, Errors: 0, Skipped: 0, Time elapsed: 0.002 sec
25-Oct-2019 22:33:38 Running org.openmrs.module.reporting.dataset.definition.evaluator.EncounterAndObsDataSetEvaluatorTest
25-Oct-2019 22:33:39 Tests run: 1, Failures: 0, Errors: 0, Skipped: 0, Time elapsed: 0.342 sec
25-Oct-2019 22:33:39 Running org.openmrs.module.reporting.data.encounter.evaluator.PatientToEncounterDataEvaluatorTest
25-Oct-2019 22:33:39 Tests run: 3, Failures: 0, Errors: 0, Skipped: 0, Time elapsed: 0.341 sec
25-Oct-2019 22:33:39 Running org.openmrs.module.reporting.data.patient.evaluator.PatientIdDataEvaluatorTest
25-Oct-2019 22:33:39 Tests run: 1, Failures: 0, Errors: 0, Skipped: 0, Time elapsed: 0.118 sec
25-Oct-2019 22:33:39 Running org.openmrs.module.reporting.data.person.evaluator.RelationshipsForPersonDataEvaluatorTest
25-Oct-2019 22:33:39 Tests run: 3, Failures: 0, Errors: 0, Skipped: 0, Time elapsed: 0.333 sec
25-Oct-2019 22:33:39 Running org.openmrs.module.reporting.data.patient.evaluator.PersonToPatientDataEvaluatorTest
25-Oct-2019 22:33:39 Tests run: 1, Failures: 0, Errors: 0, Skipped: 0, Time elapsed: 0.105 sec
25-Oct-2019 22:33:39 Running org.openmrs.module.reporting.data.patient.service.PatientDataServiceImplTest
25-Oct-2019 22:33:40 Tests run: 6, Failures: 0, Errors: 0, Skipped: 0, Time elapsed: 0.928 sec
25-Oct-2019 22:33:40
25-Oct-2019 22:33:40 Results :
25-Oct-2019 22:33:40
25-Oct-2019 22:33:40 Tests run: 723, Failures: 0, Errors: 0, Skipped: 13
25-Oct-2019 22:33:40
25-Oct-2019 22:33:41 [INFO]
25-Oct-2019 22:33:41 [INFO] --- maven-jar-plugin:2.4:jar (default-jar) @ reporting-api-tests ---
25-Oct-2019 22:33:41 [WARNING] JAR will be empty - no content was marked for inclusion!
25-Oct-2019 22:33:41 [INFO] Building jar: /home/bamboo-agent/bamboo-agent/xml-data/build-dir/REP-REP-T2DOT1/api-tests/target/reporting-api-tests-1.19.0-SNAPSHOT.jar
25-Oct-2019 22:33:41 [INFO]
25-Oct-2019 22:33:41 [INFO] --- maven-jar-plugin:2.4:test-jar (default) @ reporting-api-tests ---
25-Oct-2019 22:33:41 [INFO] Building jar: /home/bamboo-agent/bamboo-agent/xml-data/build-dir/REP-REP-T2DOT1/api-tests/target/reporting-api-tests-1.19.0-SNAPSHOT-tests.jar
25-Oct-2019 22:33:41 [INFO]                                                                         
25-Oct-2019 22:33:41 [INFO] ------------------------------------------------------------------------
25-Oct-2019 22:33:41 [INFO] Building reporting Module api 1.10 1.19.0-SNAPSHOT
25-Oct-2019 22:33:41 [INFO] ------------------------------------------------------------------------
25-Oct-2019 22:33:41 [INFO]
25-Oct-2019 22:33:41 [INFO] --- maven-clean-plugin:2.5:clean (default-clean) @ reporting-api-1.10 ---
25-Oct-2019 22:33:41 [INFO]
25-Oct-2019 22:33:41 [INFO] --- maven-resources-plugin:2.6:resources (default-resources) @ reporting-api-1.10 ---
25-Oct-2019 22:33:41 [INFO] Using 'UTF-8' encoding to copy filtered resources.
25-Oct-2019 22:33:41 [INFO] skip non existing resourceDirectory /home/bamboo-agent/bamboo-agent/xml-data/build-dir/REP-REP-T2DOT1/api-1.10/src/main/resources
25-Oct-2019 22:33:41 [INFO]
25-Oct-2019 22:33:41 [INFO] --- maven-compiler-plugin:3.1:compile (default-compile) @ reporting-api-1.10 ---
25-Oct-2019 22:33:41 [INFO] Changes detected - recompiling the module!
25-Oct-2019 22:33:41 [INFO] Compiling 3 source files to /home/bamboo-agent/bamboo-agent/xml-data/build-dir/REP-REP-T2DOT1/api-1.10/target/classes
25-Oct-2019 22:33:41 [INFO]
25-Oct-2019 22:33:41 [INFO] --- build-helper-maven-plugin:1.7:parse-version (default) @ reporting-api-1.10 ---
25-Oct-2019 22:33:41 [INFO]
25-Oct-2019 22:33:41 [INFO] --- maven-resources-plugin:2.6:testResources (default-testResources) @ reporting-api-1.10 ---
25-Oct-2019 22:33:41 [INFO] Using 'UTF-8' encoding to copy filtered resources.
25-Oct-2019 22:33:41 [INFO] Copying 1 resource
25-Oct-2019 22:33:41 [INFO] Copying 0 resource
25-Oct-2019 22:33:41 [INFO]
25-Oct-2019 22:33:41 [INFO] --- maven-compiler-plugin:3.1:testCompile (default-testCompile) @ reporting-api-1.10 ---
25-Oct-2019 22:33:41 [INFO] Changes detected - recompiling the module!
25-Oct-2019 22:33:41 [INFO] Compiling 2 source files to /home/bamboo-agent/bamboo-agent/xml-data/build-dir/REP-REP-T2DOT1/api-1.10/target/test-classes
25-Oct-2019 22:33:41 [WARNING] /home/bamboo-agent/bamboo-agent/xml-data/build-dir/REP-REP-T2DOT1/api-1.10/src/test/java/org/openmrs/module/reporting/cohort/definition/evaluator/DrugOrderCohortDefinitionEvaluatorTest.java: /home/bamboo-agent/bamboo-agent/xml-data/build-dir/REP-REP-T2DOT1/api-1.10/src/test/java/org/openmrs/module/reporting/cohort/definition/evaluator/DrugOrderCohortDefinitionEvaluatorTest.java uses or overrides a deprecated API.
25-Oct-2019 22:33:41 [WARNING] /home/bamboo-agent/bamboo-agent/xml-data/build-dir/REP-REP-T2DOT1/api-1.10/src/test/java/org/openmrs/module/reporting/cohort/definition/evaluator/DrugOrderCohortDefinitionEvaluatorTest.java: Recompile with -Xlint:deprecation for details.
25-Oct-2019 22:33:41 [WARNING] /home/bamboo-agent/bamboo-agent/xml-data/build-dir/REP-REP-T2DOT1/api-1.10/src/test/java/org/openmrs/module/reporting/cohort/definition/evaluator/DrugOrderCohortDefinitionEvaluatorTest.java: /home/bamboo-agent/bamboo-agent/xml-data/build-dir/REP-REP-T2DOT1/api-1.10/src/test/java/org/openmrs/module/reporting/cohort/definition/evaluator/DrugOrderCohortDefinitionEvaluatorTest.java uses unchecked or unsafe operations.
25-Oct-2019 22:33:41 [WARNING] /home/bamboo-agent/bamboo-agent/xml-data/build-dir/REP-REP-T2DOT1/api-1.10/src/test/java/org/openmrs/module/reporting/cohort/definition/evaluator/DrugOrderCohortDefinitionEvaluatorTest.java: Recompile with -Xlint:unchecked for details.
25-Oct-2019 22:33:41 [INFO]
25-Oct-2019 22:33:41 [INFO] --- maven-surefire-plugin:2.5:test (default-test) @ reporting-api-1.10 ---
25-Oct-2019 22:33:41 [INFO] Surefire report directory: /home/bamboo-agent/bamboo-agent/xml-data/build-dir/REP-REP-T2DOT1/api-1.10/target/surefire-reports
25-Oct-2019 22:33:41 OpenJDK 64-Bit Server VM warning: ignoring option MaxPermSize=512m; support was removed in 8.0
25-Oct-2019 22:33:41
25-Oct-2019 22:33:41 -------------------------------------------------------
25-Oct-2019 22:33:41 T E S T S
25-Oct-2019 22:33:41 -------------------------------------------------------
25-Oct-2019 22:33:41 Running org.openmrs.module.reporting.cohort.definition.evaluator.DrugOrderCohortDefinitionEvaluatorTest
25-Oct-2019 22:33:42 log4j:WARN No appenders could be found for logger (org.springframework.test.context.junit4.SpringJUnit4ClassRunner).
25-Oct-2019 22:33:42 log4j:WARN Please initialize the log4j system properly.
25-Oct-2019 22:34:01 Tests run: 18, Failures: 0, Errors: 0, Skipped: 0, Time elapsed: 19.125 sec
25-Oct-2019 22:34:01 Running org.openmrs.module.reporting.cohort.definition.library.BuiltInCohortDefinitionLibrary1_10Test
25-Oct-2019 22:34:01 Tests run: 1, Failures: 0, Errors: 0, Skipped: 0, Time elapsed: 0.006 sec
25-Oct-2019 22:34:01
25-Oct-2019 22:34:01 Results :
25-Oct-2019 22:34:01
25-Oct-2019 22:34:01 Tests run: 19, Failures: 0, Errors: 0, Skipped: 0
25-Oct-2019 22:34:01
25-Oct-2019 22:34:01 [INFO]
25-Oct-2019 22:34:01 [INFO] --- maven-jar-plugin:2.4:jar (default-jar) @ reporting-api-1.10 ---
25-Oct-2019 22:34:01 [INFO] Building jar: /home/bamboo-agent/bamboo-agent/xml-data/build-dir/REP-REP-T2DOT1/api-1.10/target/reporting-api-1.10-1.19.0-SNAPSHOT.jar
25-Oct-2019 22:34:01 [INFO]
25-Oct-2019 22:34:01 [INFO] --- maven-jar-plugin:2.4:test-jar (default) @ reporting-api-1.10 ---
25-Oct-2019 22:34:01 [INFO] Building jar: /home/bamboo-agent/bamboo-agent/xml-data/build-dir/REP-REP-T2DOT1/api-1.10/target/reporting-api-1.10-1.19.0-SNAPSHOT-tests.jar
25-Oct-2019 22:34:01 [INFO]                                                                         
25-Oct-2019 22:34:01 [INFO] ------------------------------------------------------------------------
25-Oct-2019 22:34:01 [INFO] Building reporting Module api 2.2 1.19.0-SNAPSHOT
25-Oct-2019 22:34:01 [INFO] ------------------------------------------------------------------------
25-Oct-2019 22:34:01 [INFO] Downloading: http://mavenrepo.openmrs.org/nexus/content/repositories/public/mysql/mysql-connector-java/5.1.45/mysql-connector-java-5.1.45.pom
25-Oct-2019 22:34:02 [INFO] Downloaded: http://mavenrepo.openmrs.org/nexus/content/repositories/public/mysql/mysql-connector-java/5.1.45/mysql-connector-java-5.1.45.pom (2 KB at 1.6 KB/sec)
25-Oct-2019 22:34:02 [INFO]
25-Oct-2019 22:34:02 [INFO] --- maven-clean-plugin:2.5:clean (default-clean) @ reporting-api-2.2 ---
25-Oct-2019 22:34:02 [INFO]
25-Oct-2019 22:34:02 [INFO] --- maven-resources-plugin:2.6:resources (default-resources) @ reporting-api-2.2 ---
25-Oct-2019 22:34:02 [INFO] Using 'UTF-8' encoding to copy filtered resources.
25-Oct-2019 22:34:02 [INFO] skip non existing resourceDirectory /home/bamboo-agent/bamboo-agent/xml-data/build-dir/REP-REP-T2DOT1/api-2.2/src/main/resources
25-Oct-2019 22:34:02 [INFO]
25-Oct-2019 22:34:02 [INFO] --- maven-compiler-plugin:3.1:compile (default-compile) @ reporting-api-2.2 ---
25-Oct-2019 22:34:02 [INFO] Changes detected - recompiling the module!
25-Oct-2019 22:34:02 [INFO] Compiling 3 source files to /home/bamboo-agent/bamboo-agent/xml-data/build-dir/REP-REP-T2DOT1/api-2.2/target/classes
25-Oct-2019 22:34:02 [INFO]
25-Oct-2019 22:34:02 [INFO] --- build-helper-maven-plugin:1.7:parse-version (default) @ reporting-api-2.2 ---
25-Oct-2019 22:34:02 [INFO]
25-Oct-2019 22:34:02 [INFO] --- maven-resources-plugin:2.6:testResources (default-testResources) @ reporting-api-2.2 ---
25-Oct-2019 22:34:02 [INFO] Using 'UTF-8' encoding to copy filtered resources.
25-Oct-2019 22:34:02 [INFO] Copying 1 resource
25-Oct-2019 22:34:02 [INFO] Copying 0 resource
25-Oct-2019 22:34:02 [INFO]
25-Oct-2019 22:34:02 [INFO] --- maven-compiler-plugin:3.1:testCompile (default-testCompile) @ reporting-api-2.2 ---
25-Oct-2019 22:34:02 [INFO] Changes detected - recompiling the module!
25-Oct-2019 22:34:02 [INFO] Compiling 2 source files to /home/bamboo-agent/bamboo-agent/xml-data/build-dir/REP-REP-T2DOT1/api-2.2/target/test-classes
25-Oct-2019 22:34:02 [INFO]
25-Oct-2019 22:34:02 [INFO] --- maven-surefire-plugin:2.5:test (default-test) @ reporting-api-2.2 ---
25-Oct-2019 22:34:02 [INFO] Surefire report directory: /home/bamboo-agent/bamboo-agent/xml-data/build-dir/REP-REP-T2DOT1/api-2.2/target/surefire-reports
25-Oct-2019 22:34:02 OpenJDK 64-Bit Server VM warning: ignoring option MaxPermSize=512m; support was removed in 8.0
25-Oct-2019 22:34:02
25-Oct-2019 22:34:02 -------------------------------------------------------
25-Oct-2019 22:34:02 T E S T S
25-Oct-2019 22:34:02 -------------------------------------------------------
25-Oct-2019 22:34:02 Running org.openmrs.module.reporting.cohort.definition.evaluator.ConditionCohortDefinitionEvaluatorTest
25-Oct-2019 22:34:03 log4j:WARN No appenders could be found for logger (org.springframework.test.context.junit4.SpringJUnit4ClassRunner).
25-Oct-2019 22:34:03 log4j:WARN Please initialize the log4j system properly.
25-Oct-2019 22:34:18 Tests run: 12, Failures: 0, Errors: 0, Skipped: 0, Time elapsed: 15.885 sec
25-Oct-2019 22:34:18 Running org.openmrs.module.reporting.cohort.definition.library.BuiltInCohortDefinitionLibrary2_2Test
25-Oct-2019 22:34:18 Tests run: 1, Failures: 0, Errors: 0, Skipped: 0, Time elapsed: 0.01 sec
25-Oct-2019 22:34:18
25-Oct-2019 22:34:18 Results :
25-Oct-2019 22:34:18
25-Oct-2019 22:34:18 Tests run: 13, Failures: 0, Errors: 0, Skipped: 0
25-Oct-2019 22:34:18
25-Oct-2019 22:34:18 [INFO]
25-Oct-2019 22:34:18 [INFO] --- maven-jar-plugin:2.4:jar (default-jar) @ reporting-api-2.2 ---
25-Oct-2019 22:34:18 [INFO] Building jar: /home/bamboo-agent/bamboo-agent/xml-data/build-dir/REP-REP-T2DOT1/api-2.2/target/reporting-api-2.2-1.19.0-SNAPSHOT.jar
25-Oct-2019 22:34:18 [INFO]
25-Oct-2019 22:34:18 [INFO] --- maven-jar-plugin:2.4:test-jar (default) @ reporting-api-2.2 ---
25-Oct-2019 22:34:18 [INFO] Building jar: /home/bamboo-agent/bamboo-agent/xml-data/build-dir/REP-REP-T2DOT1/api-2.2/target/reporting-api-2.2-1.19.0-SNAPSHOT-tests.jar
25-Oct-2019 22:34:18 [INFO]                                                                         
25-Oct-2019 22:34:18 [INFO] ------------------------------------------------------------------------
25-Oct-2019 22:34:18 [INFO] Building Reporting OMOD 1.19.0-SNAPSHOT
25-Oct-2019 22:34:18 [INFO] ------------------------------------------------------------------------
25-Oct-2019 22:34:18 [INFO]
25-Oct-2019 22:34:18 [INFO] --- maven-clean-plugin:2.5:clean (default-clean) @ reporting-omod ---
25-Oct-2019 22:34:19 [INFO]
25-Oct-2019 22:34:19 [INFO] --- maven-openmrs-plugin:1.0.1:initialize-module (init) @ reporting-omod ---
25-Oct-2019 22:34:19 [INFO]
25-Oct-2019 22:34:19 [INFO] --- maven-dependency-plugin:2.8:unpack-dependencies (Expand resources) @ reporting-omod ---
25-Oct-2019 22:34:19 [INFO] Unpacking /home/bamboo-agent/bamboo-agent/xml-data/build-dir/REP-REP-T2DOT1/api/target/reporting-api-1.19.0-SNAPSHOT.jar to /home/bamboo-agent/bamboo-agent/xml-data/build-dir/REP-REP-T2DOT1/omod/target/classes with includes "**\/*.xml,**\/*.properties" and excludes ""
25-Oct-2019 22:34:19 [INFO]
25-Oct-2019 22:34:19 [INFO] --- maven-resources-plugin:2.6:resources (default-resources) @ reporting-omod ---
25-Oct-2019 22:34:19 [INFO] Using 'UTF-8' encoding to copy filtered resources.
25-Oct-2019 22:34:19 [INFO] Copying 0 resource
25-Oct-2019 22:34:19 [INFO] Copying 2 resources
25-Oct-2019 22:34:19 [INFO] Copying 224 resources to web/module
25-Oct-2019 22:34:19 [INFO] Copying 224 resources to web/module
25-Oct-2019 22:34:19 [INFO]
25-Oct-2019 22:34:19 [INFO] --- maven-compiler-plugin:3.1:compile (default-compile) @ reporting-omod ---
25-Oct-2019 22:34:19 [INFO] Changes detected - recompiling the module!
25-Oct-2019 22:34:19 [INFO] Compiling 113 source files to /home/bamboo-agent/bamboo-agent/xml-data/build-dir/REP-REP-T2DOT1/omod/target/classes
25-Oct-2019 22:34:20 [WARNING] /home/bamboo-agent/bamboo-agent/xml-data/build-dir/REP-REP-T2DOT1/omod/src/main/java/org/openmrs/module/reporting/web/controller/mapping/LogicDataSetDefinitionMappingHandler.java: Some input files use or override a deprecated API.
25-Oct-2019 22:34:20 [WARNING] /home/bamboo-agent/bamboo-agent/xml-data/build-dir/REP-REP-T2DOT1/omod/src/main/java/org/openmrs/module/reporting/web/controller/mapping/LogicDataSetDefinitionMappingHandler.java: Recompile with -Xlint:deprecation for details.
25-Oct-2019 22:34:20 [WARNING] /home/bamboo-agent/bamboo-agent/xml-data/build-dir/REP-REP-T2DOT1/omod/src/main/java/org/openmrs/module/reporting/web/datasets/PatientDataSetEditor.java: Some input files use unchecked or unsafe operations.
25-Oct-2019 22:34:20 [WARNING] /home/bamboo-agent/bamboo-agent/xml-data/build-dir/REP-REP-T2DOT1/omod/src/main/java/org/openmrs/module/reporting/web/datasets/PatientDataSetEditor.java: Recompile with -Xlint:unchecked for details.
25-Oct-2019 22:34:20 [INFO]
25-Oct-2019 22:34:20 [INFO] --- build-helper-maven-plugin:1.7:parse-version (default) @ reporting-omod ---
25-Oct-2019 22:34:20 [INFO]
25-Oct-2019 22:34:20 [INFO] --- maven-resources-plugin:2.6:testResources (default-testResources) @ reporting-omod ---
25-Oct-2019 22:34:20 [INFO] Using 'UTF-8' encoding to copy filtered resources.
25-Oct-2019 22:34:20 [INFO] skip non existing resourceDirectory /home/bamboo-agent/bamboo-agent/xml-data/build-dir/REP-REP-T2DOT1/omod/src/test/resources
25-Oct-2019 22:34:20 [INFO] skip non existing resourceDirectory /home/bamboo-agent/bamboo-agent/xml-data/build-dir/REP-REP-T2DOT1/omod/src/test/resources
25-Oct-2019 22:34:20 [INFO]
25-Oct-2019 22:34:20 [INFO] --- maven-compiler-plugin:3.1:testCompile (default-testCompile) @ reporting-omod ---
25-Oct-2019 22:34:20 [INFO] No sources to compile
25-Oct-2019 22:34:20 [INFO]
25-Oct-2019 22:34:20 [INFO] --- maven-surefire-plugin:2.5:test (default-test) @ reporting-omod ---
25-Oct-2019 22:34:20 [INFO] No tests to run.
25-Oct-2019 22:34:20 [INFO]
25-Oct-2019 22:34:20 [INFO] --- maven-jar-plugin:2.4:jar (default-jar) @ reporting-omod ---
25-Oct-2019 22:34:21 [INFO] Building jar: /home/bamboo-agent/bamboo-agent/xml-data/build-dir/REP-REP-T2DOT1/omod/target/reporting-1.19.0-SNAPSHOT.jar
25-Oct-2019 22:34:21 [INFO]
25-Oct-2019 22:34:21 [INFO] --- maven-openmrs-plugin:1.0.1:package-module (pack) @ reporting-omod ---
25-Oct-2019 22:34:21 [INFO] Packaging OpenMRS module
25-Oct-2019 22:34:21 [INFO] Building jar: /home/bamboo-agent/bamboo-agent/xml-data/build-dir/REP-REP-T2DOT1/omod/target/reporting-1.19.0-SNAPSHOT.omod
25-Oct-2019 22:34:22 [INFO]
25-Oct-2019 22:34:22 [INFO] --- maven-jar-plugin:2.4:test-jar (default) @ reporting-omod ---
25-Oct-2019 22:34:22 [WARNING] JAR will be empty - no content was marked for inclusion!
25-Oct-2019 22:34:22 [INFO] Building jar: /home/bamboo-agent/bamboo-agent/xml-data/build-dir/REP-REP-T2DOT1/omod/target/reporting-1.19.0-SNAPSHOT-tests.jar
25-Oct-2019 22:34:22 [INFO] ------------------------------------------------------------------------
25-Oct-2019 22:34:22 [INFO] Reactor Summary:
25-Oct-2019 22:34:22 [INFO]
25-Oct-2019 22:34:22 [INFO] Reporting .......................................... SUCCESS [  2.129 s]
25-Oct-2019 22:34:22 [INFO] Reporting API ...................................... SUCCESS [  9.048 s]
25-Oct-2019 22:34:22 [INFO] reporting Module api 1.9 ........................... SUCCESS [  1.000 s]
25-Oct-2019 22:34:22 [INFO] reporting Module api 2.0 ........................... SUCCESS [  0.160 s]
25-Oct-2019 22:34:22 [INFO] reporting API Tests ................................ SUCCESS [01:37 min]
25-Oct-2019 22:34:22 [INFO] reporting Module api 1.10 .......................... SUCCESS [ 19.939 s]
25-Oct-2019 22:34:22 [INFO] reporting Module api 2.2 ........................... SUCCESS [ 17.618 s]
25-Oct-2019 22:34:22 [INFO] Reporting OMOD ..................................... SUCCESS [  3.209 s]
25-Oct-2019 22:34:22 [INFO] ------------------------------------------------------------------------
25-Oct-2019 22:34:22 [INFO] BUILD SUCCESS
25-Oct-2019 22:34:22 [INFO] ------------------------------------------------------------------------
25-Oct-2019 22:34:22 [INFO] Total time: 02:31 min
25-Oct-2019 22:34:22 [INFO] Finished at: 2019-10-25T22:34:22+00:00
25-Oct-2019 22:34:22 [INFO] Final Memory: 57M/369M
25-Oct-2019 22:34:22 [INFO] ------------------------------------------------------------------------
25-Oct-2019 22:34:22 Parsing test results under /home/bamboo-agent/bamboo-agent/xml-data/build-dir/REP-REP-T2DOT1...
25-Oct-2019 22:34:22 Finished task 'Maven 3.x' with result: Success
25-Oct-2019 22:34:22 Running post build plugin 'Docker Container Cleanup'
25-Oct-2019 22:34:22 Running post build plugin 'NCover Results Collector'
25-Oct-2019 22:34:22 Running post build plugin 'Clover Results Collector'
25-Oct-2019 22:34:22 Running post build plugin 'Sauce OnDemand Post Runner'
25-Oct-2019 22:34:22 Running post build plugin 'npm Cache Cleanup'
25-Oct-2019 22:34:22 Running post build plugin 'Artifact Copier'
25-Oct-2019 22:34:22 Finalising the build...
25-Oct-2019 22:34:22 Stopping timer.
25-Oct-2019 22:34:22 Build REP-REP-T2DOT1-795 completed.
25-Oct-2019 22:34:23 Running on server: post build plugin 'NCover Results Collector'
25-Oct-2019 22:34:23 Running on server: post build plugin 'Build Hanging Detection Configuration'
25-Oct-2019 22:34:23 Running on server: post build plugin 'Clover Delta Calculator'
25-Oct-2019 22:34:23 Running on server: post build plugin 'Maven Dependencies Postprocessor'
25-Oct-2019 22:34:23 All post build plugins have finished
25-Oct-2019 22:34:23 Generating build results summary...
25-Oct-2019 22:34:23 Saving build results to disk...
25-Oct-2019 22:34:23 Logging substituted variables...
25-Oct-2019 22:34:23 Indexing build results...
25-Oct-2019 22:34:23 Finished building REP-REP-T2DOT1-795.