More details of the release in https://wiki.openmrs.org/x/i4DTAw

Build: #795 was successful

Job: Test against 1.11 was successful

Build log

The build generated 1,689 lines of output.The output is too long and has been truncated to the last 1,000 lines. Download or view full build log

25-Oct-2019 22:42:46         at java.lang.reflect.Method.invoke(Method.java:498)
25-Oct-2019 22:42:46         at org.springframework.aop.support.AopUtils.invokeJoinpointUsingReflection(AopUtils.java:317)
25-Oct-2019 22:42:46         at org.springframework.aop.framework.ReflectiveMethodInvocation.invokeJoinpoint(ReflectiveMethodInvocation.java:183)
25-Oct-2019 22:42:46         at org.springframework.aop.framework.ReflectiveMethodInvocation.proceed(ReflectiveMethodInvocation.java:150)
25-Oct-2019 22:42:46         at org.springframework.transaction.interceptor.TransactionInterceptor$1.proceedWithInvocation(TransactionInterceptor.java:96)
25-Oct-2019 22:42:46         at org.springframework.transaction.interceptor.TransactionAspectSupport.invokeWithinTransaction(TransactionAspectSupport.java:260)
25-Oct-2019 22:42:46         at org.springframework.transaction.interceptor.TransactionInterceptor.invoke(TransactionInterceptor.java:94)
25-Oct-2019 22:42:46         at org.springframework.aop.framework.ReflectiveMethodInvocation.proceed(ReflectiveMethodInvocation.java:172)
25-Oct-2019 22:42:46         at org.openmrs.aop.LoggingAdvice.invoke(LoggingAdvice.java:121)
25-Oct-2019 22:42:46         at org.springframework.aop.framework.ReflectiveMethodInvocation.proceed(ReflectiveMethodInvocation.java:172)
25-Oct-2019 22:42:46         at org.springframework.aop.framework.adapter.MethodBeforeAdviceInterceptor.invoke(MethodBeforeAdviceInterceptor.java:51)
25-Oct-2019 22:42:46         at org.springframework.aop.framework.ReflectiveMethodInvocation.proceed(ReflectiveMethodInvocation.java:172)
25-Oct-2019 22:42:46         at org.springframework.aop.framework.adapter.MethodBeforeAdviceInterceptor.invoke(MethodBeforeAdviceInterceptor.java:51)
25-Oct-2019 22:42:46         at org.springframework.aop.framework.ReflectiveMethodInvocation.proceed(ReflectiveMethodInvocation.java:172)
25-Oct-2019 22:42:46         at org.springframework.aop.framework.JdkDynamicAopProxy.invoke(JdkDynamicAopProxy.java:204)
25-Oct-2019 22:42:46         at com.sun.proxy.$Proxy26.evaluateToList(Unknown Source)
25-Oct-2019 22:42:46         at sun.reflect.GeneratedMethodAccessor263.invoke(Unknown Source)
25-Oct-2019 22:42:46         at sun.reflect.DelegatingMethodAccessorImpl.invoke(DelegatingMethodAccessorImpl.java:43)
25-Oct-2019 22:42:46         at java.lang.reflect.Method.invoke(Method.java:498)
25-Oct-2019 22:42:46         at org.springframework.aop.support.AopUtils.invokeJoinpointUsingReflection(AopUtils.java:317)
25-Oct-2019 22:42:46         at org.springframework.aop.framework.ReflectiveMethodInvocation.invokeJoinpoint(ReflectiveMethodInvocation.java:183)
25-Oct-2019 22:42:46         at org.springframework.aop.framework.ReflectiveMethodInvocation.proceed(ReflectiveMethodInvocation.java:150)
25-Oct-2019 22:42:46         at org.springframework.transaction.interceptor.TransactionInterceptor$1.proceedWithInvocation(TransactionInterceptor.java:96)
25-Oct-2019 22:42:46         at org.springframework.transaction.interceptor.TransactionAspectSupport.invokeWithinTransaction(TransactionAspectSupport.java:260)
25-Oct-2019 22:42:46         at org.springframework.transaction.interceptor.TransactionInterceptor.invoke(TransactionInterceptor.java:94)
25-Oct-2019 22:42:46         at org.springframework.aop.framework.ReflectiveMethodInvocation.proceed(ReflectiveMethodInvocation.java:172)
25-Oct-2019 22:42:46         at org.springframework.aop.framework.JdkDynamicAopProxy.invoke(JdkDynamicAopProxy.java:204)
25-Oct-2019 22:42:46         at com.sun.proxy.$Proxy143.evaluateToList(Unknown Source)
25-Oct-2019 22:42:46         at org.openmrs.module.reporting.cohort.definition.evaluator.SqlCohortDefinitionEvaluator.evaluate(SqlCohortDefinitionEvaluator.java:61)
25-Oct-2019 22:42:46         at org.openmrs.module.reporting.cohort.definition.evaluator.SqlCohortDefinitionEvaluator.evaluate(SqlCohortDefinitionEvaluator.java:28)
25-Oct-2019 22:42:46         at org.openmrs.module.reporting.definition.service.BaseDefinitionService.executeEvaluator(BaseDefinitionService.java:369)
25-Oct-2019 22:42:46         at org.openmrs.module.reporting.definition.service.BaseDefinitionService.evaluateBypassingExclusionOfTestPatients(BaseDefinitionService.java:264)
25-Oct-2019 22:42:46         at org.openmrs.module.reporting.cohort.definition.service.CohortDefinitionServiceImpl.evaluateBypassingExclusionOfTestPatients(CohortDefinitionServiceImpl.java:54)
25-Oct-2019 22:42:46         at org.openmrs.module.reporting.cohort.definition.service.CohortDefinitionServiceImpl.evaluateBypassingExclusionOfTestPatients(CohortDefinitionServiceImpl.java:24)
25-Oct-2019 22:42:46         at org.openmrs.module.reporting.definition.service.BaseDefinitionService.evaluate(BaseDefinitionService.java:229)
25-Oct-2019 22:42:46         at org.openmrs.module.reporting.cohort.definition.service.CohortDefinitionServiceImpl.evaluate(CohortDefinitionServiceImpl.java:38)
25-Oct-2019 22:42:46         at sun.reflect.GeneratedMethodAccessor262.invoke(Unknown Source)
25-Oct-2019 22:42:46         at sun.reflect.DelegatingMethodAccessorImpl.invoke(DelegatingMethodAccessorImpl.java:43)
25-Oct-2019 22:42:46         at java.lang.reflect.Method.invoke(Method.java:498)
25-Oct-2019 22:42:46         at org.springframework.aop.support.AopUtils.invokeJoinpointUsingReflection(AopUtils.java:317)
25-Oct-2019 22:42:46         at org.springframework.aop.framework.ReflectiveMethodInvocation.invokeJoinpoint(ReflectiveMethodInvocation.java:183)
25-Oct-2019 22:42:46         at org.springframework.aop.framework.ReflectiveMethodInvocation.proceed(ReflectiveMethodInvocation.java:150)
25-Oct-2019 22:42:46         at org.openmrs.aop.LoggingAdvice.invoke(LoggingAdvice.java:121)
25-Oct-2019 22:42:46         at org.springframework.aop.framework.ReflectiveMethodInvocation.proceed(ReflectiveMethodInvocation.java:172)
25-Oct-2019 22:42:46         at org.springframework.aop.framework.adapter.MethodBeforeAdviceInterceptor.invoke(MethodBeforeAdviceInterceptor.java:51)
25-Oct-2019 22:42:46         at org.springframework.aop.framework.ReflectiveMethodInvocation.proceed(ReflectiveMethodInvocation.java:172)
25-Oct-2019 22:42:46         at org.springframework.aop.framework.adapter.MethodBeforeAdviceInterceptor.invoke(MethodBeforeAdviceInterceptor.java:51)
25-Oct-2019 22:42:46         at org.springframework.aop.framework.ReflectiveMethodInvocation.proceed(ReflectiveMethodInvocation.java:172)
25-Oct-2019 22:42:46         at org.springframework.aop.framework.JdkDynamicAopProxy.invoke(JdkDynamicAopProxy.java:204)
25-Oct-2019 22:42:46         at com.sun.proxy.$Proxy37.evaluate(Unknown Source)
25-Oct-2019 22:42:46         at sun.reflect.GeneratedMethodAccessor262.invoke(Unknown Source)
25-Oct-2019 22:42:46         at sun.reflect.DelegatingMethodAccessorImpl.invoke(DelegatingMethodAccessorImpl.java:43)
25-Oct-2019 22:42:46         at java.lang.reflect.Method.invoke(Method.java:498)
25-Oct-2019 22:42:46         at org.springframework.aop.support.AopUtils.invokeJoinpointUsingReflection(AopUtils.java:317)
25-Oct-2019 22:42:46         at org.springframework.aop.framework.JdkDynamicAopProxy.invoke(JdkDynamicAopProxy.java:198)
25-Oct-2019 22:42:46         at com.sun.proxy.$Proxy145.evaluate(Unknown Source)
25-Oct-2019 22:42:46         at org.openmrs.module.reporting.cohort.definition.evaluator.SqlCohortDefinitionEvaluatorTest.shouldProtectSqlQueryAgainstDatabaseModifications(SqlCohortDefinitionEvaluatorTest.java:308)
25-Oct-2019 22:42:46         at sun.reflect.NativeMethodAccessorImpl.invoke0(Native Method)
25-Oct-2019 22:42:46         at sun.reflect.NativeMethodAccessorImpl.invoke(NativeMethodAccessorImpl.java:62)
25-Oct-2019 22:42:46         at sun.reflect.DelegatingMethodAccessorImpl.invoke(DelegatingMethodAccessorImpl.java:43)
25-Oct-2019 22:42:46         at java.lang.reflect.Method.invoke(Method.java:498)
25-Oct-2019 22:42:46         at org.junit.runners.model.FrameworkMethod$1.runReflectiveCall(FrameworkMethod.java:47)
25-Oct-2019 22:42:46         at org.junit.internal.runners.model.ReflectiveCallable.run(ReflectiveCallable.java:12)
25-Oct-2019 22:42:46         at org.junit.runners.model.FrameworkMethod.invokeExplosively(FrameworkMethod.java:44)
25-Oct-2019 22:42:46         at org.junit.internal.runners.statements.InvokeMethod.evaluate(InvokeMethod.java:17)
25-Oct-2019 22:42:46         at org.junit.internal.runners.statements.ExpectException.evaluate(ExpectException.java:19)
25-Oct-2019 22:42:46         at org.junit.internal.runners.statements.RunBefores.evaluate(RunBefores.java:26)
25-Oct-2019 22:42:46         at org.springframework.test.context.junit4.statements.RunBeforeTestMethodCallbacks.evaluate(RunBeforeTestMethodCallbacks.java:74)
25-Oct-2019 22:42:46         at org.junit.internal.runners.statements.RunAfters.evaluate(RunAfters.java:27)
25-Oct-2019 22:42:46         at org.springframework.test.context.junit4.statements.RunAfterTestMethodCallbacks.evaluate(RunAfterTestMethodCallbacks.java:83)
25-Oct-2019 22:42:46         at org.springframework.test.context.junit4.statements.SpringRepeat.evaluate(SpringRepeat.java:72)
25-Oct-2019 22:42:46         at org.springframework.test.context.junit4.SpringJUnit4ClassRunner.runChild(SpringJUnit4ClassRunner.java:231)
25-Oct-2019 22:42:46         at org.springframework.test.context.junit4.SpringJUnit4ClassRunner.runChild(SpringJUnit4ClassRunner.java:88)
25-Oct-2019 22:42:46         at org.junit.runners.ParentRunner$3.run(ParentRunner.java:238)
25-Oct-2019 22:42:46         at org.junit.runners.ParentRunner$1.schedule(ParentRunner.java:63)
25-Oct-2019 22:42:46         at org.junit.runners.ParentRunner.runChildren(ParentRunner.java:236)
25-Oct-2019 22:42:46         at org.junit.runners.ParentRunner.access$000(ParentRunner.java:53)
25-Oct-2019 22:42:46         at org.junit.runners.ParentRunner$2.evaluate(ParentRunner.java:229)
25-Oct-2019 22:42:46         at org.springframework.test.context.junit4.statements.RunBeforeTestClassCallbacks.evaluate(RunBeforeTestClassCallbacks.java:61)
25-Oct-2019 22:42:46         at org.junit.internal.runners.statements.RunAfters.evaluate(RunAfters.java:27)
25-Oct-2019 22:42:46         at org.springframework.test.context.junit4.statements.RunAfterTestClassCallbacks.evaluate(RunAfterTestClassCallbacks.java:71)
25-Oct-2019 22:42:46         at org.junit.runners.ParentRunner.run(ParentRunner.java:309)
25-Oct-2019 22:42:46         at org.springframework.test.context.junit4.SpringJUnit4ClassRunner.run(SpringJUnit4ClassRunner.java:174)
25-Oct-2019 22:42:46         at org.apache.maven.surefire.junit4.JUnit4TestSet.execute(JUnit4TestSet.java:59)
25-Oct-2019 22:42:46         at org.apache.maven.surefire.suite.AbstractDirectoryTestSuite.executeTestSet(AbstractDirectoryTestSuite.java:115)
25-Oct-2019 22:42:46         at org.apache.maven.surefire.suite.AbstractDirectoryTestSuite.execute(AbstractDirectoryTestSuite.java:102)
25-Oct-2019 22:42:46         at org.apache.maven.surefire.Surefire.run(Surefire.java:180)
25-Oct-2019 22:42:46         at sun.reflect.NativeMethodAccessorImpl.invoke0(Native Method)
25-Oct-2019 22:42:46         at sun.reflect.NativeMethodAccessorImpl.invoke(NativeMethodAccessorImpl.java:62)
25-Oct-2019 22:42:46         at sun.reflect.DelegatingMethodAccessorImpl.invoke(DelegatingMethodAccessorImpl.java:43)
25-Oct-2019 22:42:46         at java.lang.reflect.Method.invoke(Method.java:498)
25-Oct-2019 22:42:46         at org.apache.maven.surefire.booter.SurefireBooter.runSuitesInProcess(SurefireBooter.java:350)
25-Oct-2019 22:42:46         at org.apache.maven.surefire.booter.SurefireBooter.main(SurefireBooter.java:1021)
25-Oct-2019 22:42:46 Caused by: org.hibernate.exception.GenericJDBCException: error executing work
25-Oct-2019 22:42:46         at org.hibernate.exception.SQLStateConverter.handledNonSpecificException(SQLStateConverter.java:140)
25-Oct-2019 22:42:46         at org.hibernate.exception.SQLStateConverter.convert(SQLStateConverter.java:128)
25-Oct-2019 22:42:46         at org.hibernate.exception.JDBCExceptionHelper.convert(JDBCExceptionHelper.java:66)
25-Oct-2019 22:42:46         at org.hibernate.exception.JDBCExceptionHelper.convert(JDBCExceptionHelper.java:52)
25-Oct-2019 22:42:46         at org.hibernate.impl.SessionImpl.doWork(SessionImpl.java:2001)
25-Oct-2019 22:42:46         at org.openmrs.api.db.hibernate.DbSession.doWork(DbSession.java:958)
25-Oct-2019 22:42:46         at org.openmrs.module.reporting.evaluation.querybuilder.SqlQueryBuilder.evaluateToList(SqlQueryBuilder.java:152)
25-Oct-2019 22:42:46         ... 97 more
25-Oct-2019 22:42:46 Caused by: org.h2.jdbc.JdbcSQLException: Method is only allowed for a query. Use execute or executeUpdate instead of executeQuery; SQL statement:
25-Oct-2019 22:42:46 update person set gender='F'  [90002-173]
25-Oct-2019 22:42:46         at org.h2.message.DbException.getJdbcSQLException(DbException.java:331)
25-Oct-2019 22:42:46         at org.h2.message.DbException.get(DbException.java:171)
25-Oct-2019 22:42:46         at org.h2.message.DbException.get(DbException.java:148)
25-Oct-2019 22:42:46         at org.h2.message.DbException.get(DbException.java:137)
25-Oct-2019 22:42:46         at org.h2.command.Prepared.query(Prepared.java:211)
25-Oct-2019 22:42:46         at org.h2.command.CommandContainer.query(CommandContainer.java:91)
25-Oct-2019 22:42:46         at org.h2.command.Command.executeQuery(Command.java:195)
25-Oct-2019 22:42:46         at org.h2.jdbc.JdbcPreparedStatement.executeQuery(JdbcPreparedStatement.java:106)
25-Oct-2019 22:42:46         at com.mchange.v2.c3p0.impl.NewProxyPreparedStatement.executeQuery(NewProxyPreparedStatement.java:76)
25-Oct-2019 22:42:46         at org.openmrs.module.reporting.evaluation.querybuilder.SqlQueryBuilder$2.execute(SqlQueryBuilder.java:159)
25-Oct-2019 22:42:46         at org.hibernate.impl.SessionImpl.doWork(SessionImpl.java:1997)
25-Oct-2019 22:42:46         ... 99 more
25-Oct-2019 22:42:46 Tests run: 13, Failures: 0, Errors: 0, Skipped: 0, Time elapsed: 1.828 sec
25-Oct-2019 22:42:46 Running org.openmrs.module.reporting.evaluation.service.EvaluationServiceTest
25-Oct-2019 22:42:48 Tests run: 6, Failures: 0, Errors: 0, Skipped: 0, Time elapsed: 1.648 sec
25-Oct-2019 22:42:48 Running org.openmrs.module.reporting.data.obs.evaluator.EncounterToObsDataEvaluatorTest
25-Oct-2019 22:42:48 Tests run: 3, Failures: 0, Errors: 0, Skipped: 0, Time elapsed: 0.368 sec
25-Oct-2019 22:42:48 Running org.openmrs.module.reporting.query.encounter.evaluator.MappedParametersEncounterQueryEvaluatorTest
25-Oct-2019 22:42:48 Tests run: 1, Failures: 0, Errors: 0, Skipped: 0, Time elapsed: 0.122 sec
25-Oct-2019 22:42:48 Running org.openmrs.module.reporting.validator.InStateCohortDefinitionValidatorTest
25-Oct-2019 22:42:48 Tests run: 3, Failures: 0, Errors: 0, Skipped: 0, Time elapsed: 0.026 sec
25-Oct-2019 22:42:48 Running org.openmrs.module.reporting.common.ReflectionUtilTest
25-Oct-2019 22:42:48 Tests run: 6, Failures: 0, Errors: 0, Skipped: 0, Time elapsed: 0.004 sec
25-Oct-2019 22:42:48 Running org.openmrs.module.reporting.template.HandlebarsHelpersTest
25-Oct-2019 22:42:48 Tests run: 3, Failures: 0, Errors: 0, Skipped: 0, Time elapsed: 0.211 sec
25-Oct-2019 22:42:48 Running org.openmrs.module.reporting.data.visit.evaluator.VisitIdDataEvaluatorTest
25-Oct-2019 22:42:48 Tests run: 2, Failures: 0, Errors: 0, Skipped: 0, Time elapsed: 0.232 sec
25-Oct-2019 22:42:48 Running org.openmrs.module.reporting.cohort.definition.evaluator.ConditionalParameterCohortDefinitionEvaluatorTest
25-Oct-2019 22:42:49 Tests run: 1, Failures: 0, Errors: 0, Skipped: 0, Time elapsed: 0.107 sec
25-Oct-2019 22:42:49 Running org.openmrs.module.reporting.data.patient.evaluator.CurrentPatientStateDataEvaluatorTest
25-Oct-2019 22:42:49 Tests run: 1, Failures: 0, Errors: 0, Skipped: 0, Time elapsed: 0.125 sec
25-Oct-2019 22:42:49 Running org.openmrs.module.reporting.data.encounter.evaluator.ObsOnSameDateEncounterDataEvaluatorTest
25-Oct-2019 22:42:49 Tests run: 3, Failures: 0, Errors: 0, Skipped: 0, Time elapsed: 0.397 sec
25-Oct-2019 22:42:49 Running org.openmrs.module.reporting.cohort.query.service.CohortQueryServiceTest
25-Oct-2019 22:42:49 Tests run: 1, Failures: 0, Errors: 0, Skipped: 0, Time elapsed: 0.142 sec
25-Oct-2019 22:42:49 Running org.openmrs.module.reporting.data.person.evaluator.ObsForPersonDataEvaluatorTest
25-Oct-2019 22:42:50 Tests run: 3, Failures: 0, Errors: 0, Skipped: 0, Time elapsed: 0.522 sec
25-Oct-2019 22:42:50 Running org.openmrs.module.reporting.validator.StaticCohortDefinitionValidatorTest
25-Oct-2019 22:42:50 Tests run: 1, Failures: 0, Errors: 0, Skipped: 0, Time elapsed: 0.017 sec
25-Oct-2019 22:42:50 Running org.openmrs.module.reporting.dataset.definition.evaluator.EncounterDataSetEvaluatorTest
25-Oct-2019 22:42:50 ENCOUNTER ID        EMR ID        BIRTHDATE           ENCOUNTER DATE        Age At Start        Age At End        
25-Oct-2019 22:42:50 ------------        ------        ------------        --------------        ------------        ----------        
25-Oct-2019 22:42:50 3                   7             ~25/Aug/1976        01/Aug/2008           33                  34                
25-Oct-2019 22:42:50 4                   7             ~25/Aug/1976        15/Aug/2008           33                  34                
25-Oct-2019 22:42:50 5                   7             ~25/Aug/1976        19/Aug/2008           33                  34                
25-Oct-2019 22:42:50 6                   20            08/Feb/1925         19/Aug/2009           80                  80                
25-Oct-2019 22:42:50 7                   21            ~08/Jun/1959        19/Aug/2009           50                  51                
25-Oct-2019 22:42:50 8                   21            ~08/Jun/1959        19/Sep/2009           50                  51                
25-Oct-2019 22:42:50 9                   22            08/Jul/1997         19/Sep/2009           12                  13                
25-Oct-2019 22:42:50 10                  22            08/Jul/1997         19/Oct/2009           12                  13                
25-Oct-2019 22:42:50 11                  23            08/Nov/2000         19/Aug/2009           9                   10                
25-Oct-2019 22:42:50 12                  24            08/Dec/2006         19/Sep/2009           3                   4                 
25-Oct-2019 22:42:50 Tests run: 1, Failures: 0, Errors: 0, Skipped: 0, Time elapsed: 0.242 sec
25-Oct-2019 22:42:50 Running org.openmrs.module.reporting.data.person.evaluator.BirthdateDataEvaluatorTest
25-Oct-2019 22:42:50 Tests run: 1, Failures: 0, Errors: 0, Skipped: 0, Time elapsed: 0.123 sec
25-Oct-2019 22:42:50 Running org.openmrs.module.reporting.cohort.definition.evaluator.EncounterCohortDefinitionEvaluatorTest
25-Oct-2019 22:42:51 Tests run: 9, Failures: 0, Errors: 0, Skipped: 2, Time elapsed: 0.835 sec
25-Oct-2019 22:42:51 Running org.openmrs.module.reporting.data.person.evaluator.PreferredAddressDataEvaluatorTest
25-Oct-2019 22:42:51 Tests run: 1, Failures: 0, Errors: 0, Skipped: 0, Time elapsed: 0.143 sec
25-Oct-2019 22:42:51 Running org.openmrs.module.reporting.cohort.definition.evaluator.GenderCohortDefinitionEvaluatorTest
25-Oct-2019 22:42:52 Tests run: 5, Failures: 0, Errors: 0, Skipped: 0, Time elapsed: 0.549 sec
25-Oct-2019 22:42:52 Running org.openmrs.module.reporting.data.converter.BirthdateConverterTest
25-Oct-2019 22:42:52 Tests run: 1, Failures: 0, Errors: 0, Skipped: 0, Time elapsed: 0.01 sec
25-Oct-2019 22:42:52 Running org.openmrs.module.reporting.data.patient.evaluator.ProgramStatesForPatientDataEvaluatorTest
25-Oct-2019 22:42:53 Tests run: 9, Failures: 0, Errors: 0, Skipped: 0, Time elapsed: 1.163 sec
25-Oct-2019 22:42:53 Running org.openmrs.module.reporting.data.visit.library.BuiltInVisitDataLibraryTest
25-Oct-2019 22:42:53 Tests run: 1, Failures: 0, Errors: 0, Skipped: 0, Time elapsed: 0.035 sec
25-Oct-2019 22:42:53 Running org.openmrs.module.reporting.cohort.definition.evaluator.AgeCohortDefinitionEvaluatorTest
25-Oct-2019 22:42:53 Tests run: 5, Failures: 0, Errors: 0, Skipped: 0, Time elapsed: 0.182 sec
25-Oct-2019 22:42:53 Running org.openmrs.module.reporting.data.encounter.evaluator.EncounterLocationDataEvaluatorTest
25-Oct-2019 22:42:53 Tests run: 3, Failures: 0, Errors: 0, Skipped: 0, Time elapsed: 0.351 sec
25-Oct-2019 22:42:53 Running org.openmrs.module.reporting.data.obs.evaluator.PersonToObsEvaluatorTest
25-Oct-2019 22:42:54 Tests run: 3, Failures: 0, Errors: 0, Skipped: 0, Time elapsed: 0.328 sec
25-Oct-2019 22:42:54 Running org.openmrs.module.reporting.common.DateRangeTest
25-Oct-2019 22:42:54 Tests run: 9, Failures: 0, Errors: 0, Skipped: 0, Time elapsed: 0.009 sec
25-Oct-2019 22:42:54 Running org.openmrs.module.reporting.cohort.definition.evaluator.NumericObsCohortDefinitionEvaluatorTest
25-Oct-2019 22:42:55 Tests run: 11, Failures: 0, Errors: 0, Skipped: 0, Time elapsed: 1.498 sec
25-Oct-2019 22:42:55 Running org.openmrs.module.reporting.indicator.QueryCountIndicatorEvaluatorTest
25-Oct-2019 22:42:56 Tests run: 3, Failures: 0, Errors: 0, Skipped: 0, Time elapsed: 0.325 sec
25-Oct-2019 22:42:56 Running org.openmrs.module.reporting.data.encounter.evaluator.ObsForEncounterEvaluatorTest
25-Oct-2019 22:42:57 Tests run: 7, Failures: 0, Errors: 0, Skipped: 0, Time elapsed: 0.936 sec
25-Oct-2019 22:42:57 Running org.openmrs.module.reporting.common.DateUtilTest
25-Oct-2019 22:42:57 Tests run: 15, Failures: 0, Errors: 0, Skipped: 0, Time elapsed: 0.11 sec
25-Oct-2019 22:42:57 Running org.openmrs.module.reporting.data.patient.evaluator.DrugOrdersForPatientDataEvaluatorTest
25-Oct-2019 22:42:58 Tests run: 8, Failures: 0, Errors: 0, Skipped: 0, Time elapsed: 1.37 sec
25-Oct-2019 22:42:58 Running org.openmrs.module.reporting.query.encounter.evaluator.MappedParametersObsQueryEvaluatorTest
25-Oct-2019 22:42:58 Tests run: 1, Failures: 0, Errors: 0, Skipped: 0, Time elapsed: 0.447 sec
25-Oct-2019 22:42:58 Running org.openmrs.module.reporting.serializer.ReportingSerializerTest
25-Oct-2019 22:42:59 Tests run: 6, Failures: 0, Errors: 0, Skipped: 0, Time elapsed: 0.237 sec
25-Oct-2019 22:42:59 Running org.openmrs.module.reporting.dataset.definition.evaluator.CohortCrossTabDataSetEvaluatorTest
25-Oct-2019 22:42:59 Tests run: 1, Failures: 0, Errors: 0, Skipped: 0, Time elapsed: 0.165 sec
25-Oct-2019 22:42:59 Running org.openmrs.module.reporting.query.person.service.PersonQueryServiceImplTest
25-Oct-2019 22:42:59 Tests run: 2, Failures: 0, Errors: 0, Skipped: 0, Time elapsed: 0.437 sec
25-Oct-2019 22:42:59 Running org.openmrs.module.reporting.dataset.definition.evaluator.MySqlDataSetEvaluatorTest
25-Oct-2019 22:42:59 Tests run: 1, Failures: 0, Errors: 0, Skipped: 1, Time elapsed: 0.001 sec
25-Oct-2019 22:42:59 Running org.openmrs.module.reporting.report.renderer.TextTemplateRendererTest
25-Oct-2019 22:43:00 Tests run: 3, Failures: 0, Errors: 0, Skipped: 0, Time elapsed: 0.937 sec
25-Oct-2019 22:43:00 Running org.openmrs.module.reporting.validator.InverseCohortDefinitionValidatorTest
25-Oct-2019 22:43:00 Tests run: 2, Failures: 0, Errors: 0, Skipped: 0, Time elapsed: 0.016 sec
25-Oct-2019 22:43:00 Running org.openmrs.module.reporting.validator.PatientStateCohortDefinitionValidatorTest
25-Oct-2019 22:43:00 Tests run: 3, Failures: 0, Errors: 0, Skipped: 0, Time elapsed: 0.034 sec
25-Oct-2019 22:43:00 Running org.openmrs.module.reporting.report.service.db.PropertiesTypeTest
25-Oct-2019 22:43:00 Tests run: 1, Failures: 0, Errors: 0, Skipped: 0, Time elapsed: 0.001 sec
25-Oct-2019 22:43:00 Running org.openmrs.module.reporting.query.encounter.evaluator.ObsForEncounterQueryEvaluatorTest
25-Oct-2019 22:43:01 Tests run: 8, Failures: 0, Errors: 0, Skipped: 0, Time elapsed: 0.995 sec
25-Oct-2019 22:43:01 Running org.openmrs.module.reporting.data.encounter.service.EncounterDataServiceImplTest
25-Oct-2019 22:43:01 Tests run: 2, Failures: 0, Errors: 0, Skipped: 0, Time elapsed: 0.2 sec
25-Oct-2019 22:43:01 Running org.openmrs.module.reporting.cohort.definition.evaluator.MappedParametersCohortDefinitionEvaluatorTest
25-Oct-2019 22:43:02 Tests run: 1, Failures: 0, Errors: 0, Skipped: 0, Time elapsed: 0.111 sec
25-Oct-2019 22:43:02 Running org.openmrs.module.reporting.data.encounter.evaluator.ConvertedEncounterDataEvaluatorTest
25-Oct-2019 22:43:02 Tests run: 1, Failures: 0, Errors: 0, Skipped: 0, Time elapsed: 0.131 sec
25-Oct-2019 22:43:02 Running org.openmrs.module.reporting.data.patient.evaluator.PatientIdentifierDataEvaluatorTest
25-Oct-2019 22:43:02 Tests run: 4, Failures: 0, Errors: 0, Skipped: 0, Time elapsed: 0.455 sec
25-Oct-2019 22:43:02 Running org.openmrs.module.reporting.data.converter.ListConverterTest
25-Oct-2019 22:43:02 Tests run: 6, Failures: 0, Errors: 0, Skipped: 0, Time elapsed: 0.002 sec
25-Oct-2019 22:43:02 Running org.openmrs.module.reporting.data.converter.ObsFromObsGroupConverterTest
25-Oct-2019 22:43:02 Tests run: 2, Failures: 0, Errors: 0, Skipped: 0, Time elapsed: 0.014 sec
25-Oct-2019 22:43:02 Running org.openmrs.module.reporting.common.AgeTest
25-Oct-2019 22:43:02 Tests run: 5, Failures: 0, Errors: 0, Skipped: 0, Time elapsed: 0.003 sec
25-Oct-2019 22:43:02 Running org.openmrs.module.reporting.evaluation.CachingCohortDefinitionTest
25-Oct-2019 22:43:02 Tests run: 1, Failures: 0, Errors: 0, Skipped: 0, Time elapsed: 0.103 sec
25-Oct-2019 22:43:02 Running org.openmrs.module.reporting.common.TestUtil
25-Oct-2019 22:43:02 Tests run: 1, Failures: 0, Errors: 0, Skipped: 1, Time elapsed: 0.001 sec
25-Oct-2019 22:43:02 Running org.openmrs.module.reporting.query.encounter.evaluator.CompositionEncounterQueryEvaluatorTest
25-Oct-2019 22:43:03 Tests run: 4, Failures: 0, Errors: 0, Skipped: 0, Time elapsed: 0.43 sec
25-Oct-2019 22:43:03 Running org.openmrs.module.reporting.definition.library.implementerconfigured.ImplementerConfiguredVisitDataDefinitionLibraryTest
25-Oct-2019 22:43:03 Tests run: 2, Failures: 0, Errors: 0, Skipped: 0, Time elapsed: 0.02 sec
25-Oct-2019 22:43:03 Running org.openmrs.module.reporting.common.ObjectUtilTest
25-Oct-2019 22:43:03 Tests run: 23, Failures: 0, Errors: 0, Skipped: 0, Time elapsed: 0.615 sec
25-Oct-2019 22:43:03 Running org.openmrs.module.reporting.data.person.evaluator.AgeDataEvaluatorTest
25-Oct-2019 22:43:04 Tests run: 2, Failures: 0, Errors: 0, Skipped: 0, Time elapsed: 0.277 sec
25-Oct-2019 22:43:04 Running org.openmrs.module.reporting.evaluation.querybuilder.HqlQueryBuilderTest
25-Oct-2019 22:43:08 Tests run: 39, Failures: 0, Errors: 0, Skipped: 0, Time elapsed: 4.345 sec
25-Oct-2019 22:43:08 Running org.openmrs.module.reporting.data.visit.evaluator.ObsForVisitDataEvaluatorTest
25-Oct-2019 22:43:08 Tests run: 2, Failures: 0, Errors: 0, Skipped: 0, Time elapsed: 0.326 sec
25-Oct-2019 22:43:08 Running org.openmrs.module.reporting.query.encounter.evaluator.MostRecentEncounterForPatientQueryEvaluatorTest
25-Oct-2019 22:43:08 Tests run: 1, Failures: 0, Errors: 0, Skipped: 0, Time elapsed: 0.128 sec
25-Oct-2019 22:43:08 Running org.openmrs.module.reporting.cohort.definition.evaluator.OptionalParameterCohortDefinitionEvaluatorTest
25-Oct-2019 22:43:09 Tests run: 1, Failures: 0, Errors: 0, Skipped: 0, Time elapsed: 0.107 sec
25-Oct-2019 22:43:09 Running org.openmrs.module.reporting.report.util.SqlUtilsTest
25-Oct-2019 22:43:09 Tests run: 3, Failures: 0, Errors: 0, Skipped: 0, Time elapsed: 0.001 sec
25-Oct-2019 22:43:09 Running org.openmrs.module.reporting.validator.InProgramCohortDefinitionValidatorTest
25-Oct-2019 22:43:09 Tests run: 3, Failures: 0, Errors: 0, Skipped: 0, Time elapsed: 0.036 sec
25-Oct-2019 22:43:09 Running org.openmrs.module.reporting.data.obs.evaluator.PatientToObsDataEvaluatorTest
25-Oct-2019 22:43:09 Tests run: 3, Failures: 0, Errors: 0, Skipped: 0, Time elapsed: 0.376 sec
25-Oct-2019 22:43:09 Running org.openmrs.module.reporting.definition.library.BaseDefinitionLibraryTest
25-Oct-2019 22:43:09 Tests run: 4, Failures: 0, Errors: 0, Skipped: 0, Time elapsed: 0.037 sec
25-Oct-2019 22:43:09 Running org.openmrs.module.reporting.data.person.evaluator.PersonAttributeDataEvaluatorTest
25-Oct-2019 22:43:09 Tests run: 1, Failures: 0, Errors: 0, Skipped: 0, Time elapsed: 0.114 sec
25-Oct-2019 22:43:09 Running org.openmrs.module.reporting.data.person.evaluator.PreferredNameDataEvaluatorTest
25-Oct-2019 22:43:09 Tests run: 3, Failures: 0, Errors: 0, Skipped: 0, Time elapsed: 0.299 sec
25-Oct-2019 22:43:09 Running org.openmrs.module.reporting.definition.library.implementerconfigured.ImplementerConfiguredCohortDefinitionLibraryTest
25-Oct-2019 22:43:10 Tests run: 3, Failures: 0, Errors: 0, Skipped: 0, Time elapsed: 0.137 sec
25-Oct-2019 22:43:10 Running org.openmrs.module.reporting.evaluation.parameter.ParameterUtilTest
25-Oct-2019 22:43:10 Tests run: 2, Failures: 0, Errors: 0, Skipped: 0, Time elapsed: 0.016 sec
25-Oct-2019 22:43:10 Running org.openmrs.module.reporting.data.encounter.library.BuiltInEncounterDataLibraryTest
25-Oct-2019 22:43:10 Tests run: 6, Failures: 0, Errors: 0, Skipped: 0, Time elapsed: 0.179 sec
25-Oct-2019 22:43:10 Running org.openmrs.module.reporting.cohort.definition.evaluator.ScriptedCohortDefinitionEvaluatorTest
25-Oct-2019 22:43:10 Tests run: 1, Failures: 0, Errors: 0, Skipped: 0, Time elapsed: 0.107 sec
25-Oct-2019 22:43:10 Running org.openmrs.module.reporting.data.converter.PersonNameConverterTest
25-Oct-2019 22:43:10 Tests run: 1, Failures: 0, Errors: 0, Skipped: 0, Time elapsed: 0.01 sec
25-Oct-2019 22:43:10 Running org.openmrs.module.reporting.definition.library.AllDefinitionLibrariesComponentTest
25-Oct-2019 22:43:10 Tests run: 2, Failures: 0, Errors: 0, Skipped: 0, Time elapsed: 0.014 sec
25-Oct-2019 22:43:10 Running org.openmrs.module.reporting.data.person.evaluator.VitalStatusDataEvaluatorTest
25-Oct-2019 22:43:10 Tests run: 1, Failures: 0, Errors: 0, Skipped: 0, Time elapsed: 0.119 sec
25-Oct-2019 22:43:10 Running org.openmrs.module.reporting.dataset.definition.evaluator.PatientDataSetEvaluatorTest
25-Oct-2019 22:43:11 Tests run: 8, Failures: 0, Errors: 0, Skipped: 0, Time elapsed: 0.915 sec
25-Oct-2019 22:43:11 Running org.openmrs.module.reporting.cohort.definition.evaluator.TextObsCohortDefinitionEvaluatorTest
25-Oct-2019 22:43:11 Tests run: 2, Failures: 0, Errors: 0, Skipped: 0, Time elapsed: 0.202 sec
25-Oct-2019 22:43:11 Running org.openmrs.module.reporting.data.encounter.evaluator.AuditInfoEncounterDataEvaluatorTest
25-Oct-2019 22:43:11 Tests run: 1, Failures: 0, Errors: 0, Skipped: 0, Time elapsed: 0.037 sec
25-Oct-2019 22:43:11 Running org.openmrs.module.reporting.data.patient.evaluator.LogicDataEvaluatorTest
25-Oct-2019 22:43:11 Tests run: 1, Failures: 0, Errors: 0, Skipped: 1, Time elapsed: 0.001 sec
25-Oct-2019 22:43:11 Running org.openmrs.module.reporting.data.visit.evaluator.PersonToVisitDataEvaluatorTest
25-Oct-2019 22:43:11 Tests run: 3, Failures: 0, Errors: 0, Skipped: 0, Time elapsed: 0.342 sec
25-Oct-2019 22:43:11 Running org.openmrs.module.reporting.cohort.definition.evaluator.DateObsCohortDefinitionEvaluatorTest
25-Oct-2019 22:43:12 Tests run: 3, Failures: 0, Errors: 0, Skipped: 0, Time elapsed: 0.44 sec
25-Oct-2019 22:43:12 Running org.openmrs.module.reporting.cohort.definition.evaluator.VisitCohortDefinitionEvaluatorTest
25-Oct-2019 22:43:12 Tests run: 13, Failures: 0, Errors: 0, Skipped: 0, Time elapsed: 0.213 sec
25-Oct-2019 22:43:12 Running org.openmrs.module.reporting.data.encounter.evaluator.AgeAtEncounterDataEvaluatorTest
25-Oct-2019 22:43:12 Tests run: 1, Failures: 0, Errors: 0, Skipped: 0, Time elapsed: 0.139 sec
25-Oct-2019 22:43:12 Running org.openmrs.module.reporting.indicator.CohortIndicatorDataSetEvaluatorTest
25-Oct-2019 22:43:12 Tests run: 1, Failures: 0, Errors: 0, Skipped: 0, Time elapsed: 0.13 sec
25-Oct-2019 22:43:12 Running org.openmrs.module.reporting.data.person.evaluator.ObsActiveListPersonDataEvaluatorTest
25-Oct-2019 22:43:13 Tests run: 1, Failures: 0, Errors: 0, Skipped: 0, Time elapsed: 0.141 sec
25-Oct-2019 22:43:13 Running org.openmrs.module.reporting.common.ExcelUtilTest
25-Oct-2019 22:43:13 Tests run: 5, Failures: 0, Errors: 0, Skipped: 0, Time elapsed: 0.286 sec
25-Oct-2019 22:43:13 Running org.openmrs.module.reporting.data.obs.evaluator.GroupMemberObsDataEvaluatorTest
25-Oct-2019 22:43:13 Tests run: 5, Failures: 0, Errors: 0, Skipped: 2, Time elapsed: 0.403 sec
25-Oct-2019 22:43:13 Running org.openmrs.module.reporting.query.visit.evaluator.BasicVisitQueryEvaluatorTest
25-Oct-2019 22:43:14 Tests run: 3, Failures: 0, Errors: 0, Skipped: 0, Time elapsed: 0.525 sec
25-Oct-2019 22:43:14 Running org.openmrs.module.reporting.common.ExcelBuilderTest
25-Oct-2019 22:43:18 Tests run: 3, Failures: 0, Errors: 0, Skipped: 0, Time elapsed: 3.807 sec
25-Oct-2019 22:43:18 Running org.openmrs.module.reporting.query.obs.evaluator.AllObsQueryEvaluatorTest
25-Oct-2019 22:43:18 Tests run: 5, Failures: 0, Errors: 0, Skipped: 0, Time elapsed: 0.683 sec
25-Oct-2019 22:43:18 Running org.openmrs.module.reporting.cohort.definition.evaluator.AllPatientsCohortDefinitionEvaluatorTest
25-Oct-2019 22:43:18 Tests run: 1, Failures: 0, Errors: 0, Skipped: 0, Time elapsed: 0.11 sec
25-Oct-2019 22:43:18 Running org.openmrs.module.reporting.data.encounter.evaluator.SimultaneousEncountersDataEvaluatorTest
25-Oct-2019 22:43:18 Tests run: 2, Failures: 0, Errors: 0, Skipped: 0, Time elapsed: 0.077 sec
25-Oct-2019 22:43:18 Running org.openmrs.module.reporting.validator.ProgramEnrollmentCohortDefinitionValidatorTest
25-Oct-2019 22:43:18 Tests run: 3, Failures: 0, Errors: 0, Skipped: 0, Time elapsed: 0.027 sec
25-Oct-2019 22:43:18 Running org.openmrs.module.reporting.evaluation.EvaluationContextTest
25-Oct-2019 22:43:19 Tests run: 4, Failures: 0, Errors: 0, Skipped: 0, Time elapsed: 0.028 sec
25-Oct-2019 22:43:19 Running org.openmrs.module.reporting.data.patient.evaluator.PreferredIdentifierDataEvaluatorTest
25-Oct-2019 22:43:19 Tests run: 2, Failures: 0, Errors: 0, Skipped: 0, Time elapsed: 0.248 sec
25-Oct-2019 22:43:19 Running org.openmrs.module.reporting.data.encounter.evaluator.EncounterVisitDataEvaluatorTest
25-Oct-2019 22:43:19 Tests run: 1, Failures: 0, Errors: 0, Skipped: 0, Time elapsed: 0.164 sec
25-Oct-2019 22:43:19 Running org.openmrs.module.reporting.query.obs.service.ObsQueryServiceImplTest
25-Oct-2019 22:43:19 Tests run: 2, Failures: 0, Errors: 0, Skipped: 1, Time elapsed: 0.128 sec
25-Oct-2019 22:43:19 Running org.openmrs.module.reporting.data.patient.library.BuiltInPatientDataLibraryTest
25-Oct-2019 22:43:19 Tests run: 4, Failures: 0, Errors: 0, Skipped: 0, Time elapsed: 0.06 sec
25-Oct-2019 22:43:19 Running org.openmrs.module.reporting.indicator.util.IndicatorUtilTest
25-Oct-2019 22:43:19 Tests run: 1, Failures: 0, Errors: 0, Skipped: 0, Time elapsed: 0.002 sec
25-Oct-2019 22:43:19 Running org.openmrs.module.reporting.cohort.definition.evaluator.EvaluatableCohortDefinitionEvaluatorTest
25-Oct-2019 22:43:19 Tests run: 1, Failures: 0, Errors: 0, Skipped: 0, Time elapsed: 0.01 sec
25-Oct-2019 22:43:19 Running org.openmrs.module.reporting.data.patient.evaluator.ConvertedPatientDataEvaluatorTest
25-Oct-2019 22:43:19 Tests run: 2, Failures: 0, Errors: 0, Skipped: 0, Time elapsed: 0.218 sec
25-Oct-2019 22:43:19 Running org.openmrs.module.reporting.cohort.definition.evaluator.CompositionCohortDefinitionEvaluatorTest
25-Oct-2019 22:43:20 Tests run: 4, Failures: 0, Errors: 0, Skipped: 0, Time elapsed: 0.462 sec
25-Oct-2019 22:43:20 Running org.openmrs.module.reporting.data.converter.MapConverterTest
25-Oct-2019 22:43:20 Tests run: 5, Failures: 0, Errors: 0, Skipped: 0, Time elapsed: 0.003 sec
25-Oct-2019 22:43:20 Running org.openmrs.module.reporting.data.patient.evaluator.EncountersForPatientDataEvaluatorTest
25-Oct-2019 22:43:20 Tests run: 1, Failures: 0, Errors: 0, Skipped: 0, Time elapsed: 0.149 sec
25-Oct-2019 22:43:20 Running org.openmrs.module.reporting.indicator.SqlIndicatorTest
25-Oct-2019 22:43:20 ERROR - EvaluationProfiler.log(111) |2019-10-25 22:43:20,984| 1336        2019-10-25 22:43:20.984        >        ERROR        EVALUATING_DEFINITION                        SqlIndicator[sql=SELECT distinct(.222) as res, 33 as res2 from patient]: Failed to evaluate sql because:
25-Oct-2019 22:43:20 Unable to evaluate to a single value. Exactly one column must be defined.
25-Oct-2019 22:43:20 org.openmrs.module.reporting.evaluation.EvaluationException: Failed to evaluate sql because:
25-Oct-2019 22:43:20 Unable to evaluate to a single value. Exactly one column must be defined.
25-Oct-2019 22:43:20         at org.openmrs.module.reporting.indicator.evaluator.SqlIndicatorEvaluator.evaluateSql(SqlIndicatorEvaluator.java:57)
25-Oct-2019 22:43:20         at org.openmrs.module.reporting.indicator.evaluator.SqlIndicatorEvaluator.evaluate(SqlIndicatorEvaluator.java:41)
25-Oct-2019 22:43:20         at org.openmrs.module.reporting.indicator.evaluator.SqlIndicatorEvaluator.evaluate(SqlIndicatorEvaluator.java:28)
25-Oct-2019 22:43:20         at org.openmrs.module.reporting.definition.service.BaseDefinitionService.executeEvaluator(BaseDefinitionService.java:369)
25-Oct-2019 22:43:20         at org.openmrs.module.reporting.definition.service.BaseDefinitionService.evaluateBypassingExclusionOfTestPatients(BaseDefinitionService.java:264)
25-Oct-2019 22:43:20         at org.openmrs.module.reporting.definition.service.BaseDefinitionService.evaluate(BaseDefinitionService.java:229)
25-Oct-2019 22:43:20         at org.openmrs.module.reporting.indicator.service.IndicatorServiceImpl.evaluate(IndicatorServiceImpl.java:41)
25-Oct-2019 22:43:20         at sun.reflect.NativeMethodAccessorImpl.invoke0(Native Method)
25-Oct-2019 22:43:20         at sun.reflect.NativeMethodAccessorImpl.invoke(NativeMethodAccessorImpl.java:62)
25-Oct-2019 22:43:20         at sun.reflect.DelegatingMethodAccessorImpl.invoke(DelegatingMethodAccessorImpl.java:43)
25-Oct-2019 22:43:20         at java.lang.reflect.Method.invoke(Method.java:498)
25-Oct-2019 22:43:20         at org.springframework.aop.support.AopUtils.invokeJoinpointUsingReflection(AopUtils.java:317)
25-Oct-2019 22:43:20         at org.springframework.aop.framework.ReflectiveMethodInvocation.invokeJoinpoint(ReflectiveMethodInvocation.java:183)
25-Oct-2019 22:43:20         at org.springframework.aop.framework.ReflectiveMethodInvocation.proceed(ReflectiveMethodInvocation.java:150)
25-Oct-2019 22:43:20         at org.openmrs.aop.LoggingAdvice.invoke(LoggingAdvice.java:121)
25-Oct-2019 22:43:20         at org.springframework.aop.framework.ReflectiveMethodInvocation.proceed(ReflectiveMethodInvocation.java:172)
25-Oct-2019 22:43:20         at org.springframework.aop.framework.adapter.MethodBeforeAdviceInterceptor.invoke(MethodBeforeAdviceInterceptor.java:51)
25-Oct-2019 22:43:20         at org.springframework.aop.framework.ReflectiveMethodInvocation.proceed(ReflectiveMethodInvocation.java:172)
25-Oct-2019 22:43:20         at org.springframework.aop.framework.adapter.MethodBeforeAdviceInterceptor.invoke(MethodBeforeAdviceInterceptor.java:51)
25-Oct-2019 22:43:20         at org.springframework.aop.framework.ReflectiveMethodInvocation.proceed(ReflectiveMethodInvocation.java:172)
25-Oct-2019 22:43:20         at org.springframework.aop.framework.JdkDynamicAopProxy.invoke(JdkDynamicAopProxy.java:204)
25-Oct-2019 22:43:20         at com.sun.proxy.$Proxy39.evaluate(Unknown Source)
25-Oct-2019 22:43:20         at sun.reflect.NativeMethodAccessorImpl.invoke0(Native Method)
25-Oct-2019 22:43:20         at sun.reflect.NativeMethodAccessorImpl.invoke(NativeMethodAccessorImpl.java:62)
25-Oct-2019 22:43:20         at sun.reflect.DelegatingMethodAccessorImpl.invoke(DelegatingMethodAccessorImpl.java:43)
25-Oct-2019 22:43:20         at java.lang.reflect.Method.invoke(Method.java:498)
25-Oct-2019 22:43:20         at org.springframework.aop.support.AopUtils.invokeJoinpointUsingReflection(AopUtils.java:317)
25-Oct-2019 22:43:20         at org.springframework.aop.framework.JdkDynamicAopProxy.invoke(JdkDynamicAopProxy.java:198)
25-Oct-2019 22:43:20         at com.sun.proxy.$Proxy162.evaluate(Unknown Source)
25-Oct-2019 22:43:20         at org.openmrs.module.reporting.indicator.SqlIndicatorTest.assertIndicatorValue(SqlIndicatorTest.java:94)
25-Oct-2019 22:43:20         at org.openmrs.module.reporting.indicator.SqlIndicatorTest.assertIndicatorValue(SqlIndicatorTest.java:103)
25-Oct-2019 22:43:20         at org.openmrs.module.reporting.indicator.SqlIndicatorTest.assertIndicatorValue(SqlIndicatorTest.java:114)
25-Oct-2019 22:43:20         at org.openmrs.module.reporting.indicator.SqlIndicatorTest.assertIndicatorValue(SqlIndicatorTest.java:107)
25-Oct-2019 22:43:20         at org.openmrs.module.reporting.indicator.SqlIndicatorTest.sqlIndicator_shouldNotAllowQueriesThatReturnMoreThanOneColumn(SqlIndicatorTest.java:85)
25-Oct-2019 22:43:20         at sun.reflect.NativeMethodAccessorImpl.invoke0(Native Method)
25-Oct-2019 22:43:20         at sun.reflect.NativeMethodAccessorImpl.invoke(NativeMethodAccessorImpl.java:62)
25-Oct-2019 22:43:20         at sun.reflect.DelegatingMethodAccessorImpl.invoke(DelegatingMethodAccessorImpl.java:43)
25-Oct-2019 22:43:20         at java.lang.reflect.Method.invoke(Method.java:498)
25-Oct-2019 22:43:20         at org.junit.runners.model.FrameworkMethod$1.runReflectiveCall(FrameworkMethod.java:47)
25-Oct-2019 22:43:20         at org.junit.internal.runners.model.ReflectiveCallable.run(ReflectiveCallable.java:12)
25-Oct-2019 22:43:20         at org.junit.runners.model.FrameworkMethod.invokeExplosively(FrameworkMethod.java:44)
25-Oct-2019 22:43:20         at org.junit.internal.runners.statements.InvokeMethod.evaluate(InvokeMethod.java:17)
25-Oct-2019 22:43:20         at org.junit.internal.runners.statements.ExpectException.evaluate(ExpectException.java:19)
25-Oct-2019 22:43:20         at org.junit.internal.runners.statements.RunBefores.evaluate(RunBefores.java:26)
25-Oct-2019 22:43:20         at org.springframework.test.context.junit4.statements.RunBeforeTestMethodCallbacks.evaluate(RunBeforeTestMethodCallbacks.java:74)
25-Oct-2019 22:43:20         at org.junit.internal.runners.statements.RunAfters.evaluate(RunAfters.java:27)
25-Oct-2019 22:43:20         at org.springframework.test.context.junit4.statements.RunAfterTestMethodCallbacks.evaluate(RunAfterTestMethodCallbacks.java:83)
25-Oct-2019 22:43:20         at org.springframework.test.context.junit4.statements.SpringRepeat.evaluate(SpringRepeat.java:72)
25-Oct-2019 22:43:20         at org.springframework.test.context.junit4.SpringJUnit4ClassRunner.runChild(SpringJUnit4ClassRunner.java:231)
25-Oct-2019 22:43:20         at org.springframework.test.context.junit4.SpringJUnit4ClassRunner.runChild(SpringJUnit4ClassRunner.java:88)
25-Oct-2019 22:43:20         at org.junit.runners.ParentRunner$3.run(ParentRunner.java:238)
25-Oct-2019 22:43:20         at org.junit.runners.ParentRunner$1.schedule(ParentRunner.java:63)
25-Oct-2019 22:43:20         at org.junit.runners.ParentRunner.runChildren(ParentRunner.java:236)
25-Oct-2019 22:43:20         at org.junit.runners.ParentRunner.access$000(ParentRunner.java:53)
25-Oct-2019 22:43:20         at org.junit.runners.ParentRunner$2.evaluate(ParentRunner.java:229)
25-Oct-2019 22:43:20         at org.springframework.test.context.junit4.statements.RunBeforeTestClassCallbacks.evaluate(RunBeforeTestClassCallbacks.java:61)
25-Oct-2019 22:43:20         at org.junit.internal.runners.statements.RunAfters.evaluate(RunAfters.java:27)
25-Oct-2019 22:43:20         at org.springframework.test.context.junit4.statements.RunAfterTestClassCallbacks.evaluate(RunAfterTestClassCallbacks.java:71)
25-Oct-2019 22:43:20         at org.junit.runners.ParentRunner.run(ParentRunner.java:309)
25-Oct-2019 22:43:20         at org.springframework.test.context.junit4.SpringJUnit4ClassRunner.run(SpringJUnit4ClassRunner.java:174)
25-Oct-2019 22:43:20         at org.apache.maven.surefire.junit4.JUnit4TestSet.execute(JUnit4TestSet.java:59)
25-Oct-2019 22:43:20         at org.apache.maven.surefire.suite.AbstractDirectoryTestSuite.executeTestSet(AbstractDirectoryTestSuite.java:115)
25-Oct-2019 22:43:20         at org.apache.maven.surefire.suite.AbstractDirectoryTestSuite.execute(AbstractDirectoryTestSuite.java:102)
25-Oct-2019 22:43:20         at org.apache.maven.surefire.Surefire.run(Surefire.java:180)
25-Oct-2019 22:43:20         at sun.reflect.NativeMethodAccessorImpl.invoke0(Native Method)
25-Oct-2019 22:43:20         at sun.reflect.NativeMethodAccessorImpl.invoke(NativeMethodAccessorImpl.java:62)
25-Oct-2019 22:43:20         at sun.reflect.DelegatingMethodAccessorImpl.invoke(DelegatingMethodAccessorImpl.java:43)
25-Oct-2019 22:43:20         at java.lang.reflect.Method.invoke(Method.java:498)
25-Oct-2019 22:43:20         at org.apache.maven.surefire.booter.SurefireBooter.runSuitesInProcess(SurefireBooter.java:350)
25-Oct-2019 22:43:20         at org.apache.maven.surefire.booter.SurefireBooter.main(SurefireBooter.java:1021)
25-Oct-2019 22:43:20 Caused by: java.lang.IllegalArgumentException: Unable to evaluate to a single value. Exactly one column must be defined.
25-Oct-2019 22:43:20         at org.openmrs.module.reporting.evaluation.service.EvaluationServiceImpl.evaluateToObject(EvaluationServiceImpl.java:90)
25-Oct-2019 22:43:20         at sun.reflect.NativeMethodAccessorImpl.invoke0(Native Method)
25-Oct-2019 22:43:20         at sun.reflect.NativeMethodAccessorImpl.invoke(NativeMethodAccessorImpl.java:62)
25-Oct-2019 22:43:20         at sun.reflect.DelegatingMethodAccessorImpl.invoke(DelegatingMethodAccessorImpl.java:43)
25-Oct-2019 22:43:20         at java.lang.reflect.Method.invoke(Method.java:498)
25-Oct-2019 22:43:20         at org.springframework.aop.support.AopUtils.invokeJoinpointUsingReflection(AopUtils.java:317)
25-Oct-2019 22:43:20         at org.springframework.aop.framework.ReflectiveMethodInvocation.invokeJoinpoint(ReflectiveMethodInvocation.java:183)
25-Oct-2019 22:43:21         at org.springframework.aop.framework.ReflectiveMethodInvocation.proceed(ReflectiveMethodInvocation.java:150)
25-Oct-2019 22:43:21         at org.springframework.transaction.interceptor.TransactionInterceptor$1.proceedWithInvocation(TransactionInterceptor.java:96)
25-Oct-2019 22:43:21         at org.springframework.transaction.interceptor.TransactionAspectSupport.invokeWithinTransaction(TransactionAspectSupport.java:260)
25-Oct-2019 22:43:21         at org.springframework.transaction.interceptor.TransactionInterceptor.invoke(TransactionInterceptor.java:94)
25-Oct-2019 22:43:21         at org.springframework.aop.framework.ReflectiveMethodInvocation.proceed(ReflectiveMethodInvocation.java:172)
25-Oct-2019 22:43:21         at org.openmrs.aop.LoggingAdvice.invoke(LoggingAdvice.java:121)
25-Oct-2019 22:43:21         at org.springframework.aop.framework.ReflectiveMethodInvocation.proceed(ReflectiveMethodInvocation.java:172)
25-Oct-2019 22:43:21         at org.springframework.aop.framework.adapter.MethodBeforeAdviceInterceptor.invoke(MethodBeforeAdviceInterceptor.java:51)
25-Oct-2019 22:43:21         at org.springframework.aop.framework.ReflectiveMethodInvocation.proceed(ReflectiveMethodInvocation.java:172)
25-Oct-2019 22:43:21         at org.springframework.aop.framework.adapter.MethodBeforeAdviceInterceptor.invoke(MethodBeforeAdviceInterceptor.java:51)
25-Oct-2019 22:43:21         at org.springframework.aop.framework.ReflectiveMethodInvocation.proceed(ReflectiveMethodInvocation.java:172)
25-Oct-2019 22:43:21         at org.springframework.aop.framework.JdkDynamicAopProxy.invoke(JdkDynamicAopProxy.java:204)
25-Oct-2019 22:43:21         at com.sun.proxy.$Proxy26.evaluateToObject(Unknown Source)
25-Oct-2019 22:43:21         at sun.reflect.NativeMethodAccessorImpl.invoke0(Native Method)
25-Oct-2019 22:43:21         at sun.reflect.NativeMethodAccessorImpl.invoke(NativeMethodAccessorImpl.java:62)
25-Oct-2019 22:43:21         at sun.reflect.DelegatingMethodAccessorImpl.invoke(DelegatingMethodAccessorImpl.java:43)
25-Oct-2019 22:43:21         at java.lang.reflect.Method.invoke(Method.java:498)
25-Oct-2019 22:43:21         at org.springframework.aop.support.AopUtils.invokeJoinpointUsingReflection(AopUtils.java:317)
25-Oct-2019 22:43:21         at org.springframework.aop.framework.ReflectiveMethodInvocation.invokeJoinpoint(ReflectiveMethodInvocation.java:183)
25-Oct-2019 22:43:21         at org.springframework.aop.framework.ReflectiveMethodInvocation.proceed(ReflectiveMethodInvocation.java:150)
25-Oct-2019 22:43:21         at org.springframework.transaction.interceptor.TransactionInterceptor$1.proceedWithInvocation(TransactionInterceptor.java:96)
25-Oct-2019 22:43:21         at org.springframework.transaction.interceptor.TransactionAspectSupport.invokeWithinTransaction(TransactionAspectSupport.java:260)
25-Oct-2019 22:43:21         at org.springframework.transaction.interceptor.TransactionInterceptor.invoke(TransactionInterceptor.java:94)
25-Oct-2019 22:43:21         at org.springframework.aop.framework.ReflectiveMethodInvocation.proceed(ReflectiveMethodInvocation.java:172)
25-Oct-2019 22:43:21         at org.springframework.aop.framework.JdkDynamicAopProxy.invoke(JdkDynamicAopProxy.java:204)
25-Oct-2019 22:43:21         at com.sun.proxy.$Proxy143.evaluateToObject(Unknown Source)
25-Oct-2019 22:43:21         at org.openmrs.module.reporting.indicator.evaluator.SqlIndicatorEvaluator.evaluateSql(SqlIndicatorEvaluator.java:54)
25-Oct-2019 22:43:21         ... 69 more
25-Oct-2019 22:43:21 ERROR - EvaluationProfiler.log(111) |2019-10-25 22:43:21,281| 1344        2019-10-25 22:43:21.281        >        ERROR        EVALUATING_DEFINITION                        SqlIndicator[sql=SELECT person_id from person]: Failed to evaluate sql because:
25-Oct-2019 22:43:21 Unable to evaluate to a single value. Exactly one row must be returned by query.
25-Oct-2019 22:43:21 org.openmrs.module.reporting.evaluation.EvaluationException: Failed to evaluate sql because:
25-Oct-2019 22:43:21 Unable to evaluate to a single value. Exactly one row must be returned by query.
25-Oct-2019 22:43:21         at org.openmrs.module.reporting.indicator.evaluator.SqlIndicatorEvaluator.evaluateSql(SqlIndicatorEvaluator.java:57)
25-Oct-2019 22:43:21         at org.openmrs.module.reporting.indicator.evaluator.SqlIndicatorEvaluator.evaluate(SqlIndicatorEvaluator.java:41)
25-Oct-2019 22:43:21         at org.openmrs.module.reporting.indicator.evaluator.SqlIndicatorEvaluator.evaluate(SqlIndicatorEvaluator.java:28)
25-Oct-2019 22:43:21         at org.openmrs.module.reporting.definition.service.BaseDefinitionService.executeEvaluator(BaseDefinitionService.java:369)
25-Oct-2019 22:43:21         at org.openmrs.module.reporting.definition.service.BaseDefinitionService.evaluateBypassingExclusionOfTestPatients(BaseDefinitionService.java:264)
25-Oct-2019 22:43:21         at org.openmrs.module.reporting.definition.service.BaseDefinitionService.evaluate(BaseDefinitionService.java:229)
25-Oct-2019 22:43:21         at org.openmrs.module.reporting.indicator.service.IndicatorServiceImpl.evaluate(IndicatorServiceImpl.java:41)
25-Oct-2019 22:43:21         at sun.reflect.GeneratedMethodAccessor1073.invoke(Unknown Source)
25-Oct-2019 22:43:21         at sun.reflect.DelegatingMethodAccessorImpl.invoke(DelegatingMethodAccessorImpl.java:43)
25-Oct-2019 22:43:21         at java.lang.reflect.Method.invoke(Method.java:498)
25-Oct-2019 22:43:21         at org.springframework.aop.support.AopUtils.invokeJoinpointUsingReflection(AopUtils.java:317)
25-Oct-2019 22:43:21         at org.springframework.aop.framework.ReflectiveMethodInvocation.invokeJoinpoint(ReflectiveMethodInvocation.java:183)
25-Oct-2019 22:43:21         at org.springframework.aop.framework.ReflectiveMethodInvocation.proceed(ReflectiveMethodInvocation.java:150)
25-Oct-2019 22:43:21         at org.openmrs.aop.LoggingAdvice.invoke(LoggingAdvice.java:121)
25-Oct-2019 22:43:21         at org.springframework.aop.framework.ReflectiveMethodInvocation.proceed(ReflectiveMethodInvocation.java:172)
25-Oct-2019 22:43:21         at org.springframework.aop.framework.adapter.MethodBeforeAdviceInterceptor.invoke(MethodBeforeAdviceInterceptor.java:51)
25-Oct-2019 22:43:21         at org.springframework.aop.framework.ReflectiveMethodInvocation.proceed(ReflectiveMethodInvocation.java:172)
25-Oct-2019 22:43:21         at org.springframework.aop.framework.adapter.MethodBeforeAdviceInterceptor.invoke(MethodBeforeAdviceInterceptor.java:51)
25-Oct-2019 22:43:21         at org.springframework.aop.framework.ReflectiveMethodInvocation.proceed(ReflectiveMethodInvocation.java:172)
25-Oct-2019 22:43:21         at org.springframework.aop.framework.JdkDynamicAopProxy.invoke(JdkDynamicAopProxy.java:204)
25-Oct-2019 22:43:21         at com.sun.proxy.$Proxy39.evaluate(Unknown Source)
25-Oct-2019 22:43:21         at sun.reflect.GeneratedMethodAccessor1073.invoke(Unknown Source)
25-Oct-2019 22:43:21         at sun.reflect.DelegatingMethodAccessorImpl.invoke(DelegatingMethodAccessorImpl.java:43)
25-Oct-2019 22:43:21         at java.lang.reflect.Method.invoke(Method.java:498)
25-Oct-2019 22:43:21         at org.springframework.aop.support.AopUtils.invokeJoinpointUsingReflection(AopUtils.java:317)
25-Oct-2019 22:43:21         at org.springframework.aop.framework.JdkDynamicAopProxy.invoke(JdkDynamicAopProxy.java:198)
25-Oct-2019 22:43:21         at com.sun.proxy.$Proxy162.evaluate(Unknown Source)
25-Oct-2019 22:43:21         at org.openmrs.module.reporting.indicator.SqlIndicatorTest.assertIndicatorValue(SqlIndicatorTest.java:94)
25-Oct-2019 22:43:21         at org.openmrs.module.reporting.indicator.SqlIndicatorTest.assertIndicatorValue(SqlIndicatorTest.java:103)
25-Oct-2019 22:43:21         at org.openmrs.module.reporting.indicator.SqlIndicatorTest.assertIndicatorValue(SqlIndicatorTest.java:114)
25-Oct-2019 22:43:21         at org.openmrs.module.reporting.indicator.SqlIndicatorTest.assertIndicatorValue(SqlIndicatorTest.java:107)
25-Oct-2019 22:43:21         at org.openmrs.module.reporting.indicator.SqlIndicatorTest.sqlIndicator_shouldNotAllowQueriesThatReturnMoreThanOneRow(SqlIndicatorTest.java:90)
25-Oct-2019 22:43:21         at sun.reflect.NativeMethodAccessorImpl.invoke0(Native Method)
25-Oct-2019 22:43:21         at sun.reflect.NativeMethodAccessorImpl.invoke(NativeMethodAccessorImpl.java:62)
25-Oct-2019 22:43:21         at sun.reflect.DelegatingMethodAccessorImpl.invoke(DelegatingMethodAccessorImpl.java:43)
25-Oct-2019 22:43:21         at java.lang.reflect.Method.invoke(Method.java:498)
25-Oct-2019 22:43:21         at org.junit.runners.model.FrameworkMethod$1.runReflectiveCall(FrameworkMethod.java:47)
25-Oct-2019 22:43:21         at org.junit.internal.runners.model.ReflectiveCallable.run(ReflectiveCallable.java:12)
25-Oct-2019 22:43:21         at org.junit.runners.model.FrameworkMethod.invokeExplosively(FrameworkMethod.java:44)
25-Oct-2019 22:43:21         at org.junit.internal.runners.statements.InvokeMethod.evaluate(InvokeMethod.java:17)
25-Oct-2019 22:43:21         at org.junit.internal.runners.statements.ExpectException.evaluate(ExpectException.java:19)
25-Oct-2019 22:43:21         at org.junit.internal.runners.statements.RunBefores.evaluate(RunBefores.java:26)
25-Oct-2019 22:43:21         at org.springframework.test.context.junit4.statements.RunBeforeTestMethodCallbacks.evaluate(RunBeforeTestMethodCallbacks.java:74)
25-Oct-2019 22:43:21         at org.junit.internal.runners.statements.RunAfters.evaluate(RunAfters.java:27)
25-Oct-2019 22:43:21         at org.springframework.test.context.junit4.statements.RunAfterTestMethodCallbacks.evaluate(RunAfterTestMethodCallbacks.java:83)
25-Oct-2019 22:43:21         at org.springframework.test.context.junit4.statements.SpringRepeat.evaluate(SpringRepeat.java:72)
25-Oct-2019 22:43:21         at org.springframework.test.context.junit4.SpringJUnit4ClassRunner.runChild(SpringJUnit4ClassRunner.java:231)
25-Oct-2019 22:43:21         at org.springframework.test.context.junit4.SpringJUnit4ClassRunner.runChild(SpringJUnit4ClassRunner.java:88)
25-Oct-2019 22:43:21         at org.junit.runners.ParentRunner$3.run(ParentRunner.java:238)
25-Oct-2019 22:43:21         at org.junit.runners.ParentRunner$1.schedule(ParentRunner.java:63)
25-Oct-2019 22:43:21         at org.junit.runners.ParentRunner.runChildren(ParentRunner.java:236)
25-Oct-2019 22:43:21         at org.junit.runners.ParentRunner.access$000(ParentRunner.java:53)
25-Oct-2019 22:43:21         at org.junit.runners.ParentRunner$2.evaluate(ParentRunner.java:229)
25-Oct-2019 22:43:21         at org.springframework.test.context.junit4.statements.RunBeforeTestClassCallbacks.evaluate(RunBeforeTestClassCallbacks.java:61)
25-Oct-2019 22:43:21         at org.junit.internal.runners.statements.RunAfters.evaluate(RunAfters.java:27)
25-Oct-2019 22:43:21         at org.springframework.test.context.junit4.statements.RunAfterTestClassCallbacks.evaluate(RunAfterTestClassCallbacks.java:71)
25-Oct-2019 22:43:21         at org.junit.runners.ParentRunner.run(ParentRunner.java:309)
25-Oct-2019 22:43:21         at org.springframework.test.context.junit4.SpringJUnit4ClassRunner.run(SpringJUnit4ClassRunner.java:174)
25-Oct-2019 22:43:21         at org.apache.maven.surefire.junit4.JUnit4TestSet.execute(JUnit4TestSet.java:59)
25-Oct-2019 22:43:21         at org.apache.maven.surefire.suite.AbstractDirectoryTestSuite.executeTestSet(AbstractDirectoryTestSuite.java:115)
25-Oct-2019 22:43:21         at org.apache.maven.surefire.suite.AbstractDirectoryTestSuite.execute(AbstractDirectoryTestSuite.java:102)
25-Oct-2019 22:43:21         at org.apache.maven.surefire.Surefire.run(Surefire.java:180)
25-Oct-2019 22:43:21         at sun.reflect.NativeMethodAccessorImpl.invoke0(Native Method)
25-Oct-2019 22:43:21         at sun.reflect.NativeMethodAccessorImpl.invoke(NativeMethodAccessorImpl.java:62)
25-Oct-2019 22:43:21         at sun.reflect.DelegatingMethodAccessorImpl.invoke(DelegatingMethodAccessorImpl.java:43)
25-Oct-2019 22:43:21         at java.lang.reflect.Method.invoke(Method.java:498)
25-Oct-2019 22:43:21         at org.apache.maven.surefire.booter.SurefireBooter.runSuitesInProcess(SurefireBooter.java:350)
25-Oct-2019 22:43:21         at org.apache.maven.surefire.booter.SurefireBooter.main(SurefireBooter.java:1021)
25-Oct-2019 22:43:21 Caused by: java.lang.IllegalArgumentException: Unable to evaluate to a single value. Exactly one row must be returned by query.
25-Oct-2019 22:43:21         at org.openmrs.module.reporting.evaluation.service.EvaluationServiceImpl.evaluateToObject(EvaluationServiceImpl.java:86)
25-Oct-2019 22:43:21         at sun.reflect.GeneratedMethodAccessor1076.invoke(Unknown Source)
25-Oct-2019 22:43:21         at sun.reflect.DelegatingMethodAccessorImpl.invoke(DelegatingMethodAccessorImpl.java:43)
25-Oct-2019 22:43:21         at java.lang.reflect.Method.invoke(Method.java:498)
25-Oct-2019 22:43:21         at org.springframework.aop.support.AopUtils.invokeJoinpointUsingReflection(AopUtils.java:317)
25-Oct-2019 22:43:21         at org.springframework.aop.framework.ReflectiveMethodInvocation.invokeJoinpoint(ReflectiveMethodInvocation.java:183)
25-Oct-2019 22:43:21         at org.springframework.aop.framework.ReflectiveMethodInvocation.proceed(ReflectiveMethodInvocation.java:150)
25-Oct-2019 22:43:21         at org.springframework.transaction.interceptor.TransactionInterceptor$1.proceedWithInvocation(TransactionInterceptor.java:96)
25-Oct-2019 22:43:21         at org.springframework.transaction.interceptor.TransactionAspectSupport.invokeWithinTransaction(TransactionAspectSupport.java:260)
25-Oct-2019 22:43:21         at org.springframework.transaction.interceptor.TransactionInterceptor.invoke(TransactionInterceptor.java:94)
25-Oct-2019 22:43:21         at org.springframework.aop.framework.ReflectiveMethodInvocation.proceed(ReflectiveMethodInvocation.java:172)
25-Oct-2019 22:43:21         at org.openmrs.aop.LoggingAdvice.invoke(LoggingAdvice.java:121)
25-Oct-2019 22:43:21         at org.springframework.aop.framework.ReflectiveMethodInvocation.proceed(ReflectiveMethodInvocation.java:172)
25-Oct-2019 22:43:21         at org.springframework.aop.framework.adapter.MethodBeforeAdviceInterceptor.invoke(MethodBeforeAdviceInterceptor.java:51)
25-Oct-2019 22:43:21         at org.springframework.aop.framework.ReflectiveMethodInvocation.proceed(ReflectiveMethodInvocation.java:172)
25-Oct-2019 22:43:21         at org.springframework.aop.framework.adapter.MethodBeforeAdviceInterceptor.invoke(MethodBeforeAdviceInterceptor.java:51)
25-Oct-2019 22:43:21         at org.springframework.aop.framework.ReflectiveMethodInvocation.proceed(ReflectiveMethodInvocation.java:172)
25-Oct-2019 22:43:21         at org.springframework.aop.framework.JdkDynamicAopProxy.invoke(JdkDynamicAopProxy.java:204)
25-Oct-2019 22:43:21         at com.sun.proxy.$Proxy26.evaluateToObject(Unknown Source)
25-Oct-2019 22:43:21         at sun.reflect.GeneratedMethodAccessor1076.invoke(Unknown Source)
25-Oct-2019 22:43:21         at sun.reflect.DelegatingMethodAccessorImpl.invoke(DelegatingMethodAccessorImpl.java:43)
25-Oct-2019 22:43:21         at java.lang.reflect.Method.invoke(Method.java:498)
25-Oct-2019 22:43:21         at org.springframework.aop.support.AopUtils.invokeJoinpointUsingReflection(AopUtils.java:317)
25-Oct-2019 22:43:21         at org.springframework.aop.framework.ReflectiveMethodInvocation.invokeJoinpoint(ReflectiveMethodInvocation.java:183)
25-Oct-2019 22:43:21         at org.springframework.aop.framework.ReflectiveMethodInvocation.proceed(ReflectiveMethodInvocation.java:150)
25-Oct-2019 22:43:21         at org.springframework.transaction.interceptor.TransactionInterceptor$1.proceedWithInvocation(TransactionInterceptor.java:96)
25-Oct-2019 22:43:21         at org.springframework.transaction.interceptor.TransactionAspectSupport.invokeWithinTransaction(TransactionAspectSupport.java:260)
25-Oct-2019 22:43:21         at org.springframework.transaction.interceptor.TransactionInterceptor.invoke(TransactionInterceptor.java:94)
25-Oct-2019 22:43:21         at org.springframework.aop.framework.ReflectiveMethodInvocation.proceed(ReflectiveMethodInvocation.java:172)
25-Oct-2019 22:43:21         at org.springframework.aop.framework.JdkDynamicAopProxy.invoke(JdkDynamicAopProxy.java:204)
25-Oct-2019 22:43:21         at com.sun.proxy.$Proxy143.evaluateToObject(Unknown Source)
25-Oct-2019 22:43:21         at org.openmrs.module.reporting.indicator.evaluator.SqlIndicatorEvaluator.evaluateSql(SqlIndicatorEvaluator.java:54)
25-Oct-2019 22:43:21         ... 67 more
25-Oct-2019 22:43:21 Tests run: 8, Failures: 0, Errors: 0, Skipped: 0, Time elapsed: 0.925 sec
25-Oct-2019 22:43:21 Running org.openmrs.module.reporting.report.renderer.ExcelTemplateRendererTest
25-Oct-2019 22:43:21 Tests run: 2, Failures: 0, Errors: 0, Skipped: 0, Time elapsed: 0.294 sec
25-Oct-2019 22:43:21 Running org.openmrs.module.reporting.cohort.CohortsTest
25-Oct-2019 22:43:21 Tests run: 3, Failures: 0, Errors: 0, Skipped: 0, Time elapsed: 0.02 sec
25-Oct-2019 22:43:21 Running org.openmrs.module.reporting.data.converter.StringConverterTest
25-Oct-2019 22:43:21 Tests run: 1, Failures: 0, Errors: 0, Skipped: 0, Time elapsed: 0.001 sec
25-Oct-2019 22:43:21 Running org.openmrs.module.reporting.dataset.definition.evaluator.RepeatPerTimePeriodDataSetEvaluatorTest
25-Oct-2019 22:43:21 Tests run: 4, Failures: 0, Errors: 0, Skipped: 0, Time elapsed: 0.07 sec
25-Oct-2019 22:43:21 Running org.openmrs.module.reporting.data.JoinDataDefinitionTest
25-Oct-2019 22:43:21 Tests run: 2, Failures: 0, Errors: 0, Skipped: 0, Time elapsed: 0.001 sec
25-Oct-2019 22:43:21 Running org.openmrs.module.reporting.query.obs.evaluator.BasicObsQueryEvaluatorTest
25-Oct-2019 22:43:21 Tests run: 1, Failures: 0, Errors: 0, Skipped: 0, Time elapsed: 0.145 sec
25-Oct-2019 22:43:21 Running org.openmrs.module.reporting.query.person.evaluator.PatientPersonQueryEvaluatorTest
25-Oct-2019 22:43:22 Tests run: 1, Failures: 0, Errors: 0, Skipped: 0, Time elapsed: 0.191 sec
25-Oct-2019 22:43:22 Running org.openmrs.module.reporting.data.patient.evaluator.ScriptedCompositionPatientDataEvaluatorTest
25-Oct-2019 22:43:22 Tests run: 2, Failures: 0, Errors: 0, Skipped: 0, Time elapsed: 0.383 sec
25-Oct-2019 22:43:22 Running org.openmrs.module.reporting.definition.library.implementerconfigured.ImplementerConfiguredEncounterDataDefinitionLibraryTest
25-Oct-2019 22:43:22 Tests run: 2, Failures: 0, Errors: 0, Skipped: 0, Time elapsed: 0.022 sec
25-Oct-2019 22:43:22 Running org.openmrs.module.reporting.data.encounter.evaluator.PersonToEncounterDataEvaluatorTest
25-Oct-2019 22:43:22 Tests run: 3, Failures: 0, Errors: 0, Skipped: 0, Time elapsed: 0.343 sec
25-Oct-2019 22:43:22 Running org.openmrs.module.reporting.data.visit.evaluator.PatientToVisitDataEvaluatorTest
25-Oct-2019 22:43:23 {1=102, 4=12345K}
25-Oct-2019 22:43:23 Tests run: 3, Failures: 0, Errors: 0, Skipped: 0, Time elapsed: 0.37 sec
25-Oct-2019 22:43:23 Running org.openmrs.module.reporting.validator.CompositionCohortDefinitionValidatorTest
25-Oct-2019 22:43:23 Tests run: 5, Failures: 0, Errors: 0, Skipped: 0, Time elapsed: 0.032 sec
25-Oct-2019 22:43:23 Running org.openmrs.module.reporting.cohort.definition.evaluator.InProgramCohortDefinitionEvaluatorTest
25-Oct-2019 22:43:23 Tests run: 5, Failures: 0, Errors: 0, Skipped: 0, Time elapsed: 0.648 sec
25-Oct-2019 22:43:23 Running org.openmrs.module.reporting.calculation.PatientDataCalculationBehaviorTest
25-Oct-2019 22:43:24 Tests run: 3, Failures: 0, Errors: 0, Skipped: 0, Time elapsed: 0.336 sec
25-Oct-2019 22:43:24 Running org.openmrs.module.reporting.dataset.definition.evaluator.CohortIndicatorDataSetEvaluatorTest
25-Oct-2019 22:43:24 Tests run: 1, Failures: 0, Errors: 0, Skipped: 0, Time elapsed: 0.118 sec
25-Oct-2019 22:43:24 Running org.openmrs.module.reporting.query.encounter.evaluator.AuditEncounterQueryEvaluatorTest
25-Oct-2019 22:43:25 Tests run: 5, Failures: 0, Errors: 0, Skipped: 0, Time elapsed: 0.721 sec
25-Oct-2019 22:43:25 Running org.openmrs.module.reporting.definition.service.DefinitionServiceTest
25-Oct-2019 22:43:25 Tests run: 1, Failures: 0, Errors: 0, Skipped: 0, Time elapsed: 0.055 sec
25-Oct-2019 22:43:25 Running org.openmrs.module.reporting.indicator.aggregation.AggregationTest
25-Oct-2019 22:43:25 Tests run: 12, Failures: 0, Errors: 0, Skipped: 0, Time elapsed: 0.004 sec
25-Oct-2019 22:43:25 Running org.openmrs.module.reporting.data.person.evaluator.ConvertedPersonDataEvaluatorTest
25-Oct-2019 22:43:25 Tests run: 1, Failures: 0, Errors: 0, Skipped: 0, Time elapsed: 0.151 sec
25-Oct-2019 22:43:25 Running org.openmrs.module.reporting.query.encounter.evaluator.SqlEncounterQueryEvaluatorTest
25-Oct-2019 22:43:25 Tests run: 3, Failures: 0, Errors: 0, Skipped: 0, Time elapsed: 0.44 sec
25-Oct-2019 22:43:25 Running org.openmrs.module.reporting.report.renderer.CsvReportRendererTest
25-Oct-2019 22:43:25 Tests run: 1, Failures: 0, Errors: 0, Skipped: 0, Time elapsed: 0.009 sec
25-Oct-2019 22:43:25 Running org.openmrs.module.reporting.dataset.definition.evaluator.LogicDataSetEvaluatorTest
25-Oct-2019 22:43:25 Tests run: 1, Failures: 0, Errors: 0, Skipped: 1, Time elapsed: 0.001 sec
25-Oct-2019 22:43:25 Running org.openmrs.module.reporting.dataset.definition.evaluator.VisitDataSetEvaluatorTest
25-Oct-2019 22:43:25 VISIT ID        EMR ID        BIRTHDATE          
25-Oct-2019 22:43:25 --------        ------        -----------        
25-Oct-2019 22:43:25 1               2             08/Apr/1975        
25-Oct-2019 22:43:25 2               2             08/Apr/1975        
25-Oct-2019 22:43:25 3               2             08/Apr/1975        
25-Oct-2019 22:43:25 4               6             27/May/2007        
25-Oct-2019 22:43:25 5               6             27/May/2007        
25-Oct-2019 22:43:25 Tests run: 1, Failures: 0, Errors: 0, Skipped: 0, Time elapsed: 0.137 sec
25-Oct-2019 22:43:25 Running org.openmrs.module.reporting.data.person.evaluator.PersonIdDataEvaluatorTest
25-Oct-2019 22:43:26 Tests run: 1, Failures: 0, Errors: 0, Skipped: 0, Time elapsed: 0.164 sec
25-Oct-2019 22:43:26 Running org.openmrs.module.reporting.cohort.definition.evaluator.BirthAndDeathCohortDefinitionEvaluatorTest
25-Oct-2019 22:43:27 Tests run: 8, Failures: 0, Errors: 0, Skipped: 0, Time elapsed: 1 sec
25-Oct-2019 22:43:27 Running org.openmrs.module.reporting.data.encounter.evaluator.SqlEncounterDataEvaluatorTest
25-Oct-2019 22:43:27 Tests run: 1, Failures: 0, Errors: 0, Skipped: 0, Time elapsed: 0.09 sec
25-Oct-2019 22:43:27 Running org.openmrs.module.reporting.data.converter.PersonAddressConverterTest
25-Oct-2019 22:43:27 Tests run: 1, Failures: 0, Errors: 0, Skipped: 0, Time elapsed: 0.017 sec
25-Oct-2019 22:43:27 Running org.openmrs.module.reporting.data.converter.AttributeValueConverterTest
25-Oct-2019 22:43:27 Tests run: 2, Failures: 0, Errors: 0, Skipped: 0, Time elapsed: 0.221 sec
25-Oct-2019 22:43:27 Running org.openmrs.module.reporting.common.DelimitedKeyComparatorTest
25-Oct-2019 22:43:27 Tests run: 1, Failures: 0, Errors: 0, Skipped: 0, Time elapsed: 0.001 sec
25-Oct-2019 22:43:27 Running org.openmrs.module.reporting.data.obs.evaluator.ConvertedObsDataEvaluatorTest
25-Oct-2019 22:43:27 Tests run: 1, Failures: 0, Errors: 0, Skipped: 0, Time elapsed: 0.095 sec
25-Oct-2019 22:43:27 Running org.openmrs.module.reporting.query.person.evaluator.SqlPersonQueryEvaluatorTest
25-Oct-2019 22:43:27 Tests run: 2, Failures: 0, Errors: 0, Skipped: 0, Time elapsed: 0.187 sec
25-Oct-2019 22:43:27 Running org.openmrs.module.reporting.query.person.evaluator.AllPersonQueryEvaluatorTest
25-Oct-2019 22:43:28 Tests run: 6, Failures: 0, Errors: 0, Skipped: 0, Time elapsed: 0.575 sec
25-Oct-2019 22:43:28 Running org.openmrs.module.reporting.dataset.definition.evaluator.SqlFileDataSetEvaluatorTest
25-Oct-2019 22:43:28 Tests run: 2, Failures: 0, Errors: 0, Skipped: 0, Time elapsed: 0.328 sec
25-Oct-2019 22:43:28 Running org.openmrs.module.reporting.data.person.evaluator.AgeAtDateOfOtherDataEvaluatorTest
25-Oct-2019 22:43:29 Tests run: 1, Failures: 0, Errors: 0, Skipped: 0, Time elapsed: 0.47 sec
25-Oct-2019 22:43:29 Running org.openmrs.module.reporting.indicator.PeriodIndicatorReportTest
25-Oct-2019 22:43:29 Tests run: 2, Failures: 0, Errors: 0, Skipped: 0, Time elapsed: 0.437 sec
25-Oct-2019 22:43:29 Running org.openmrs.module.reporting.report.renderer.DelimitedTextReportRendererTest
25-Oct-2019 22:43:29 Tests run: 11, Failures: 0, Errors: 0, Skipped: 0, Time elapsed: 0.253 sec
25-Oct-2019 22:43:29 Running org.openmrs.module.reporting.data.patient.evaluator.PatientObjectDataEvaluatorTest
25-Oct-2019 22:43:29 Tests run: 1, Failures: 0, Errors: 0, Skipped: 0, Time elapsed: 0.128 sec
25-Oct-2019 22:43:29 Running org.openmrs.module.reporting.data.patient.evaluator.TestPatientCalculation
25-Oct-2019 22:43:29 Tests run: 1, Failures: 0, Errors: 0, Skipped: 1, Time elapsed: 0.001 sec
25-Oct-2019 22:43:29 Running org.openmrs.module.reporting.validator.SqlCohortDefinitionValidatorTest
25-Oct-2019 22:43:29 Tests run: 3, Failures: 0, Errors: 0, Skipped: 0, Time elapsed: 0.02 sec
25-Oct-2019 22:43:29 Running org.openmrs.module.reporting.cohort.definition.evaluator.PatientStateCohortDefinitionEvaluatorTest
25-Oct-2019 22:43:30 Tests run: 7, Failures: 0, Errors: 0, Skipped: 0, Time elapsed: 0.945 sec
25-Oct-2019 22:43:30 Running org.openmrs.module.reporting.data.converter.NullValueConverterTest
25-Oct-2019 22:43:30 Tests run: 1, Failures: 0, Errors: 0, Skipped: 0, Time elapsed: 0.001 sec
25-Oct-2019 22:43:30 Running org.openmrs.module.reporting.query.encounter.evaluator.ConditionalParameterEncounterQueryEvaluatorTest
25-Oct-2019 22:43:30 Tests run: 1, Failures: 0, Errors: 0, Skipped: 0, Time elapsed: 0.113 sec
25-Oct-2019 22:43:30 Running org.openmrs.module.reporting.report.service.TestReportProcessor
25-Oct-2019 22:43:30 Tests run: 1, Failures: 0, Errors: 0, Skipped: 1, Time elapsed: 0.001 sec
25-Oct-2019 22:43:30 Running org.openmrs.module.reporting.common.FractionTest
25-Oct-2019 22:43:30 Tests run: 7, Failures: 0, Errors: 0, Skipped: 0, Time elapsed: 0.003 sec
25-Oct-2019 22:43:30 Running org.openmrs.module.reporting.report.renderer.ReportDesignRendererTest
25-Oct-2019 22:43:30 Tests run: 2, Failures: 0, Errors: 0, Skipped: 0, Time elapsed: 0.02 sec
25-Oct-2019 22:43:30 Running org.openmrs.module.reporting.data.patient.evaluator.ProgramEnrollmentsForPatientDataEvaluatorTest
25-Oct-2019 22:43:31 Tests run: 8, Failures: 0, Errors: 0, Skipped: 0, Time elapsed: 0.746 sec
25-Oct-2019 22:43:31 Running org.openmrs.module.reporting.data.visit.evaluator.OrderForVisitDataEvaluatorTest
25-Oct-2019 22:43:31 Tests run: 2, Failures: 0, Errors: 0, Skipped: 0, Time elapsed: 0.034 sec
25-Oct-2019 22:43:31 Running org.openmrs.module.reporting.report.util.SqlScriptParserTest
25-Oct-2019 22:43:31 Tests run: 4, Failures: 0, Errors: 0, Skipped: 0, Time elapsed: 0.003 sec
25-Oct-2019 22:43:31 Running org.openmrs.module.reporting.definition.library.implementerconfigured.ImplementerConfiguredDataSetDefinitionLibraryTest
25-Oct-2019 22:43:31 Tests run: 3, Failures: 0, Errors: 0, Skipped: 0, Time elapsed: 0.141 sec
25-Oct-2019 22:43:31 Running org.openmrs.module.reporting.cohort.definition.evaluator.PresenceOrAbsenceCohortDefinitionEvaluatorTest
25-Oct-2019 22:43:32 Tests run: 3, Failures: 0, Errors: 0, Skipped: 0, Time elapsed: 0.277 sec
25-Oct-2019 22:43:32 Running org.openmrs.module.reporting.report.definition.service.ReportDefinitionServiceImplTest
25-Oct-2019 22:43:32 Tests run: 2, Failures: 0, Errors: 0, Skipped: 0, Time elapsed: 0.069 sec
25-Oct-2019 22:43:32 Running org.openmrs.module.reporting.data.converter.ObsValueTextAsCodedConverterTest
25-Oct-2019 22:43:32 Tests run: 3, Failures: 0, Errors: 0, Skipped: 0, Time elapsed: 0.016 sec
25-Oct-2019 22:43:32 Running org.openmrs.module.reporting.cohort.definition.service.BaseCohortDefinitionServiceTest
25-Oct-2019 22:43:32 Tests run: 1, Failures: 0, Errors: 0, Skipped: 0, Time elapsed: 0.085 sec
25-Oct-2019 22:43:32 Running org.openmrs.module.reporting.cohort.definition.evaluator.InStateCohortDefinitionEvaluatorTest
25-Oct-2019 22:43:32 Cohort: Cohort id=null size=2
25-Oct-2019 22:43:33 Tests run: 7, Failures: 0, Errors: 0, Skipped: 0, Time elapsed: 0.922 sec
25-Oct-2019 22:43:33 Running org.openmrs.module.reporting.data.patient.evaluator.DefinitionLibraryPatientDataEvaluatorTest
25-Oct-2019 22:43:33 Tests run: 3, Failures: 0, Errors: 0, Skipped: 0, Time elapsed: 0.316 sec
25-Oct-2019 22:43:33 Running org.openmrs.module.reporting.cohort.definition.evaluator.DefinitionLibraryCohortDefinitionEvaluatorTest
25-Oct-2019 22:43:33 Tests run: 3, Failures: 0, Errors: 0, Skipped: 0, Time elapsed: 0.274 sec
25-Oct-2019 22:43:33 Running org.openmrs.module.reporting.dataset.definition.evaluator.CohortsWithVaryingParametersDataSetEvaluatorTest
25-Oct-2019 22:43:33 Tests run: 1, Failures: 0, Errors: 0, Skipped: 0, Time elapsed: 0.128 sec
25-Oct-2019 22:43:33 Running org.openmrs.module.reporting.dataset.definition.evaluator.ObsDataSetEvaluatorTest
25-Oct-2019 22:43:34 Tests run: 1, Failures: 0, Errors: 0, Skipped: 0, Time elapsed: 0.124 sec
25-Oct-2019 22:43:34 Running org.openmrs.module.reporting.data.patient.evaluator.SqlPatientDataEvaluatorTest
25-Oct-2019 22:43:34 Tests run: 1, Failures: 0, Errors: 0, Skipped: 0, Time elapsed: 0.12 sec
25-Oct-2019 22:43:34 Running org.openmrs.module.reporting.data.converter.PrivilegedDataConverterTest
25-Oct-2019 22:43:34 SLF4J: Class path contains multiple SLF4J bindings.
25-Oct-2019 22:43:34 SLF4J: Found binding in [jar:file:/home/bamboo-agent/.m2/repository/org/slf4j/slf4j-log4j12/1.6.0/slf4j-log4j12-1.6.0.jar!/org/slf4j/impl/StaticLoggerBinder.class]
25-Oct-2019 22:43:34 SLF4J: Found binding in [jar:file:/home/bamboo-agent/.m2/repository/org/slf4j/slf4j-log4j12/1.6.0/slf4j-log4j12-1.6.0.jar!/org/slf4j/impl/StaticLoggerBinder.class]
25-Oct-2019 22:43:34 SLF4J: See http://www.slf4j.org/codes.html#multiple_bindings for an explanation.
25-Oct-2019 22:43:35 Tests run: 2, Failures: 0, Errors: 0, Skipped: 0, Time elapsed: 1.034 sec
25-Oct-2019 22:43:35 Running org.openmrs.module.reporting.data.patient.evaluator.PatientCalculationDataEvaluatorTest
25-Oct-2019 22:43:35 ERROR - EvaluationProfiler.log(111) |2019-10-25 22:43:35,376| 1768        2019-10-25 22:43:35.376        >        ERROR        EVALUATING_DEFINITION                        PatientCalculationDataDefinition[Example]: Failed to evaluate No PatientCalculation found on this PatientCalculationDataDefinition
25-Oct-2019 22:43:35 org.openmrs.module.reporting.evaluation.EvaluationException: Failed to evaluate No PatientCalculation found on this PatientCalculationDataDefinition
25-Oct-2019 22:43:35         at org.openmrs.module.reporting.data.patient.evaluator.PatientCalculationDataEvaluator.evaluate(PatientCalculationDataEvaluator.java:50)
25-Oct-2019 22:43:35         at org.openmrs.module.reporting.data.patient.evaluator.PatientCalculationDataEvaluator.evaluate(PatientCalculationDataEvaluator.java:34)
25-Oct-2019 22:43:35         at org.openmrs.module.reporting.definition.service.BaseDefinitionService.executeEvaluator(BaseDefinitionService.java:369)
25-Oct-2019 22:43:35         at org.openmrs.module.reporting.data.patient.service.PatientDataServiceImpl.executeEvaluator(PatientDataServiceImpl.java:66)
25-Oct-2019 22:43:35         at org.openmrs.module.reporting.data.patient.service.PatientDataServiceImpl.executeEvaluator(PatientDataServiceImpl.java:34)
25-Oct-2019 22:43:35         at org.openmrs.module.reporting.definition.service.BaseDefinitionService.evaluateBypassingExclusionOfTestPatients(BaseDefinitionService.java:264)
25-Oct-2019 22:43:35         at org.openmrs.module.reporting.definition.service.BaseDefinitionService.evaluate(BaseDefinitionService.java:229)
25-Oct-2019 22:43:35         at org.openmrs.module.reporting.data.patient.service.PatientDataServiceImpl.evaluate(PatientDataServiceImpl.java:48)
25-Oct-2019 22:43:35         at sun.reflect.GeneratedMethodAccessor776.invoke(Unknown Source)
25-Oct-2019 22:43:35         at sun.reflect.DelegatingMethodAccessorImpl.invoke(DelegatingMethodAccessorImpl.java:43)
25-Oct-2019 22:43:35         at java.lang.reflect.Method.invoke(Method.java:498)
25-Oct-2019 22:43:35         at org.springframework.aop.support.AopUtils.invokeJoinpointUsingReflection(AopUtils.java:317)
25-Oct-2019 22:43:35         at org.springframework.aop.framework.ReflectiveMethodInvocation.invokeJoinpoint(ReflectiveMethodInvocation.java:183)
25-Oct-2019 22:43:35         at org.springframework.aop.framework.ReflectiveMethodInvocation.proceed(ReflectiveMethodInvocation.java:150)
25-Oct-2019 22:43:35         at org.openmrs.aop.LoggingAdvice.invoke(LoggingAdvice.java:121)
25-Oct-2019 22:43:35         at org.springframework.aop.framework.ReflectiveMethodInvocation.proceed(ReflectiveMethodInvocation.java:172)
25-Oct-2019 22:43:35         at org.springframework.aop.framework.adapter.MethodBeforeAdviceInterceptor.invoke(MethodBeforeAdviceInterceptor.java:51)
25-Oct-2019 22:43:35         at org.springframework.aop.framework.ReflectiveMethodInvocation.proceed(ReflectiveMethodInvocation.java:172)
25-Oct-2019 22:43:35         at org.springframework.aop.framework.adapter.MethodBeforeAdviceInterceptor.invoke(MethodBeforeAdviceInterceptor.java:51)
25-Oct-2019 22:43:35         at org.springframework.aop.framework.ReflectiveMethodInvocation.proceed(ReflectiveMethodInvocation.java:172)
25-Oct-2019 22:43:35         at org.springframework.aop.framework.JdkDynamicAopProxy.invoke(JdkDynamicAopProxy.java:204)
25-Oct-2019 22:43:35         at com.sun.proxy.$Proxy29.evaluate(Unknown Source)
25-Oct-2019 22:43:35         at sun.reflect.GeneratedMethodAccessor776.invoke(Unknown Source)
25-Oct-2019 22:43:35         at sun.reflect.DelegatingMethodAccessorImpl.invoke(DelegatingMethodAccessorImpl.java:43)
25-Oct-2019 22:43:35         at java.lang.reflect.Method.invoke(Method.java:498)
25-Oct-2019 22:43:35         at org.springframework.aop.support.AopUtils.invokeJoinpointUsingReflection(AopUtils.java:317)
25-Oct-2019 22:43:35         at org.springframework.aop.framework.JdkDynamicAopProxy.invoke(JdkDynamicAopProxy.java:198)
25-Oct-2019 22:43:35         at com.sun.proxy.$Proxy149.evaluate(Unknown Source)
25-Oct-2019 22:43:35         at org.openmrs.module.reporting.data.patient.evaluator.PatientCalculationDataEvaluatorTest.evaluate_shouldThrowAnErrorIfNoCalculationRegistrationExistsOnTheDefinition(PatientCalculationDataEvaluatorTest.java:90)
25-Oct-2019 22:43:35         at sun.reflect.NativeMethodAccessorImpl.invoke0(Native Method)
25-Oct-2019 22:43:35         at sun.reflect.NativeMethodAccessorImpl.invoke(NativeMethodAccessorImpl.java:62)
25-Oct-2019 22:43:35         at sun.reflect.DelegatingMethodAccessorImpl.invoke(DelegatingMethodAccessorImpl.java:43)
25-Oct-2019 22:43:35         at java.lang.reflect.Method.invoke(Method.java:498)
25-Oct-2019 22:43:35         at org.junit.runners.model.FrameworkMethod$1.runReflectiveCall(FrameworkMethod.java:47)
25-Oct-2019 22:43:35         at org.junit.internal.runners.model.ReflectiveCallable.run(ReflectiveCallable.java:12)
25-Oct-2019 22:43:35         at org.junit.runners.model.FrameworkMethod.invokeExplosively(FrameworkMethod.java:44)
25-Oct-2019 22:43:35         at org.junit.internal.runners.statements.InvokeMethod.evaluate(InvokeMethod.java:17)
25-Oct-2019 22:43:35         at org.junit.internal.runners.statements.ExpectException.evaluate(ExpectException.java:19)
25-Oct-2019 22:43:35         at org.junit.internal.runners.statements.RunBefores.evaluate(RunBefores.java:26)
25-Oct-2019 22:43:35         at org.springframework.test.context.junit4.statements.RunBeforeTestMethodCallbacks.evaluate(RunBeforeTestMethodCallbacks.java:74)
25-Oct-2019 22:43:35         at org.junit.internal.runners.statements.RunAfters.evaluate(RunAfters.java:27)
25-Oct-2019 22:43:35         at org.springframework.test.context.junit4.statements.RunAfterTestMethodCallbacks.evaluate(RunAfterTestMethodCallbacks.java:83)
25-Oct-2019 22:43:35         at org.springframework.test.context.junit4.statements.SpringRepeat.evaluate(SpringRepeat.java:72)
25-Oct-2019 22:43:35         at org.springframework.test.context.junit4.SpringJUnit4ClassRunner.runChild(SpringJUnit4ClassRunner.java:231)
25-Oct-2019 22:43:35         at org.springframework.test.context.junit4.SpringJUnit4ClassRunner.runChild(SpringJUnit4ClassRunner.java:88)
25-Oct-2019 22:43:35         at org.junit.runners.ParentRunner$3.run(ParentRunner.java:238)
25-Oct-2019 22:43:35         at org.junit.runners.ParentRunner$1.schedule(ParentRunner.java:63)
25-Oct-2019 22:43:35         at org.junit.runners.ParentRunner.runChildren(ParentRunner.java:236)
25-Oct-2019 22:43:35         at org.junit.runners.ParentRunner.access$000(ParentRunner.java:53)
25-Oct-2019 22:43:35         at org.junit.runners.ParentRunner$2.evaluate(ParentRunner.java:229)
25-Oct-2019 22:43:35         at org.springframework.test.context.junit4.statements.RunBeforeTestClassCallbacks.evaluate(RunBeforeTestClassCallbacks.java:61)
25-Oct-2019 22:43:35         at org.junit.internal.runners.statements.RunAfters.evaluate(RunAfters.java:27)
25-Oct-2019 22:43:35         at org.springframework.test.context.junit4.statements.RunAfterTestClassCallbacks.evaluate(RunAfterTestClassCallbacks.java:71)
25-Oct-2019 22:43:35         at org.junit.runners.ParentRunner.run(ParentRunner.java:309)
25-Oct-2019 22:43:35         at org.springframework.test.context.junit4.SpringJUnit4ClassRunner.run(SpringJUnit4ClassRunner.java:174)
25-Oct-2019 22:43:35         at org.apache.maven.surefire.junit4.JUnit4TestSet.execute(JUnit4TestSet.java:59)
25-Oct-2019 22:43:35         at org.apache.maven.surefire.suite.AbstractDirectoryTestSuite.executeTestSet(AbstractDirectoryTestSuite.java:115)
25-Oct-2019 22:43:35         at org.apache.maven.surefire.suite.AbstractDirectoryTestSuite.execute(AbstractDirectoryTestSuite.java:102)
25-Oct-2019 22:43:35         at org.apache.maven.surefire.Surefire.run(Surefire.java:180)
25-Oct-2019 22:43:35         at sun.reflect.NativeMethodAccessorImpl.invoke0(Native Method)
25-Oct-2019 22:43:35         at sun.reflect.NativeMethodAccessorImpl.invoke(NativeMethodAccessorImpl.java:62)
25-Oct-2019 22:43:35         at sun.reflect.DelegatingMethodAccessorImpl.invoke(DelegatingMethodAccessorImpl.java:43)
25-Oct-2019 22:43:35         at java.lang.reflect.Method.invoke(Method.java:498)
25-Oct-2019 22:43:35         at org.apache.maven.surefire.booter.SurefireBooter.runSuitesInProcess(SurefireBooter.java:350)
25-Oct-2019 22:43:35         at org.apache.maven.surefire.booter.SurefireBooter.main(SurefireBooter.java:1021)
25-Oct-2019 22:43:35 Tests run: 2, Failures: 0, Errors: 0, Skipped: 0, Time elapsed: 0.26 sec
25-Oct-2019 22:43:35 Running org.openmrs.module.reporting.data.converter.DateConverterTest
25-Oct-2019 22:43:35 Tests run: 1, Failures: 0, Errors: 0, Skipped: 0, Time elapsed: 0.003 sec
25-Oct-2019 22:43:35 Running org.openmrs.module.reporting.dataset.definition.evaluator.EncounterAndObsDataSetEvaluatorTest
25-Oct-2019 22:43:35 Tests run: 1, Failures: 0, Errors: 0, Skipped: 0, Time elapsed: 0.175 sec
25-Oct-2019 22:43:35 Running org.openmrs.module.reporting.data.encounter.evaluator.PatientToEncounterDataEvaluatorTest
25-Oct-2019 22:43:35 Tests run: 3, Failures: 0, Errors: 0, Skipped: 0, Time elapsed: 0.303 sec
25-Oct-2019 22:43:35 Running org.openmrs.module.reporting.data.patient.evaluator.PatientIdDataEvaluatorTest
25-Oct-2019 22:43:36 Tests run: 1, Failures: 0, Errors: 0, Skipped: 0, Time elapsed: 0.103 sec
25-Oct-2019 22:43:36 Running org.openmrs.module.reporting.data.person.evaluator.RelationshipsForPersonDataEvaluatorTest
25-Oct-2019 22:43:36 Tests run: 3, Failures: 0, Errors: 0, Skipped: 0, Time elapsed: 0.323 sec
25-Oct-2019 22:43:36 Running org.openmrs.module.reporting.data.patient.evaluator.PersonToPatientDataEvaluatorTest
25-Oct-2019 22:43:36 Tests run: 1, Failures: 0, Errors: 0, Skipped: 0, Time elapsed: 0.117 sec
25-Oct-2019 22:43:36 Running org.openmrs.module.reporting.data.patient.service.PatientDataServiceImplTest
25-Oct-2019 22:43:37 Tests run: 6, Failures: 0, Errors: 0, Skipped: 0, Time elapsed: 0.677 sec
25-Oct-2019 22:43:37
25-Oct-2019 22:43:37 Results :
25-Oct-2019 22:43:37
25-Oct-2019 22:43:37 Tests run: 723, Failures: 0, Errors: 0, Skipped: 13
25-Oct-2019 22:43:37
25-Oct-2019 22:43:37 [INFO]
25-Oct-2019 22:43:37 [INFO] --- maven-jar-plugin:2.4:jar (default-jar) @ reporting-api-tests ---
25-Oct-2019 22:43:37 [WARNING] JAR will be empty - no content was marked for inclusion!
25-Oct-2019 22:43:37 [INFO] Building jar: /home/bamboo-agent/bamboo-agent/xml-data/build-dir/REP-REP-T1DOT11/api-tests/target/reporting-api-tests-1.19.0-SNAPSHOT.jar
25-Oct-2019 22:43:37 [INFO]
25-Oct-2019 22:43:37 [INFO] --- maven-jar-plugin:2.4:test-jar (default) @ reporting-api-tests ---
25-Oct-2019 22:43:37 [INFO] Building jar: /home/bamboo-agent/bamboo-agent/xml-data/build-dir/REP-REP-T1DOT11/api-tests/target/reporting-api-tests-1.19.0-SNAPSHOT-tests.jar
25-Oct-2019 22:43:37 [INFO]                                                                         
25-Oct-2019 22:43:37 [INFO] ------------------------------------------------------------------------
25-Oct-2019 22:43:37 [INFO] Building reporting Module api 1.10 1.19.0-SNAPSHOT
25-Oct-2019 22:43:37 [INFO] ------------------------------------------------------------------------
25-Oct-2019 22:43:37 [INFO]
25-Oct-2019 22:43:37 [INFO] --- maven-clean-plugin:2.5:clean (default-clean) @ reporting-api-1.10 ---
25-Oct-2019 22:43:37 [INFO]
25-Oct-2019 22:43:37 [INFO] --- maven-resources-plugin:2.6:resources (default-resources) @ reporting-api-1.10 ---
25-Oct-2019 22:43:37 [INFO] Using 'UTF-8' encoding to copy filtered resources.
25-Oct-2019 22:43:37 [INFO] skip non existing resourceDirectory /home/bamboo-agent/bamboo-agent/xml-data/build-dir/REP-REP-T1DOT11/api-1.10/src/main/resources
25-Oct-2019 22:43:37 [INFO]
25-Oct-2019 22:43:37 [INFO] --- maven-compiler-plugin:3.1:compile (default-compile) @ reporting-api-1.10 ---
25-Oct-2019 22:43:37 [INFO] Changes detected - recompiling the module!
25-Oct-2019 22:43:37 [INFO] Compiling 3 source files to /home/bamboo-agent/bamboo-agent/xml-data/build-dir/REP-REP-T1DOT11/api-1.10/target/classes
25-Oct-2019 22:43:37 [INFO]
25-Oct-2019 22:43:37 [INFO] --- build-helper-maven-plugin:1.7:parse-version (default) @ reporting-api-1.10 ---
25-Oct-2019 22:43:37 [INFO]
25-Oct-2019 22:43:37 [INFO] --- maven-resources-plugin:2.6:testResources (default-testResources) @ reporting-api-1.10 ---
25-Oct-2019 22:43:37 [INFO] Using 'UTF-8' encoding to copy filtered resources.
25-Oct-2019 22:43:37 [INFO] Copying 1 resource
25-Oct-2019 22:43:37 [INFO] Copying 0 resource
25-Oct-2019 22:43:37 [INFO]
25-Oct-2019 22:43:37 [INFO] --- maven-compiler-plugin:3.1:testCompile (default-testCompile) @ reporting-api-1.10 ---
25-Oct-2019 22:43:37 [INFO] Changes detected - recompiling the module!
25-Oct-2019 22:43:37 [INFO] Compiling 2 source files to /home/bamboo-agent/bamboo-agent/xml-data/build-dir/REP-REP-T1DOT11/api-1.10/target/test-classes
25-Oct-2019 22:43:37 [WARNING] /home/bamboo-agent/bamboo-agent/xml-data/build-dir/REP-REP-T1DOT11/api-1.10/src/test/java/org/openmrs/module/reporting/cohort/definition/evaluator/DrugOrderCohortDefinitionEvaluatorTest.java: /home/bamboo-agent/bamboo-agent/xml-data/build-dir/REP-REP-T1DOT11/api-1.10/src/test/java/org/openmrs/module/reporting/cohort/definition/evaluator/DrugOrderCohortDefinitionEvaluatorTest.java uses or overrides a deprecated API.
25-Oct-2019 22:43:37 [WARNING] /home/bamboo-agent/bamboo-agent/xml-data/build-dir/REP-REP-T1DOT11/api-1.10/src/test/java/org/openmrs/module/reporting/cohort/definition/evaluator/DrugOrderCohortDefinitionEvaluatorTest.java: Recompile with -Xlint:deprecation for details.
25-Oct-2019 22:43:37 [WARNING] /home/bamboo-agent/bamboo-agent/xml-data/build-dir/REP-REP-T1DOT11/api-1.10/src/test/java/org/openmrs/module/reporting/cohort/definition/evaluator/DrugOrderCohortDefinitionEvaluatorTest.java: /home/bamboo-agent/bamboo-agent/xml-data/build-dir/REP-REP-T1DOT11/api-1.10/src/test/java/org/openmrs/module/reporting/cohort/definition/evaluator/DrugOrderCohortDefinitionEvaluatorTest.java uses unchecked or unsafe operations.
25-Oct-2019 22:43:37 [WARNING] /home/bamboo-agent/bamboo-agent/xml-data/build-dir/REP-REP-T1DOT11/api-1.10/src/test/java/org/openmrs/module/reporting/cohort/definition/evaluator/DrugOrderCohortDefinitionEvaluatorTest.java: Recompile with -Xlint:unchecked for details.
25-Oct-2019 22:43:37 [INFO]
25-Oct-2019 22:43:37 [INFO] --- maven-surefire-plugin:2.5:test (default-test) @ reporting-api-1.10 ---
25-Oct-2019 22:43:37 [INFO] Surefire report directory: /home/bamboo-agent/bamboo-agent/xml-data/build-dir/REP-REP-T1DOT11/api-1.10/target/surefire-reports
25-Oct-2019 22:43:37 OpenJDK 64-Bit Server VM warning: ignoring option MaxPermSize=512m; support was removed in 8.0
25-Oct-2019 22:43:38
25-Oct-2019 22:43:38 -------------------------------------------------------
25-Oct-2019 22:43:38 T E S T S
25-Oct-2019 22:43:38 -------------------------------------------------------
25-Oct-2019 22:43:38 Running org.openmrs.module.reporting.cohort.definition.evaluator.DrugOrderCohortDefinitionEvaluatorTest
25-Oct-2019 22:43:38 log4j:WARN No appenders could be found for logger (org.springframework.test.context.junit4.SpringJUnit4ClassRunner).
25-Oct-2019 22:43:38 log4j:WARN Please initialize the log4j system properly.
25-Oct-2019 22:43:56 Tests run: 18, Failures: 0, Errors: 0, Skipped: 0, Time elapsed: 18.149 sec
25-Oct-2019 22:43:56 Running org.openmrs.module.reporting.cohort.definition.library.BuiltInCohortDefinitionLibrary1_10Test
25-Oct-2019 22:43:56 Tests run: 1, Failures: 0, Errors: 0, Skipped: 0, Time elapsed: 0.015 sec
25-Oct-2019 22:43:56
25-Oct-2019 22:43:56 Results :
25-Oct-2019 22:43:56
25-Oct-2019 22:43:56 Tests run: 19, Failures: 0, Errors: 0, Skipped: 0
25-Oct-2019 22:43:56
25-Oct-2019 22:43:56 [INFO]
25-Oct-2019 22:43:56 [INFO] --- maven-jar-plugin:2.4:jar (default-jar) @ reporting-api-1.10 ---
25-Oct-2019 22:43:56 [INFO] Building jar: /home/bamboo-agent/bamboo-agent/xml-data/build-dir/REP-REP-T1DOT11/api-1.10/target/reporting-api-1.10-1.19.0-SNAPSHOT.jar
25-Oct-2019 22:43:56 [INFO]
25-Oct-2019 22:43:56 [INFO] --- maven-jar-plugin:2.4:test-jar (default) @ reporting-api-1.10 ---
25-Oct-2019 22:43:56 [INFO] Building jar: /home/bamboo-agent/bamboo-agent/xml-data/build-dir/REP-REP-T1DOT11/api-1.10/target/reporting-api-1.10-1.19.0-SNAPSHOT-tests.jar
25-Oct-2019 22:43:56 [INFO]                                                                         
25-Oct-2019 22:43:56 [INFO] ------------------------------------------------------------------------
25-Oct-2019 22:43:56 [INFO] Building reporting Module api 2.0 1.19.0-SNAPSHOT
25-Oct-2019 22:43:56 [INFO] ------------------------------------------------------------------------
25-Oct-2019 22:43:56 [INFO]
25-Oct-2019 22:43:56 [INFO] --- maven-clean-plugin:2.5:clean (default-clean) @ reporting-api-2.0 ---
25-Oct-2019 22:43:56 [INFO]
25-Oct-2019 22:43:56 [INFO] --- maven-resources-plugin:2.6:resources (default-resources) @ reporting-api-2.0 ---
25-Oct-2019 22:43:56 [INFO] Using 'UTF-8' encoding to copy filtered resources.
25-Oct-2019 22:43:56 [INFO] skip non existing resourceDirectory /home/bamboo-agent/bamboo-agent/xml-data/build-dir/REP-REP-T1DOT11/api-2.0/src/main/resources
25-Oct-2019 22:43:56 [INFO]
25-Oct-2019 22:43:56 [INFO] --- maven-compiler-plugin:3.1:compile (default-compile) @ reporting-api-2.0 ---
25-Oct-2019 22:43:56 [INFO] Changes detected - recompiling the module!
25-Oct-2019 22:43:56 [INFO] Compiling 4 source files to /home/bamboo-agent/bamboo-agent/xml-data/build-dir/REP-REP-T1DOT11/api-2.0/target/classes
25-Oct-2019 22:43:57 [INFO]
25-Oct-2019 22:43:57 [INFO] --- build-helper-maven-plugin:1.7:parse-version (default) @ reporting-api-2.0 ---
25-Oct-2019 22:43:57 [INFO]
25-Oct-2019 22:43:57 [INFO] --- maven-resources-plugin:2.6:testResources (default-testResources) @ reporting-api-2.0 ---
25-Oct-2019 22:43:57 [INFO] Using 'UTF-8' encoding to copy filtered resources.
25-Oct-2019 22:43:57 [INFO] skip non existing resourceDirectory /home/bamboo-agent/bamboo-agent/xml-data/build-dir/REP-REP-T1DOT11/api-2.0/src/test/resources
25-Oct-2019 22:43:57 [INFO] skip non existing resourceDirectory /home/bamboo-agent/bamboo-agent/xml-data/build-dir/REP-REP-T1DOT11/api-2.0/src/test/resources
25-Oct-2019 22:43:57 [INFO]
25-Oct-2019 22:43:57 [INFO] --- maven-compiler-plugin:3.1:testCompile (default-testCompile) @ reporting-api-2.0 ---
25-Oct-2019 22:43:57 [INFO] No sources to compile
25-Oct-2019 22:43:57 [INFO]
25-Oct-2019 22:43:57 [INFO] --- maven-surefire-plugin:2.5:test (default-test) @ reporting-api-2.0 ---
25-Oct-2019 22:43:57 [INFO] No tests to run.
25-Oct-2019 22:43:57 [INFO]
25-Oct-2019 22:43:57 [INFO] --- maven-jar-plugin:2.4:jar (default-jar) @ reporting-api-2.0 ---
25-Oct-2019 22:43:57 [INFO] Building jar: /home/bamboo-agent/bamboo-agent/xml-data/build-dir/REP-REP-T1DOT11/api-2.0/target/reporting-api-2.0-1.19.0-SNAPSHOT.jar
25-Oct-2019 22:43:57 [INFO]
25-Oct-2019 22:43:57 [INFO] --- maven-jar-plugin:2.4:test-jar (default) @ reporting-api-2.0 ---
25-Oct-2019 22:43:57 [WARNING] JAR will be empty - no content was marked for inclusion!
25-Oct-2019 22:43:57 [INFO] Building jar: /home/bamboo-agent/bamboo-agent/xml-data/build-dir/REP-REP-T1DOT11/api-2.0/target/reporting-api-2.0-1.19.0-SNAPSHOT-tests.jar
25-Oct-2019 22:43:57 [INFO]                                                                         
25-Oct-2019 22:43:57 [INFO] ------------------------------------------------------------------------
25-Oct-2019 22:43:57 [INFO] Building reporting Module api 2.2 1.19.0-SNAPSHOT
25-Oct-2019 22:43:57 [INFO] ------------------------------------------------------------------------
25-Oct-2019 22:43:57 [INFO]
25-Oct-2019 22:43:57 [INFO] --- maven-clean-plugin:2.5:clean (default-clean) @ reporting-api-2.2 ---
25-Oct-2019 22:43:57 [INFO]
25-Oct-2019 22:43:57 [INFO] --- maven-resources-plugin:2.6:resources (default-resources) @ reporting-api-2.2 ---
25-Oct-2019 22:43:57 [INFO] Using 'UTF-8' encoding to copy filtered resources.
25-Oct-2019 22:43:57 [INFO] skip non existing resourceDirectory /home/bamboo-agent/bamboo-agent/xml-data/build-dir/REP-REP-T1DOT11/api-2.2/src/main/resources
25-Oct-2019 22:43:57 [INFO]
25-Oct-2019 22:43:57 [INFO] --- maven-compiler-plugin:3.1:compile (default-compile) @ reporting-api-2.2 ---
25-Oct-2019 22:43:57 [INFO] Changes detected - recompiling the module!
25-Oct-2019 22:43:57 [INFO] Compiling 3 source files to /home/bamboo-agent/bamboo-agent/xml-data/build-dir/REP-REP-T1DOT11/api-2.2/target/classes
25-Oct-2019 22:43:57 [INFO]
25-Oct-2019 22:43:57 [INFO] --- build-helper-maven-plugin:1.7:parse-version (default) @ reporting-api-2.2 ---
25-Oct-2019 22:43:57 [INFO]
25-Oct-2019 22:43:57 [INFO] --- maven-resources-plugin:2.6:testResources (default-testResources) @ reporting-api-2.2 ---
25-Oct-2019 22:43:57 [INFO] Using 'UTF-8' encoding to copy filtered resources.
25-Oct-2019 22:43:57 [INFO] Copying 1 resource
25-Oct-2019 22:43:57 [INFO] Copying 0 resource
25-Oct-2019 22:43:57 [INFO]
25-Oct-2019 22:43:57 [INFO] --- maven-compiler-plugin:3.1:testCompile (default-testCompile) @ reporting-api-2.2 ---
25-Oct-2019 22:43:57 [INFO] Changes detected - recompiling the module!
25-Oct-2019 22:43:57 [INFO] Compiling 2 source files to /home/bamboo-agent/bamboo-agent/xml-data/build-dir/REP-REP-T1DOT11/api-2.2/target/test-classes
25-Oct-2019 22:43:57 [INFO]
25-Oct-2019 22:43:57 [INFO] --- maven-surefire-plugin:2.5:test (default-test) @ reporting-api-2.2 ---
25-Oct-2019 22:43:57 [INFO] Surefire report directory: /home/bamboo-agent/bamboo-agent/xml-data/build-dir/REP-REP-T1DOT11/api-2.2/target/surefire-reports
25-Oct-2019 22:43:57 OpenJDK 64-Bit Server VM warning: ignoring option MaxPermSize=512m; support was removed in 8.0
25-Oct-2019 22:43:58
25-Oct-2019 22:43:58 -------------------------------------------------------
25-Oct-2019 22:43:58 T E S T S
25-Oct-2019 22:43:58 -------------------------------------------------------
25-Oct-2019 22:43:58 Running org.openmrs.module.reporting.cohort.definition.evaluator.ConditionCohortDefinitionEvaluatorTest
25-Oct-2019 22:43:58 log4j:WARN No appenders could be found for logger (org.springframework.test.context.junit4.SpringJUnit4ClassRunner).
25-Oct-2019 22:43:58 log4j:WARN Please initialize the log4j system properly.
25-Oct-2019 22:44:15 Tests run: 12, Failures: 0, Errors: 0, Skipped: 0, Time elapsed: 17.618 sec
25-Oct-2019 22:44:15 Running org.openmrs.module.reporting.cohort.definition.library.BuiltInCohortDefinitionLibrary2_2Test
25-Oct-2019 22:44:15 Tests run: 1, Failures: 0, Errors: 0, Skipped: 0, Time elapsed: 0.008 sec
25-Oct-2019 22:44:15
25-Oct-2019 22:44:15 Results :
25-Oct-2019 22:44:15
25-Oct-2019 22:44:15 Tests run: 13, Failures: 0, Errors: 0, Skipped: 0
25-Oct-2019 22:44:15
25-Oct-2019 22:44:15 [INFO]
25-Oct-2019 22:44:15 [INFO] --- maven-jar-plugin:2.4:jar (default-jar) @ reporting-api-2.2 ---
25-Oct-2019 22:44:15 [INFO] Building jar: /home/bamboo-agent/bamboo-agent/xml-data/build-dir/REP-REP-T1DOT11/api-2.2/target/reporting-api-2.2-1.19.0-SNAPSHOT.jar
25-Oct-2019 22:44:15 [INFO]
25-Oct-2019 22:44:15 [INFO] --- maven-jar-plugin:2.4:test-jar (default) @ reporting-api-2.2 ---
25-Oct-2019 22:44:15 [INFO] Building jar: /home/bamboo-agent/bamboo-agent/xml-data/build-dir/REP-REP-T1DOT11/api-2.2/target/reporting-api-2.2-1.19.0-SNAPSHOT-tests.jar
25-Oct-2019 22:44:15 [INFO]                                                                         
25-Oct-2019 22:44:15 [INFO] ------------------------------------------------------------------------
25-Oct-2019 22:44:15 [INFO] Building Reporting OMOD 1.19.0-SNAPSHOT
25-Oct-2019 22:44:15 [INFO] ------------------------------------------------------------------------
25-Oct-2019 22:44:15 [INFO]
25-Oct-2019 22:44:15 [INFO] --- maven-clean-plugin:2.5:clean (default-clean) @ reporting-omod ---
25-Oct-2019 22:44:15 [INFO]
25-Oct-2019 22:44:15 [INFO] --- maven-openmrs-plugin:1.0.1:initialize-module (init) @ reporting-omod ---
25-Oct-2019 22:44:15 [INFO]
25-Oct-2019 22:44:15 [INFO] --- maven-dependency-plugin:2.8:unpack-dependencies (Expand resources) @ reporting-omod ---
25-Oct-2019 22:44:16 [INFO] Unpacking /home/bamboo-agent/bamboo-agent/xml-data/build-dir/REP-REP-T1DOT11/api/target/reporting-api-1.19.0-SNAPSHOT.jar to /home/bamboo-agent/bamboo-agent/xml-data/build-dir/REP-REP-T1DOT11/omod/target/classes with includes "**\/*.xml,**\/*.properties" and excludes ""
25-Oct-2019 22:44:16 [INFO]
25-Oct-2019 22:44:16 [INFO] --- maven-resources-plugin:2.6:resources (default-resources) @ reporting-omod ---
25-Oct-2019 22:44:16 [INFO] Using 'UTF-8' encoding to copy filtered resources.
25-Oct-2019 22:44:16 [INFO] Copying 0 resource
25-Oct-2019 22:44:16 [INFO] Copying 2 resources
25-Oct-2019 22:44:16 [INFO] Copying 224 resources to web/module
25-Oct-2019 22:44:16 [INFO] Copying 224 resources to web/module
25-Oct-2019 22:44:16 [INFO]
25-Oct-2019 22:44:16 [INFO] --- maven-compiler-plugin:3.1:compile (default-compile) @ reporting-omod ---
25-Oct-2019 22:44:16 [INFO] Changes detected - recompiling the module!
25-Oct-2019 22:44:16 [INFO] Compiling 113 source files to /home/bamboo-agent/bamboo-agent/xml-data/build-dir/REP-REP-T1DOT11/omod/target/classes
25-Oct-2019 22:44:17 [WARNING] /home/bamboo-agent/bamboo-agent/xml-data/build-dir/REP-REP-T1DOT11/omod/src/main/java/org/openmrs/module/reporting/web/datasets/LogicDataSetEditor.java: Some input files use or override a deprecated API.
25-Oct-2019 22:44:17 [WARNING] /home/bamboo-agent/bamboo-agent/xml-data/build-dir/REP-REP-T1DOT11/omod/src/main/java/org/openmrs/module/reporting/web/datasets/LogicDataSetEditor.java: Recompile with -Xlint:deprecation for details.
25-Oct-2019 22:44:17 [WARNING] /home/bamboo-agent/bamboo-agent/xml-data/build-dir/REP-REP-T1DOT11/omod/src/main/java/org/openmrs/module/reporting/web/controller/SqlDefinitionController.java: Some input files use unchecked or unsafe operations.
25-Oct-2019 22:44:17 [WARNING] /home/bamboo-agent/bamboo-agent/xml-data/build-dir/REP-REP-T1DOT11/omod/src/main/java/org/openmrs/module/reporting/web/controller/SqlDefinitionController.java: Recompile with -Xlint:unchecked for details.
25-Oct-2019 22:44:17 [INFO]
25-Oct-2019 22:44:17 [INFO] --- build-helper-maven-plugin:1.7:parse-version (default) @ reporting-omod ---
25-Oct-2019 22:44:17 [INFO]
25-Oct-2019 22:44:17 [INFO] --- maven-resources-plugin:2.6:testResources (default-testResources) @ reporting-omod ---
25-Oct-2019 22:44:17 [INFO] Using 'UTF-8' encoding to copy filtered resources.
25-Oct-2019 22:44:17 [INFO] skip non existing resourceDirectory /home/bamboo-agent/bamboo-agent/xml-data/build-dir/REP-REP-T1DOT11/omod/src/test/resources
25-Oct-2019 22:44:17 [INFO] skip non existing resourceDirectory /home/bamboo-agent/bamboo-agent/xml-data/build-dir/REP-REP-T1DOT11/omod/src/test/resources
25-Oct-2019 22:44:17 [INFO]
25-Oct-2019 22:44:17 [INFO] --- maven-compiler-plugin:3.1:testCompile (default-testCompile) @ reporting-omod ---
25-Oct-2019 22:44:17 [INFO] No sources to compile
25-Oct-2019 22:44:17 [INFO]
25-Oct-2019 22:44:17 [INFO] --- maven-surefire-plugin:2.5:test (default-test) @ reporting-omod ---
25-Oct-2019 22:44:17 [INFO] No tests to run.
25-Oct-2019 22:44:17 [INFO]
25-Oct-2019 22:44:17 [INFO] --- maven-jar-plugin:2.4:jar (default-jar) @ reporting-omod ---
25-Oct-2019 22:44:17 [INFO] Building jar: /home/bamboo-agent/bamboo-agent/xml-data/build-dir/REP-REP-T1DOT11/omod/target/reporting-1.19.0-SNAPSHOT.jar
25-Oct-2019 22:44:17 [INFO]
25-Oct-2019 22:44:17 [INFO] --- maven-openmrs-plugin:1.0.1:package-module (pack) @ reporting-omod ---
25-Oct-2019 22:44:17 [INFO] Packaging OpenMRS module
25-Oct-2019 22:44:17 [INFO] Building jar: /home/bamboo-agent/bamboo-agent/xml-data/build-dir/REP-REP-T1DOT11/omod/target/reporting-1.19.0-SNAPSHOT.omod
25-Oct-2019 22:44:18 [INFO]
25-Oct-2019 22:44:18 [INFO] --- maven-jar-plugin:2.4:test-jar (default) @ reporting-omod ---
25-Oct-2019 22:44:18 [WARNING] JAR will be empty - no content was marked for inclusion!
25-Oct-2019 22:44:18 [INFO] Building jar: /home/bamboo-agent/bamboo-agent/xml-data/build-dir/REP-REP-T1DOT11/omod/target/reporting-1.19.0-SNAPSHOT-tests.jar
25-Oct-2019 22:44:18 [INFO] ------------------------------------------------------------------------
25-Oct-2019 22:44:18 [INFO] Reactor Summary:
25-Oct-2019 22:44:18 [INFO]
25-Oct-2019 22:44:18 [INFO] Reporting .......................................... SUCCESS [  2.268 s]
25-Oct-2019 22:44:18 [INFO] Reporting API ...................................... SUCCESS [  6.070 s]
25-Oct-2019 22:44:18 [INFO] reporting Module api 1.9 ........................... SUCCESS [  1.194 s]
25-Oct-2019 22:44:18 [INFO] reporting API Tests ................................ SUCCESS [01:27 min]
25-Oct-2019 22:44:18 [INFO] reporting Module api 1.10 .......................... SUCCESS [ 18.985 s]
25-Oct-2019 22:44:18 [INFO] reporting Module api 2.0 ........................... SUCCESS [  0.814 s]
25-Oct-2019 22:44:18 [INFO] reporting Module api 2.2 ........................... SUCCESS [ 18.482 s]
25-Oct-2019 22:44:18 [INFO] Reporting OMOD ..................................... SUCCESS [  2.824 s]
25-Oct-2019 22:44:18 [INFO] ------------------------------------------------------------------------
25-Oct-2019 22:44:18 [INFO] BUILD SUCCESS
25-Oct-2019 22:44:18 [INFO] ------------------------------------------------------------------------
25-Oct-2019 22:44:18 [INFO] Total time: 02:18 min
25-Oct-2019 22:44:18 [INFO] Finished at: 2019-10-25T22:44:18+00:00
25-Oct-2019 22:44:19 [INFO] Final Memory: 64M/358M
25-Oct-2019 22:44:19 [INFO] ------------------------------------------------------------------------
25-Oct-2019 22:44:19 Parsing test results under /home/bamboo-agent/bamboo-agent/xml-data/build-dir/REP-REP-T1DOT11...
25-Oct-2019 22:44:19 Finished task 'Maven 3.x' with result: Success
25-Oct-2019 22:44:19 Running post build plugin 'Docker Container Cleanup'
25-Oct-2019 22:44:19 Running post build plugin 'NCover Results Collector'
25-Oct-2019 22:44:19 Running post build plugin 'Clover Results Collector'
25-Oct-2019 22:44:19 Running post build plugin 'Sauce OnDemand Post Runner'
25-Oct-2019 22:44:19 Running post build plugin 'npm Cache Cleanup'
25-Oct-2019 22:44:19 Running post build plugin 'Artifact Copier'
25-Oct-2019 22:44:19 Finalising the build...
25-Oct-2019 22:44:19 Stopping timer.
25-Oct-2019 22:44:19 Build REP-REP-T1DOT11-795 completed.
25-Oct-2019 22:44:19 Running on server: post build plugin 'NCover Results Collector'
25-Oct-2019 22:44:19 Running on server: post build plugin 'Build Hanging Detection Configuration'
25-Oct-2019 22:44:19 Running on server: post build plugin 'Clover Delta Calculator'
25-Oct-2019 22:44:19 Running on server: post build plugin 'Maven Dependencies Postprocessor'
25-Oct-2019 22:44:19 All post build plugins have finished
25-Oct-2019 22:44:19 Generating build results summary...
25-Oct-2019 22:44:20 Saving build results to disk...
25-Oct-2019 22:44:20 Logging substituted variables...
25-Oct-2019 22:44:20 Indexing build results...
25-Oct-2019 22:44:20 Finished building REP-REP-T1DOT11-795.